nixbot

builds

Enzime/hyperconfig build #947 failed

branch next · PR #1029 · commit db9619ca99 · · took 7m 10s · eval 31s

eval warnings 1 kind · 2 occurrences
  • warn A legacy Nextcloud install (from before NixOS 26.11) may be installed. ×2

2 failed ⚠ 1
failed attributes
status attribute duration
failed checks.x86_64-linux.nixos-phi-nixos
  • A legacy Nextcloud install (from before NixOS 26.11) may be installed. After nextcloud33 is installed successfully, you can safely upgrade to 34. The latest version available is Nextcloud35. Please note that Nextcloud doesn't support upgrades across multiple major versions (i.e. an upgrade from 16 is possible to 17, but not 16 to 18). The package can be upgraded by explicitly declaring the service-option `services.nextcloud.package`.
  • A legacy Nextcloud install (from before NixOS 26.11) may be installed. After nextcloud34 is installed successfully, you can safely upgrade to 35. The latest version available is Nextcloud35. Please note that Nextcloud doesn't support upgrades across multiple major versions (i.e. an upgrade from 16 is possible to 17, but not 16 to 18). The package can be upgraded by explicitly declaring the service-option `services.nextcloud.package`.
2m 50s
setup: don't know how to build these paths: /nix/store/v7m51y3rp7p6bgzgzy4qmz9x50wxirir-nixos-system-phi-nixos-26.11.20260922.b6c98e9.drv warning: ignoring th …
setup:
don't know how to build these paths:
  /nix/store/v7m51y3rp7p6bgzgzy4qmz9x50wxirir-nixos-system-phi-nixos-26.11.20260922.b6c98e9.drv
warning: ignoring the client-specified setting 'store', because it is a restricted setting and you are not a trusted user
a8cbafpj75r4mm9d4lzrx7rp6h7lk8vv-etc.drv: error: gRPC AddMultipleToStore on 'nix-store.geninf.io:50051' failed: error: niks3 push: creating pending closures: creating push: server returned 413: <html>
              <head><title>413 Request Entity Too Large</title></head>
              <body>
              <center><h1>413 Request Entity Too Large</h1></center>
              <hr><center>nginx</center>
              </body>
              </html>
              
error: dependency 'a8cbafpj75r4mm9d4lzrx7rp6h7lk8vv-etc.drv' failed
failed checks.x86_64-linux.nixos-sigma 2m 51s
setup: don't know how to build these paths: /nix/store/r34l7ifcgwi9cj7li5g34ncarzimq92b-nixos-system-sigma-26.11.20260922.b6c98e9.drv warning: ignoring the cl …
setup:
don't know how to build these paths:
  /nix/store/r34l7ifcgwi9cj7li5g34ncarzimq92b-nixos-system-sigma-26.11.20260922.b6c98e9.drv
warning: ignoring the client-specified setting 'store', because it is a restricted setting and you are not a trusted user
f5d043kn660xa8m8cj7w6gy4hnfhcpvg-etc-json.drv: error: gRPC AddMultipleToStore on 'nix-store.geninf.io:50051' failed: error: niks3 push: creating pending closures: creating push: server returned 413: <html>
              <head><title>413 Request Entity Too Large</title></head>
              <body>
              <center><h1>413 Request Entity Too Large</h1></center>
              <hr><center>nginx</center>
              </body>
              </html>
              
q1nhidvd7v58s9jii5jzs3wii5a41frj-etc.drv: error: gRPC AddMultipleToStore on 'nix-store.geninf.io:50051' failed: error: niks3 push: creating pending closures: creating push: server returned 413: <html>
              <head><title>413 Request Entity Too Large</title></head>
              <body>
              <center><h1>413 Request Entity Too Large</h1></center>
              <hr><center>nginx</center>
              </body>
              </html>
              
error: dependency 'bpvq08awvcg6iphl9pii8bxinnkka7yf-boot.json.drv' failed
18 succeeded
succeeded attributes
status attribute duration
loading…
39 already built
skipped attributes
status attribute duration
loading…