nixbot

builds

Enzime/hyperconfig build #948 failed

branch next · PR #1031 · commit 9fceeeae37 · · took 3m 47s · eval 46s

eval warnings 1 kind · 2 occurrences
  • warn A legacy Nextcloud install (from before NixOS 26.11) may be installed. ×2

2 failed ⚠ 1
failed attributes
status attribute duration
failed checks.x86_64-linux.nixos-phi-nixos
  • A legacy Nextcloud install (from before NixOS 26.11) may be installed. After nextcloud33 is installed successfully, you can safely upgrade to 34. The latest version available is Nextcloud35. Please note that Nextcloud doesn't support upgrades across multiple major versions (i.e. an upgrade from 16 is possible to 17, but not 16 to 18). The package can be upgraded by explicitly declaring the service-option `services.nextcloud.package`.
  • A legacy Nextcloud install (from before NixOS 26.11) may be installed. After nextcloud34 is installed successfully, you can safely upgrade to 35. The latest version available is Nextcloud35. Please note that Nextcloud doesn't support upgrades across multiple major versions (i.e. an upgrade from 16 is possible to 17, but not 16 to 18). The package can be upgraded by explicitly declaring the service-option `services.nextcloud.package`.
2m 41s
setup: don't know how to build these paths: /nix/store/hagdjh82vnmfd3bc4npk9wpyhvck6aq1-nixos-system-phi-nixos-26.11.20260925.7d5589b.drv warning: ignoring th …
setup:
don't know how to build these paths:
  /nix/store/hagdjh82vnmfd3bc4npk9wpyhvck6aq1-nixos-system-phi-nixos-26.11.20260925.7d5589b.drv
warning: ignoring the client-specified setting 'store', because it is a restricted setting and you are not a trusted user
4wszrv38lg3lxspkh72ayx98cf0cwjgq-home-configuration-reference-manpage.drv: gi-build-x86-02: not scheduled here: 4wszrv38lg3lxspkh72ayx98cf0cwjgq-home-configuration-reference-manpage.drv, asking the scheduler again
kkl84k9vdb806xrrgmkmlsmmw7mcbwk0-etc.drv: error: gRPC AddMultipleToStore on 'nix-store.geninf.io:50051' failed: error: niks3 push: creating pending closures: creating push: server returned 413: <html>
              <head><title>413 Request Entity Too Large</title></head>
              <body>
              <center><h1>413 Request Entity Too Large</h1></center>
              <hr><center>nginx</center>
              </body>
              </html>
              
error: dependency 'kkl84k9vdb806xrrgmkmlsmmw7mcbwk0-etc.drv' failed
failed checks.x86_64-linux.nixos-sigma 2m 44s
setup: don't know how to build these paths: /nix/store/b1wjxsmsbw7c4jiyhv4jcjq5qvrysvlb-nixos-system-sigma-26.11.20260925.7d5589b.drv warning: ignoring the cl …
setup:
don't know how to build these paths:
  /nix/store/b1wjxsmsbw7c4jiyhv4jcjq5qvrysvlb-nixos-system-sigma-26.11.20260925.7d5589b.drv
warning: ignoring the client-specified setting 'store', because it is a restricted setting and you are not a trusted user
j5k63gv7amxjk6ai5f04sx59wqq9vgn6-etc.drv: error: gRPC AddMultipleToStore on 'nix-store.geninf.io:50051' failed: error: niks3 push: creating pending closures: creating push: server returned 413: <html>
              <head><title>413 Request Entity Too Large</title></head>
              <body>
              <center><h1>413 Request Entity Too Large</h1></center>
              <hr><center>nginx</center>
              </body>
              </html>
              
vj12dcnz0ghlr8s89184xig2gmjlbkwf-etc-json.drv: error: gRPC AddMultipleToStore on 'nix-store.geninf.io:50051' failed: error: niks3 push: creating pending closures: creating push: server returned 413: <html>
              <head><title>413 Request Entity Too Large</title></head>
              <body>
              <center><h1>413 Request Entity Too Large</h1></center>
              <hr><center>nginx</center>
              </body>
              </html>
              
error: dependency 'j5k63gv7amxjk6ai5f04sx59wqq9vgn6-etc.drv' failed
36 succeeded
succeeded attributes
status attribute duration
loading…
21 already built
skipped attributes
status attribute duration
loading…