nixbot

builds

clan/clan-community build #187 failed

branch main · PR #196 · commit f7c30122e8 · · took 26m 57s · eval 26m 43s

eval warnings 4 kinds · 43 occurrences
  • error gRPC Connect on 'nix-store.geninf.io:50051' failed: role 'write' may not call Connect ×14
  • error ×14
  • error cannot open connection to remote store 'grpc://nix-store.geninf.io:50051': error: Nix daemon disconnected unexpectedly (maybe it crashed?) ×14
  • warn Dependency of package 'nix-unit' uses a nested list in attribute 'nativeBuildInputs'. ×1

14 failed
failed attributes
status attribute duration
failed eval checks.aarch64-linux.authelia —
error: … while evaluating the attribute 'drvPath' at «https://releases.nixos.org/nixpkgs/nixpkgs-26.11pre1078010.b6c98e9e6633/nixexprs.tar.xz?na …
error:
       … while evaluating the attribute 'drvPath'
         at «https://releases.nixos.org/nixpkgs/nixpkgs-26.11pre1078010.b6c98e9e6633/nixexprs.tar.xz?narHash=sha256-wQZif6Lyrg1IDl8k68Gwa3OK9PermeRsjdKgso4K1VA%3D»/lib/customisation.nix:416:11:
          415|         // {
          416|           drvPath =
             |           ^
          417|             assert condition;

       … while calling the 'derivationStrict' builtin
         at «nix-internal»/derivation-internal.nix:37:12:
           36|
           37|   strict = derivationStrict drvAttrs;
             |            ^
           38|

       … while evaluating the option `driverConfiguration.vlans':

       … while evaluating definitions from `/nix/store/b5yz03mfyd67drnilplad1drbxbkap1w-source/nixos/lib/testing/driver-configuration.nix':

       … while evaluating the option `containers.server.networking.interfaces':

       … while evaluating definitions from `/nix/store/b5yz03mfyd67drnilplad1drbxbkap1w-source/nixos/modules/hardware/facter/networking':

       … while evaluating the option `containers.server.hardware.facter.enable':

       … while evaluating the option `containers.server.hardware.facter.report':

       … while evaluating the option `containers.server.hardware.facter.reportPath':

       … while evaluating definitions from `/nix/store/dn3bgshfpnq8d2hb2zx8hn08pkiw0s36-source/nixosModules/clanCore/nixos-facter.nix':

       (stack trace truncated; use '--show-trace' to show the full, detailed trace)

       error: cannot open connection to remote store 'grpc://nix-store.geninf.io:50051': error: Nix daemon disconnected unexpectedly (maybe it crashed?)
failed eval checks.aarch64-linux.coredns —
error: … while evaluating the attribute 'drvPath' at «https://releases.nixos.org/nixpkgs/nixpkgs-26.11pre1078010.b6c98e9e6633/nixexprs.tar.xz?na …
error:
       … while evaluating the attribute 'drvPath'
         at «https://releases.nixos.org/nixpkgs/nixpkgs-26.11pre1078010.b6c98e9e6633/nixexprs.tar.xz?narHash=sha256-wQZif6Lyrg1IDl8k68Gwa3OK9PermeRsjdKgso4K1VA%3D»/lib/customisation.nix:416:11:
          415|         // {
          416|           drvPath =
             |           ^
          417|             assert condition;

       … while calling the 'derivationStrict' builtin
         at «nix-internal»/derivation-internal.nix:37:12:
           36|
           37|   strict = derivationStrict drvAttrs;
             |            ^
           38|

       … while evaluating the option `driverConfiguration.vlans':

       … while evaluating definitions from `/nix/store/b5yz03mfyd67drnilplad1drbxbkap1w-source/nixos/lib/testing/driver-configuration.nix':

       … while evaluating the option `containers.client.networking.interfaces':

       … while evaluating definitions from `/nix/store/b5yz03mfyd67drnilplad1drbxbkap1w-source/nixos/modules/hardware/facter/networking':

       … while evaluating the option `containers.client.hardware.facter.enable':

       … while evaluating the option `containers.client.hardware.facter.report':

       … while evaluating the option `containers.client.hardware.facter.reportPath':

       … while evaluating definitions from `/nix/store/dn3bgshfpnq8d2hb2zx8hn08pkiw0s36-source/nixosModules/clanCore/nixos-facter.nix':

       (stack trace truncated; use '--show-trace' to show the full, detailed trace)

       error: cannot open connection to remote store 'grpc://nix-store.geninf.io:50051': error: Nix daemon disconnected unexpectedly (maybe it crashed?)
failed eval checks.aarch64-linux.dm-wireguard-star —
error: … while evaluating the attribute 'drvPath' at «https://releases.nixos.org/nixpkgs/nixpkgs-26.11pre1078010.b6c98e9e6633/nixexprs.tar.xz?na …
error:
       … while evaluating the attribute 'drvPath'
         at «https://releases.nixos.org/nixpkgs/nixpkgs-26.11pre1078010.b6c98e9e6633/nixexprs.tar.xz?narHash=sha256-wQZif6Lyrg1IDl8k68Gwa3OK9PermeRsjdKgso4K1VA%3D»/lib/customisation.nix:416:11:
          415|         // {
          416|           drvPath =
             |           ^
          417|             assert condition;

       … while calling the 'derivationStrict' builtin
         at «nix-internal»/derivation-internal.nix:37:12:
           36|
           37|   strict = derivationStrict drvAttrs;
             |            ^
           38|

       … while evaluating the option `driverConfiguration.vlans':

       … while evaluating definitions from `/nix/store/b5yz03mfyd67drnilplad1drbxbkap1w-source/nixos/lib/testing/driver-configuration.nix':

       … while evaluating the option `containers.controller.networking.interfaces':

       … while evaluating definitions from `/nix/store/b5yz03mfyd67drnilplad1drbxbkap1w-source/nixos/modules/hardware/facter/networking':

       … while evaluating the option `containers.controller.hardware.facter.enable':

       … while evaluating the option `containers.controller.hardware.facter.report':

       … while evaluating the option `containers.controller.hardware.facter.reportPath':

       … while evaluating definitions from `/nix/store/dn3bgshfpnq8d2hb2zx8hn08pkiw0s36-source/nixosModules/clanCore/nixos-facter.nix':

       (stack trace truncated; use '--show-trace' to show the full, detailed trace)

       error: cannot open connection to remote store 'grpc://nix-store.geninf.io:50051': error: Nix daemon disconnected unexpectedly (maybe it crashed?)
failed eval checks.aarch64-linux.pocket-id —
error: … while evaluating the attribute 'drvPath' at «https://releases.nixos.org/nixpkgs/nixpkgs-26.11pre1078010.b6c98e9e6633/nixexprs.tar.xz?na …
error:
       … while evaluating the attribute 'drvPath'
         at «https://releases.nixos.org/nixpkgs/nixpkgs-26.11pre1078010.b6c98e9e6633/nixexprs.tar.xz?narHash=sha256-wQZif6Lyrg1IDl8k68Gwa3OK9PermeRsjdKgso4K1VA%3D»/lib/customisation.nix:416:11:
          415|         // {
          416|           drvPath =
             |           ^
          417|             assert condition;

       … while calling the 'derivationStrict' builtin
         at «nix-internal»/derivation-internal.nix:37:12:
           36|
           37|   strict = derivationStrict drvAttrs;
             |            ^
           38|

       … while evaluating the option `driverConfiguration.vlans':

       … while evaluating definitions from `/nix/store/b5yz03mfyd67drnilplad1drbxbkap1w-source/nixos/lib/testing/driver-configuration.nix':

       … while evaluating the option `containers.server.networking.interfaces':

       … while evaluating definitions from `/nix/store/b5yz03mfyd67drnilplad1drbxbkap1w-source/nixos/modules/hardware/facter/networking':

       … while evaluating the option `containers.server.hardware.facter.enable':

       … while evaluating the option `containers.server.hardware.facter.report':

       … while evaluating the option `containers.server.hardware.facter.reportPath':

       … while evaluating definitions from `/nix/store/dn3bgshfpnq8d2hb2zx8hn08pkiw0s36-source/nixosModules/clanCore/nixos-facter.nix':

       (stack trace truncated; use '--show-trace' to show the full, detailed trace)

       error: cannot open connection to remote store 'grpc://nix-store.geninf.io:50051': error: Nix daemon disconnected unexpectedly (maybe it crashed?)
failed eval checks.aarch64-linux.punchcard —
error: … while evaluating the attribute 'drvPath' at «https://releases.nixos.org/nixpkgs/nixpkgs-26.11pre1078010.b6c98e9e6633/nixexprs.tar.xz?na …
error:
       … while evaluating the attribute 'drvPath'
         at «https://releases.nixos.org/nixpkgs/nixpkgs-26.11pre1078010.b6c98e9e6633/nixexprs.tar.xz?narHash=sha256-wQZif6Lyrg1IDl8k68Gwa3OK9PermeRsjdKgso4K1VA%3D»/lib/customisation.nix:416:11:
          415|         // {
          416|           drvPath =
             |           ^
          417|             assert condition;

       … while calling the 'derivationStrict' builtin
         at «nix-internal»/derivation-internal.nix:37:12:
           36|
           37|   strict = derivationStrict drvAttrs;
             |            ^
           38|

       … while evaluating the option `driverConfiguration.vlans':

       … while evaluating definitions from `/nix/store/b5yz03mfyd67drnilplad1drbxbkap1w-source/nixos/lib/testing/driver-configuration.nix':

       … while evaluating the option `containers.server.networking.interfaces':

       … while evaluating definitions from `/nix/store/b5yz03mfyd67drnilplad1drbxbkap1w-source/nixos/modules/hardware/facter/networking':

       … while evaluating the option `containers.server.hardware.facter.enable':

       … while evaluating the option `containers.server.hardware.facter.report':

       … while evaluating the option `containers.server.hardware.facter.reportPath':

       … while evaluating definitions from `/nix/store/dn3bgshfpnq8d2hb2zx8hn08pkiw0s36-source/nixosModules/clanCore/nixos-facter.nix':

       (stack trace truncated; use '--show-trace' to show the full, detailed trace)

       error: cannot open connection to remote store 'grpc://nix-store.geninf.io:50051': error: Nix daemon disconnected unexpectedly (maybe it crashed?)
failed eval checks.aarch64-linux.webapps —
error: … while evaluating the attribute 'drvPath' at «https://releases.nixos.org/nixpkgs/nixpkgs-26.11pre1078010.b6c98e9e6633/nixexprs.tar.xz?na …
error:
       … while evaluating the attribute 'drvPath'
         at «https://releases.nixos.org/nixpkgs/nixpkgs-26.11pre1078010.b6c98e9e6633/nixexprs.tar.xz?narHash=sha256-wQZif6Lyrg1IDl8k68Gwa3OK9PermeRsjdKgso4K1VA%3D»/lib/customisation.nix:416:11:
          415|         // {
          416|           drvPath =
             |           ^
          417|             assert condition;

       … while calling the 'derivationStrict' builtin
         at «nix-internal»/derivation-internal.nix:37:12:
           36|
           37|   strict = derivationStrict drvAttrs;
             |            ^
           38|

       … while evaluating the option `driverConfiguration.vlans':

       … while evaluating definitions from `/nix/store/b5yz03mfyd67drnilplad1drbxbkap1w-source/nixos/lib/testing/driver-configuration.nix':

       … while evaluating the option `containers.server.networking.interfaces':

       … while evaluating definitions from `/nix/store/b5yz03mfyd67drnilplad1drbxbkap1w-source/nixos/modules/hardware/facter/networking':

       … while evaluating the option `containers.server.hardware.facter.enable':

       … while evaluating the option `containers.server.hardware.facter.report':

       … while evaluating the option `containers.server.hardware.facter.reportPath':

       … while evaluating definitions from `/nix/store/dn3bgshfpnq8d2hb2zx8hn08pkiw0s36-source/nixosModules/clanCore/nixos-facter.nix':

       (stack trace truncated; use '--show-trace' to show the full, detailed trace)

       error: cannot open connection to remote store 'grpc://nix-store.geninf.io:50051': error: Nix daemon disconnected unexpectedly (maybe it crashed?)
failed eval checks.aarch64-linux.wifi —
error: … while evaluating the attribute 'drvPath' at «https://releases.nixos.org/nixpkgs/nixpkgs-26.11pre1078010.b6c98e9e6633/nixexprs.tar.xz?na …
error:
       … while evaluating the attribute 'drvPath'
         at «https://releases.nixos.org/nixpkgs/nixpkgs-26.11pre1078010.b6c98e9e6633/nixexprs.tar.xz?narHash=sha256-wQZif6Lyrg1IDl8k68Gwa3OK9PermeRsjdKgso4K1VA%3D»/lib/customisation.nix:416:11:
          415|         // {
          416|           drvPath =
             |           ^
          417|             assert condition;

       … while calling the 'derivationStrict' builtin
         at «nix-internal»/derivation-internal.nix:37:12:
           36|
           37|   strict = derivationStrict drvAttrs;
             |            ^
           38|

       … while evaluating the option `driverConfiguration.vlans':

       … while evaluating definitions from `/nix/store/b5yz03mfyd67drnilplad1drbxbkap1w-source/nixos/lib/testing/driver-configuration.nix':

       … while evaluating the option `nodes.second.networking.interfaces':

       … while evaluating definitions from `/nix/store/b5yz03mfyd67drnilplad1drbxbkap1w-source/nixos/modules/hardware/facter/networking':

       … while evaluating the option `nodes.second.hardware.facter.enable':

       … while evaluating the option `nodes.second.hardware.facter.report':

       … while evaluating the option `nodes.second.hardware.facter.reportPath':

       … while evaluating definitions from `/nix/store/dn3bgshfpnq8d2hb2zx8hn08pkiw0s36-source/nixosModules/clanCore/nixos-facter.nix':

       (stack trace truncated; use '--show-trace' to show the full, detailed trace)

       error: cannot open connection to remote store 'grpc://nix-store.geninf.io:50051': error: Nix daemon disconnected unexpectedly (maybe it crashed?)
failed eval checks.x86_64-linux.authelia —
error: … while evaluating the attribute 'drvPath' at «https://releases.nixos.org/nixpkgs/nixpkgs-26.11pre1078010.b6c98e9e6633/nixexprs.tar.xz?na …
error:
       … while evaluating the attribute 'drvPath'
         at «https://releases.nixos.org/nixpkgs/nixpkgs-26.11pre1078010.b6c98e9e6633/nixexprs.tar.xz?narHash=sha256-wQZif6Lyrg1IDl8k68Gwa3OK9PermeRsjdKgso4K1VA%3D»/lib/customisation.nix:416:11:
          415|         // {
          416|           drvPath =
             |           ^
          417|             assert condition;

       … while calling the 'derivationStrict' builtin
         at «nix-internal»/derivation-internal.nix:37:12:
           36|
           37|   strict = derivationStrict drvAttrs;
             |            ^
           38|

       … while evaluating the option `driverConfiguration.vlans':

       … while evaluating definitions from `/nix/store/b5yz03mfyd67drnilplad1drbxbkap1w-source/nixos/lib/testing/driver-configuration.nix':

       … while evaluating the option `containers.server.networking.interfaces':

       … while evaluating definitions from `/nix/store/b5yz03mfyd67drnilplad1drbxbkap1w-source/nixos/modules/hardware/facter/networking':

       … while evaluating the option `containers.server.hardware.facter.enable':

       … while evaluating the option `containers.server.hardware.facter.report':

       … while evaluating the option `containers.server.hardware.facter.reportPath':

       … while evaluating definitions from `/nix/store/dn3bgshfpnq8d2hb2zx8hn08pkiw0s36-source/nixosModules/clanCore/nixos-facter.nix':

       (stack trace truncated; use '--show-trace' to show the full, detailed trace)

       error: cannot open connection to remote store 'grpc://nix-store.geninf.io:50051': error: Nix daemon disconnected unexpectedly (maybe it crashed?)
failed eval checks.x86_64-linux.coredns —
error: … while evaluating the attribute 'drvPath' at «https://releases.nixos.org/nixpkgs/nixpkgs-26.11pre1078010.b6c98e9e6633/nixexprs.tar.xz?na …
error:
       … while evaluating the attribute 'drvPath'
         at «https://releases.nixos.org/nixpkgs/nixpkgs-26.11pre1078010.b6c98e9e6633/nixexprs.tar.xz?narHash=sha256-wQZif6Lyrg1IDl8k68Gwa3OK9PermeRsjdKgso4K1VA%3D»/lib/customisation.nix:416:11:
          415|         // {
          416|           drvPath =
             |           ^
          417|             assert condition;

       … while calling the 'derivationStrict' builtin
         at «nix-internal»/derivation-internal.nix:37:12:
           36|
           37|   strict = derivationStrict drvAttrs;
             |            ^
           38|

       … while evaluating the option `driverConfiguration.vlans':

       … while evaluating definitions from `/nix/store/b5yz03mfyd67drnilplad1drbxbkap1w-source/nixos/lib/testing/driver-configuration.nix':

       … while evaluating the option `containers.client.networking.interfaces':

       … while evaluating definitions from `/nix/store/b5yz03mfyd67drnilplad1drbxbkap1w-source/nixos/modules/hardware/facter/networking':

       … while evaluating the option `containers.client.hardware.facter.enable':

       … while evaluating the option `containers.client.hardware.facter.report':

       … while evaluating the option `containers.client.hardware.facter.reportPath':

       … while evaluating definitions from `/nix/store/dn3bgshfpnq8d2hb2zx8hn08pkiw0s36-source/nixosModules/clanCore/nixos-facter.nix':

       (stack trace truncated; use '--show-trace' to show the full, detailed trace)

       error: cannot open connection to remote store 'grpc://nix-store.geninf.io:50051': error: Nix daemon disconnected unexpectedly (maybe it crashed?)
failed eval checks.x86_64-linux.dm-wireguard-star —
error: … while evaluating the attribute 'drvPath' at «https://releases.nixos.org/nixpkgs/nixpkgs-26.11pre1078010.b6c98e9e6633/nixexprs.tar.xz?na …
error:
       … while evaluating the attribute 'drvPath'
         at «https://releases.nixos.org/nixpkgs/nixpkgs-26.11pre1078010.b6c98e9e6633/nixexprs.tar.xz?narHash=sha256-wQZif6Lyrg1IDl8k68Gwa3OK9PermeRsjdKgso4K1VA%3D»/lib/customisation.nix:416:11:
          415|         // {
          416|           drvPath =
             |           ^
          417|             assert condition;

       … while calling the 'derivationStrict' builtin
         at «nix-internal»/derivation-internal.nix:37:12:
           36|
           37|   strict = derivationStrict drvAttrs;
             |            ^
           38|

       … while evaluating the option `driverConfiguration.vlans':

       … while evaluating definitions from `/nix/store/b5yz03mfyd67drnilplad1drbxbkap1w-source/nixos/lib/testing/driver-configuration.nix':

       … while evaluating the option `containers.controller.networking.interfaces':

       … while evaluating definitions from `/nix/store/b5yz03mfyd67drnilplad1drbxbkap1w-source/nixos/modules/hardware/facter/networking':

       … while evaluating the option `containers.controller.hardware.facter.enable':

       … while evaluating the option `containers.controller.hardware.facter.report':

       … while evaluating the option `containers.controller.hardware.facter.reportPath':

       … while evaluating definitions from `/nix/store/dn3bgshfpnq8d2hb2zx8hn08pkiw0s36-source/nixosModules/clanCore/nixos-facter.nix':

       (stack trace truncated; use '--show-trace' to show the full, detailed trace)

       error: cannot open connection to remote store 'grpc://nix-store.geninf.io:50051': error: Nix daemon disconnected unexpectedly (maybe it crashed?)
failed eval checks.x86_64-linux.pocket-id —
error: … while evaluating the attribute 'drvPath' at «https://releases.nixos.org/nixpkgs/nixpkgs-26.11pre1078010.b6c98e9e6633/nixexprs.tar.xz?na …
error:
       … while evaluating the attribute 'drvPath'
         at «https://releases.nixos.org/nixpkgs/nixpkgs-26.11pre1078010.b6c98e9e6633/nixexprs.tar.xz?narHash=sha256-wQZif6Lyrg1IDl8k68Gwa3OK9PermeRsjdKgso4K1VA%3D»/lib/customisation.nix:416:11:
          415|         // {
          416|           drvPath =
             |           ^
          417|             assert condition;

       … while calling the 'derivationStrict' builtin
         at «nix-internal»/derivation-internal.nix:37:12:
           36|
           37|   strict = derivationStrict drvAttrs;
             |            ^
           38|

       … while evaluating the option `driverConfiguration.vlans':

       … while evaluating definitions from `/nix/store/b5yz03mfyd67drnilplad1drbxbkap1w-source/nixos/lib/testing/driver-configuration.nix':

       … while evaluating the option `containers.server.networking.interfaces':

       … while evaluating definitions from `/nix/store/b5yz03mfyd67drnilplad1drbxbkap1w-source/nixos/modules/hardware/facter/networking':

       … while evaluating the option `containers.server.hardware.facter.enable':

       … while evaluating the option `containers.server.hardware.facter.report':

       … while evaluating the option `containers.server.hardware.facter.reportPath':

       … while evaluating definitions from `/nix/store/dn3bgshfpnq8d2hb2zx8hn08pkiw0s36-source/nixosModules/clanCore/nixos-facter.nix':

       (stack trace truncated; use '--show-trace' to show the full, detailed trace)

       error: cannot open connection to remote store 'grpc://nix-store.geninf.io:50051': error: Nix daemon disconnected unexpectedly (maybe it crashed?)
failed eval checks.x86_64-linux.punchcard —
error: … while evaluating the attribute 'drvPath' at «https://releases.nixos.org/nixpkgs/nixpkgs-26.11pre1078010.b6c98e9e6633/nixexprs.tar.xz?na …
error:
       … while evaluating the attribute 'drvPath'
         at «https://releases.nixos.org/nixpkgs/nixpkgs-26.11pre1078010.b6c98e9e6633/nixexprs.tar.xz?narHash=sha256-wQZif6Lyrg1IDl8k68Gwa3OK9PermeRsjdKgso4K1VA%3D»/lib/customisation.nix:416:11:
          415|         // {
          416|           drvPath =
             |           ^
          417|             assert condition;

       … while calling the 'derivationStrict' builtin
         at «nix-internal»/derivation-internal.nix:37:12:
           36|
           37|   strict = derivationStrict drvAttrs;
             |            ^
           38|

       … while evaluating the option `driverConfiguration.vlans':

       … while evaluating definitions from `/nix/store/b5yz03mfyd67drnilplad1drbxbkap1w-source/nixos/lib/testing/driver-configuration.nix':

       … while evaluating the option `containers.server.networking.interfaces':

       … while evaluating definitions from `/nix/store/b5yz03mfyd67drnilplad1drbxbkap1w-source/nixos/modules/hardware/facter/networking':

       … while evaluating the option `containers.server.hardware.facter.enable':

       … while evaluating the option `containers.server.hardware.facter.report':

       … while evaluating the option `containers.server.hardware.facter.reportPath':

       … while evaluating definitions from `/nix/store/dn3bgshfpnq8d2hb2zx8hn08pkiw0s36-source/nixosModules/clanCore/nixos-facter.nix':

       (stack trace truncated; use '--show-trace' to show the full, detailed trace)

       error: cannot open connection to remote store 'grpc://nix-store.geninf.io:50051': error: Nix daemon disconnected unexpectedly (maybe it crashed?)
failed eval checks.x86_64-linux.webapps —
error: … while evaluating the attribute 'drvPath' at «https://releases.nixos.org/nixpkgs/nixpkgs-26.11pre1078010.b6c98e9e6633/nixexprs.tar.xz?na …
error:
       … while evaluating the attribute 'drvPath'
         at «https://releases.nixos.org/nixpkgs/nixpkgs-26.11pre1078010.b6c98e9e6633/nixexprs.tar.xz?narHash=sha256-wQZif6Lyrg1IDl8k68Gwa3OK9PermeRsjdKgso4K1VA%3D»/lib/customisation.nix:416:11:
          415|         // {
          416|           drvPath =
             |           ^
          417|             assert condition;

       … while calling the 'derivationStrict' builtin
         at «nix-internal»/derivation-internal.nix:37:12:
           36|
           37|   strict = derivationStrict drvAttrs;
             |            ^
           38|

       … while evaluating the option `driverConfiguration.vlans':

       … while evaluating definitions from `/nix/store/b5yz03mfyd67drnilplad1drbxbkap1w-source/nixos/lib/testing/driver-configuration.nix':

       … while evaluating the option `containers.server.networking.interfaces':

       … while evaluating definitions from `/nix/store/b5yz03mfyd67drnilplad1drbxbkap1w-source/nixos/modules/hardware/facter/networking':

       … while evaluating the option `containers.server.hardware.facter.enable':

       … while evaluating the option `containers.server.hardware.facter.report':

       … while evaluating the option `containers.server.hardware.facter.reportPath':

       … while evaluating definitions from `/nix/store/dn3bgshfpnq8d2hb2zx8hn08pkiw0s36-source/nixosModules/clanCore/nixos-facter.nix':

       (stack trace truncated; use '--show-trace' to show the full, detailed trace)

       error: cannot open connection to remote store 'grpc://nix-store.geninf.io:50051': error: Nix daemon disconnected unexpectedly (maybe it crashed?)
failed eval checks.x86_64-linux.wifi —
error: … while evaluating the attribute 'drvPath' at «https://releases.nixos.org/nixpkgs/nixpkgs-26.11pre1078010.b6c98e9e6633/nixexprs.tar.xz?na …
error:
       … while evaluating the attribute 'drvPath'
         at «https://releases.nixos.org/nixpkgs/nixpkgs-26.11pre1078010.b6c98e9e6633/nixexprs.tar.xz?narHash=sha256-wQZif6Lyrg1IDl8k68Gwa3OK9PermeRsjdKgso4K1VA%3D»/lib/customisation.nix:416:11:
          415|         // {
          416|           drvPath =
             |           ^
          417|             assert condition;

       … while calling the 'derivationStrict' builtin
         at «nix-internal»/derivation-internal.nix:37:12:
           36|
           37|   strict = derivationStrict drvAttrs;
             |            ^
           38|

       … while evaluating the option `driverConfiguration.vlans':

       … while evaluating definitions from `/nix/store/b5yz03mfyd67drnilplad1drbxbkap1w-source/nixos/lib/testing/driver-configuration.nix':

       … while evaluating the option `nodes.second.networking.interfaces':

       … while evaluating definitions from `/nix/store/b5yz03mfyd67drnilplad1drbxbkap1w-source/nixos/modules/hardware/facter/networking':

       … while evaluating the option `nodes.second.hardware.facter.enable':

       … while evaluating the option `nodes.second.hardware.facter.report':

       … while evaluating the option `nodes.second.hardware.facter.reportPath':

       … while evaluating definitions from `/nix/store/dn3bgshfpnq8d2hb2zx8hn08pkiw0s36-source/nixosModules/clanCore/nixos-facter.nix':

       (stack trace truncated; use '--show-trace' to show the full, detailed trace)

       error: cannot open connection to remote store 'grpc://nix-store.geninf.io:50051': error: Nix daemon disconnected unexpectedly (maybe it crashed?)
9 succeeded
succeeded attributes
status attribute duration
loading…
3 already built ⚠ 1
skipped attributes
status attribute duration
skipped local checks.aarch64-darwin.nix-unit
  • Dependency of package 'nix-unit' uses a nested list in attribute 'nativeBuildInputs'. This is deprecated as of Nixpkgs release 26.05, and support will be removed in a future nixpkgs release.
—
skipped local checks.aarch64-linux.nix-unit —
skipped local checks.x86_64-linux.treefmt —