nixbot

builds

clan/clan-community build #188 failed

branch 26.05 · PR #197 · commit dc8c91c18f · · took 28m 29s · eval 5m 11s

eval warnings 5 kinds · 454 occurrences
  • error unable to download 'https://cache.clan.lol/…': HTTP error 503 ×14
  • error unable to download 'https://cache.geninf.io/…': HTTP error 503 ×39
  • warn Dependency of package 'nix-unit' uses a nested list in attribute 'nativeBuildInputs'. ×1
  • warn unable to download 'https://cache.clan.lol/…': HTTP error 503 ×221
  • warn unable to download 'https://cache.geninf.io/…': HTTP error 503 ×179

10 failed
failed attributes
status attribute duration
failed checks.aarch64-darwin.coverage 1m 28s
setup: don't know how to build these paths: /nix/store/hi9d09jv755ds0whb1pfnmf0fr2r7vjj-service-test-coverage-aarch64-darwin.drv warning: ignoring the client- …
setup:
don't know how to build these paths:
  /nix/store/hi9d09jv755ds0whb1pfnmf0fr2r7vjj-service-test-coverage-aarch64-darwin.drv
warning: ignoring the client-specified setting 'store', because it is a restricted setting and you are not a trusted user
error: gRPC QueryValidPaths on 'nix-store.geninf.io:50051' failed: error: unable to download 'https://cache.clan.lol/c1lf328xy3wc27bb7c6gm270hx1aarzv.narinfo': HTTP error 503

              response body:

              <?xml version="1.0" encoding="UTF-8" standalone="yes"?>
              <Error>
                  <Code>SlowDown</Code>
                  <Message>Your account has made too many requests; try again later.</Message>
              </Error>
failed checks.aarch64-darwin.treefmt 1m 0s
setup: don't know how to build these paths: /nix/store/r05p9shr8h24l65s8j7vbg01sa878y7d-treefmt-check.drv warning: ignoring the client-specified setting 'stor …
setup:
don't know how to build these paths:
  /nix/store/r05p9shr8h24l65s8j7vbg01sa878y7d-treefmt-check.drv
warning: ignoring the client-specified setting 'store', because it is a restricted setting and you are not a trusted user
error: gRPC QueryValidPaths on 'nix-store.geninf.io:50051' failed: error: unable to download 'https://cache.clan.lol/rkqq524gasjk54c2acxg6p1z1qlhsf11.narinfo': HTTP error 503

              response body:

              <?xml version="1.0" encoding="UTF-8" standalone="yes"?>
              <Error>
                  <Code>SlowDown</Code>
                  <Message>Your account has made too many requests; try again later.</Message>
              </Error>
failed checks.aarch64-linux.coverage 3m 11s
setup: don't know how to build these paths: /nix/store/3cxi4z2aq6rl5fb595hi2la1zl5sdmr1-service-test-coverage-aarch64-linux.drv warning: ignoring the client-s …
setup:
don't know how to build these paths:
  /nix/store/3cxi4z2aq6rl5fb595hi2la1zl5sdmr1-service-test-coverage-aarch64-linux.drv
warning: ignoring the client-specified setting 'store', because it is a restricted setting and you are not a trusted user
error: gRPC QueryValidPaths on 'nix-store.geninf.io:50051' failed: error: unable to download 'https://cache.clan.lol/qglagrgy07rsc5l966vxrww3mh6v4i64.narinfo': HTTP error 503

              response body:

              <?xml version="1.0" encoding="UTF-8" standalone="yes"?>
              <Error>
                  <Code>SlowDown</Code>
                  <Message>Your account has made too many requests; try again later.</Message>
              </Error>
failed checks.aarch64-linux.eval-tests-import-flake 8m 43s
setup: this path will be fetched (0.0 KiB download, 0.1 KiB unpacked): /nix/store/fidnfkwxcan0h3r09gm9cqgrh73g6d33-eval-tests-import-flake warning: ignoring t …
setup:
this path will be fetched (0.0 KiB download, 0.1 KiB unpacked):
  /nix/store/fidnfkwxcan0h3r09gm9cqgrh73g6d33-eval-tests-import-flake
warning: ignoring the client-specified setting 'store', because it is a restricted setting and you are not a trusted user
error: gRPC QueryValidPaths on 'nix-store.geninf.io:50051' failed: error: unable to download 'https://cache.clan.lol/y1g2j9c16n49sjl49l7mn7plma8cb88q.narinfo': HTTP error 503

              response body:

              <?xml version="1.0" encoding="UTF-8" standalone="yes"?>
              <Error>
                  <Code>SlowDown</Code>
                  <Message>Your account has made too many requests; try again later.</Message>
              </Error>
failed checks.aarch64-linux.nix-unit 6s
setup: don't know how to build these paths: /nix/store/456588pyz91r464ahf1br98hjsqgn0zn-nix-unit-check.drv warning: ignoring the client-specified setting 'sto …
setup:
don't know how to build these paths:
  /nix/store/456588pyz91r464ahf1br98hjsqgn0zn-nix-unit-check.drv
warning: ignoring the client-specified setting 'store', because it is a restricted setting and you are not a trusted user
error: gRPC QueryValidPaths on 'nix-store.geninf.io:50051' failed: error: substituter 'https://cache.clan.lol' is disabled
failed checks.aarch64-linux.pocket-id 57s
setup: don't know how to build these paths: /nix/store/mc5k823wci2v3n78xkaxapmd7dji3c9k-container-test-run-pocket-id.drv warning: ignoring the client-specifie …
setup:
don't know how to build these paths:
  /nix/store/mc5k823wci2v3n78xkaxapmd7dji3c9k-container-test-run-pocket-id.drv
warning: ignoring the client-specified setting 'store', because it is a restricted setting and you are not a trusted user
error: gRPC QueryValidPaths on 'nix-store.geninf.io:50051' failed: error: unable to download 'https://cache.clan.lol/ipgrd47akhdiwjx90s9hwmi7zh6h3smb.narinfo': HTTP error 503

              response body:

              <?xml version="1.0" encoding="UTF-8" standalone="yes"?>
              <Error>
                  <Code>SlowDown</Code>
                  <Message>Your account has made too many requests; try again later.</Message>
              </Error>
failed checks.aarch64-linux.treefmt 5m 52s
setup: don't know how to build these paths: /nix/store/1kj2n51alx8qwlqfc672aspyl4d5kjb8-treefmt-check.drv warning: ignoring the client-specified setting 'stor …
setup:
don't know how to build these paths:
  /nix/store/1kj2n51alx8qwlqfc672aspyl4d5kjb8-treefmt-check.drv
warning: ignoring the client-specified setting 'store', because it is a restricted setting and you are not a trusted user
error: gRPC QueryValidPaths on 'nix-store.geninf.io:50051' failed: error: unable to download 'https://cache.geninf.io/akchkb6zl7d35y9nj3mr0bkqkpzfd8x4.narinfo': HTTP error 503

              response body:

              <?xml version="1.0" encoding="UTF-8" standalone="yes"?>
              <Error>
                  <Code>SlowDown</Code>
                  <Message>Your account has made too many requests; try again later.</Message>
              </Error>
failed checks.x86_64-linux.dm-wireguard-star 20s
setup: don't know how to build these paths: /nix/store/2m4gshr4r6crys4i3wqh5db4w0k3i7va-container-test-run-dm-wireguard-star.drv warning: ignoring the client- …
setup:
don't know how to build these paths:
  /nix/store/2m4gshr4r6crys4i3wqh5db4w0k3i7va-container-test-run-dm-wireguard-star.drv
warning: ignoring the client-specified setting 'store', because it is a restricted setting and you are not a trusted user
error: gRPC QueryValidPaths on 'nix-store.geninf.io:50051' failed: error: substituter 'https://cache.clan.lol' is disabled
failed checks.x86_64-linux.pocket-id 1m 7s
setup: don't know how to build these paths: /nix/store/k91ryzz4b8af1q73gikgq6yd484z45a7-container-test-run-pocket-id.drv warning: ignoring the client-specifie …
setup:
don't know how to build these paths:
  /nix/store/k91ryzz4b8af1q73gikgq6yd484z45a7-container-test-run-pocket-id.drv
warning: ignoring the client-specified setting 'store', because it is a restricted setting and you are not a trusted user
error: gRPC QueryValidPaths on 'nix-store.geninf.io:50051' failed: error: unable to download 'https://cache.clan.lol/8318cmd2sv7njdsda85xzj93xnmzhf7b.narinfo': HTTP error 503

              response body:

              <?xml version="1.0" encoding="UTF-8" standalone="yes"?>
              <Error>
                  <Code>SlowDown</Code>
                  <Message>Your account has made too many requests; try again later.</Message>
              </Error>
failed checks.x86_64-linux.punchcard 4m 32s
setup: don't know how to build these paths: /nix/store/7ygi64mng74gh2s1bp1dn05ql4hiqs5w-container-test-run-punchcard.drv warning: ignoring the client-specifie …
setup:
don't know how to build these paths:
  /nix/store/7ygi64mng74gh2s1bp1dn05ql4hiqs5w-container-test-run-punchcard.drv
warning: ignoring the client-specified setting 'store', because it is a restricted setting and you are not a trusted user
error: gRPC QueryValidPaths on 'nix-store.geninf.io:50051' failed: error: substituter 'https://cache.clan.lol' is disabled
4 succeeded ⚠ 1
succeeded attributes
status attribute duration
succeeded checks.aarch64-darwin.nix-unit
  • Dependency of package 'nix-unit' uses a nested list in attribute 'nativeBuildInputs'. This is deprecated as of Nixpkgs release 26.05, and support will be removed in a future nixpkgs release.
7m 24s
succeeded checks.aarch64-darwin.eval-tests-import-flake 5m 14s
succeeded checks.aarch64-linux.coredns 22m 9s
succeeded checks.aarch64-linux.webapps 23m 17s
12 already built
skipped attributes
status attribute duration
loading…