nixbot

builds

clan/clan-community build #194 failed

branch 26.05 · PR #201 · commit b2c5d2cc0e · · took 15m 53s · eval 27s

eval warnings 1 kind · 1 occurrence
  • warn Dependency of package 'nix-unit' uses a nested list in attribute 'nativeBuildInputs'. ×1

6 failed
failed attributes
status attribute duration
failed checks.aarch64-linux.authelia 8s
container-test-run-authelia: Status: "loading new config: loading http app module: provision http: getting tls app: loading tls app module: provision tls: …
container-test-run-authelia:
     Status: "loading new config: loading http app module: provision http: getting tls app: loading tls app module: provision tls: loading certificates: tls: private key does not match public key"
        CPU: 500ms
Sep 28 15:01:34 server systemd[1]: Starting Caddy...
Sep 28 15:01:35 server caddy[404]: Error: loading initial config: loading new config: loading http app module: provision http: getting tls app: loading tls app module: provision tls: loading certificates: tls: private key does not match public key
Sep 28 15:01:35 server systemd[1]: Started Caddy.
Sep 28 15:01:35 server systemd[1]: caddy.service: Main process exited, code=exited, status=1/FAILURE
Sep 28 15:01:35 server systemd[1]: caddy.service: Failed with result 'exit-code'.
failed checks.aarch64-linux.dm-wireguard-star 15m 24s
container-test-run-dm-wireguard-star: ~~~~^^^^^^^^^^^^^^^^^^^^^^^^^^^^^^^^^^^^^^^^^^^^ File "<string>", line 5, in <module> File "/nix/store/1v002aslhnn …
container-test-run-dm-wireguard-star:
    ~~~~^^^^^^^^^^^^^^^^^^^^^^^^^^^^^^^^^^^^^^^^^^^^
  File "<string>", line 5, in <module>
  File "/nix/store/1v002aslhnn1b7kr1fq8m14lldran2b0-test-driver-0.0.1/lib/python3.13/site-packages/test_driver/__init__.py", line 467, in wait_for_unit
    retry(check_active, timeout)
    ~~~~~^^^^^^^^^^^^^^^^^^^^^^^
  File "/nix/store/1v002aslhnn1b7kr1fq8m14lldran2b0-test-driver-0.0.1/lib/python3.13/site-packages/test_driver/__init__.py", line 202, in retry
    raise Error(msg)
test_driver.Error: action timed out after 900 seconds
failed checks.aarch64-linux.pocket-id 6s
container-test-run-pocket-id: Sep 28 15:01:29 server systemd[1]: Starting Reconcile Pocket ID OIDC clients against the clan-declared spec... Sep 28 15:01:29 ser …
container-test-run-pocket-id:
Sep 28 15:01:29 server systemd[1]: Starting Reconcile Pocket ID OIDC clients against the clan-declared spec...
Sep 28 15:01:29 server pocket-id-clients-reconcile[320]: curl: (7) Failed to connect to 127.0.0.1:1411 after 0 ms: Could not connect to server
Sep 28 15:01:30 server pocket-id-clients-reconcile[402]: [dashboard] create
Sep 28 15:01:30 server pocket-id-clients-reconcile[410]: curl: (22) The requested URL returned error: 404
Sep 28 15:01:30 server systemd[1]: pocket-id-clients.service: Main process exited, code=exited, status=22/n/a
Sep 28 15:01:30 server systemd[1]: pocket-id-clients.service: Failed with result 'exit-code'.
Sep 28 15:01:30 server systemd[1]: Failed to start Reconcile Pocket ID OIDC clients against the clan-declared spec.
failed checks.aarch64-linux.punchcard 7s
container-test-run-punchcard: Status: "loading new config: loading http app module: provision http: getting tls app: loading tls app module: provision tls: …
container-test-run-punchcard:
     Status: "loading new config: loading http app module: provision http: getting tls app: loading tls app module: provision tls: loading certificates: tls: private key does not match public key"
        CPU: 501ms
Sep 28 15:01:34 server systemd[1]: Starting Caddy...
Sep 28 15:01:35 server caddy[385]: Error: loading initial config: loading new config: loading http app module: provision http: getting tls app: loading tls app module: provision tls: loading certificates: tls: private key does not match public key
Sep 28 15:01:35 server systemd[1]: Started Caddy.
Sep 28 15:01:35 server systemd[1]: caddy.service: Main process exited, code=exited, status=1/FAILURE
Sep 28 15:01:35 server systemd[1]: caddy.service: Failed with result 'exit-code'.
failed checks.x86_64-linux.pocket-id 4s
container-test-run-pocket-id: Sep 28 15:01:28 server systemd[1]: Starting Reconcile Pocket ID OIDC clients against the clan-declared spec... Sep 28 15:01:28 ser …
container-test-run-pocket-id:
Sep 28 15:01:28 server systemd[1]: Starting Reconcile Pocket ID OIDC clients against the clan-declared spec...
Sep 28 15:01:28 server pocket-id-clients-reconcile[322]: curl: (7) Failed to connect to 127.0.0.1:1411 after 0 ms: Could not connect to server
Sep 28 15:01:29 server pocket-id-clients-reconcile[382]: [dashboard] create
Sep 28 15:01:29 server pocket-id-clients-reconcile[389]: curl: (22) The requested URL returned error: 404
Sep 28 15:01:29 server systemd[1]: pocket-id-clients.service: Main process exited, code=exited, status=22/n/a
Sep 28 15:01:29 server systemd[1]: pocket-id-clients.service: Failed with result 'exit-code'.
Sep 28 15:01:29 server systemd[1]: Failed to start Reconcile Pocket ID OIDC clients against the clan-declared spec.
failed checks.x86_64-linux.punchcard 6s
container-test-run-punchcard: Status: "loading new config: loading tls app module: provision tls: loading certificates: tls: private key does not match pub …
container-test-run-punchcard:
     Status: "loading new config: loading tls app module: provision tls: loading certificates: tls: private key does not match public key"
        CPU: 287ms
Sep 28 15:01:33 server systemd[1]: Starting Caddy...
Sep 28 15:01:33 server caddy[387]: Error: loading initial config: loading new config: loading tls app module: provision tls: loading certificates: tls: private key does not match public key
Sep 28 15:01:33 server systemd[1]: Started Caddy.
Sep 28 15:01:33 server systemd[1]: caddy.service: Main process exited, code=exited, status=1/FAILURE
Sep 28 15:01:33 server systemd[1]: caddy.service: Failed with result 'exit-code'.
6 succeeded ⚠ 1
succeeded attributes
status attribute duration
succeeded checks.aarch64-darwin.nix-unit
  • Dependency of package 'nix-unit' uses a nested list in attribute 'nativeBuildInputs'. This is deprecated as of Nixpkgs release 26.05, and support will be removed in a future nixpkgs release.
24s
succeeded checks.aarch64-darwin.treefmt 4s
succeeded checks.aarch64-linux.nix-unit 22s
succeeded checks.aarch64-linux.treefmt 3s
succeeded checks.x86_64-linux.nix-unit 21s
succeeded checks.x86_64-linux.treefmt 3s
14 already built
skipped attributes
status attribute duration
loading…