nixbot

builds

clan/clan-community build #195 failed

branch 26.05 · PR #202 · commit c004aea8f5 · · took 19m 28s · eval 48s

eval warnings 1 kind · 1 occurrence
  • warn Dependency of package 'nix-unit' uses a nested list in attribute 'nativeBuildInputs'. ×1

8 failed
failed attributes
status attribute duration
failed checks.aarch64-linux.authelia 3m 29s
container-test-run-authelia: Status: "loading new config: loading http app module: provision http: getting tls app: loading tls app module: provision tls: …
container-test-run-authelia:
     Status: "loading new config: loading http app module: provision http: getting tls app: loading tls app module: provision tls: loading certificates: tls: private key does not match public key"
        CPU: 488ms
Sep 28 20:05:07 server systemd[1]: Starting Caddy...
Sep 28 20:05:07 server caddy[403]: Error: loading initial config: loading new config: loading http app module: provision http: getting tls app: loading tls app module: provision tls: loading certificates: tls: private key does not match public key
Sep 28 20:05:07 server systemd[1]: Started Caddy.
Sep 28 20:05:07 server systemd[1]: caddy.service: Main process exited, code=exited, status=1/FAILURE
Sep 28 20:05:07 server systemd[1]: caddy.service: Failed with result 'exit-code'.
failed checks.aarch64-linux.dm-wireguard-star 18m 50s
container-test-run-dm-wireguard-star: ~~~~^^^^^^^^^^^^^^^^^^^^^^^^^^^^^^^^^^^^^^^^^^^^ File "<string>", line 5, in <module> File "/nix/store/1v002aslhnn …
container-test-run-dm-wireguard-star:
    ~~~~^^^^^^^^^^^^^^^^^^^^^^^^^^^^^^^^^^^^^^^^^^^^
  File "<string>", line 5, in <module>
  File "/nix/store/1v002aslhnn1b7kr1fq8m14lldran2b0-test-driver-0.0.1/lib/python3.13/site-packages/test_driver/__init__.py", line 467, in wait_for_unit
    retry(check_active, timeout)
    ~~~~~^^^^^^^^^^^^^^^^^^^^^^^
  File "/nix/store/1v002aslhnn1b7kr1fq8m14lldran2b0-test-driver-0.0.1/lib/python3.13/site-packages/test_driver/__init__.py", line 202, in retry
    raise Error(msg)
test_driver.Error: action timed out after 900 seconds
failed checks.aarch64-linux.pocket-id 3m 45s
container-test-run-pocket-id: Sep 28 20:05:12 server systemd[1]: Starting Reconcile Pocket ID OIDC clients against the clan-declared spec... Sep 28 20:05:12 ser …
container-test-run-pocket-id:
Sep 28 20:05:12 server systemd[1]: Starting Reconcile Pocket ID OIDC clients against the clan-declared spec...
Sep 28 20:05:12 server pocket-id-clients-reconcile[320]: curl: (7) Failed to connect to 127.0.0.1:1411 after 0 ms: Could not connect to server
Sep 28 20:05:13 server pocket-id-clients-reconcile[403]: [dashboard] create
Sep 28 20:05:13 server pocket-id-clients-reconcile[411]: curl: (22) The requested URL returned error: 404
Sep 28 20:05:13 server systemd[1]: pocket-id-clients.service: Main process exited, code=exited, status=22/n/a
Sep 28 20:05:13 server systemd[1]: pocket-id-clients.service: Failed with result 'exit-code'.
Sep 28 20:05:13 server systemd[1]: Failed to start Reconcile Pocket ID OIDC clients against the clan-declared spec.
failed checks.aarch64-linux.punchcard 3m 30s
container-test-run-punchcard: Status: "loading new config: loading http app module: provision http: getting tls app: loading tls app module: provision tls: …
container-test-run-punchcard:
     Status: "loading new config: loading http app module: provision http: getting tls app: loading tls app module: provision tls: loading certificates: tls: private key does not match public key"
        CPU: 479ms
Sep 28 20:05:08 server systemd[1]: Starting Caddy...
Sep 28 20:05:08 server caddy[385]: Error: loading initial config: loading new config: loading http app module: provision http: getting tls app: loading tls app module: provision tls: loading certificates: tls: private key does not match public key
Sep 28 20:05:08 server systemd[1]: Started Caddy.
Sep 28 20:05:08 server systemd[1]: caddy.service: Main process exited, code=exited, status=1/FAILURE
Sep 28 20:05:08 server systemd[1]: caddy.service: Failed with result 'exit-code'.
failed checks.x86_64-linux.authelia 47s
container-test-run-authelia: Status: "loading new config: loading http app module: provision http: getting tls app: loading tls app module: provision tls: …
container-test-run-authelia:
     Status: "loading new config: loading http app module: provision http: getting tls app: loading tls app module: provision tls: loading certificates: tls: private key does not match public key"
        CPU: 292ms
Sep 28 20:02:26 server systemd[1]: Starting Caddy...
Sep 28 20:02:26 server caddy[405]: Error: loading initial config: loading new config: loading http app module: provision http: getting tls app: loading tls app module: provision tls: loading certificates: tls: private key does not match public key
Sep 28 20:02:26 server systemd[1]: Started Caddy.
Sep 28 20:02:26 server systemd[1]: caddy.service: Main process exited, code=exited, status=1/FAILURE
Sep 28 20:02:26 server systemd[1]: caddy.service: Failed with result 'exit-code'.
failed checks.x86_64-linux.dm-wireguard-star 15m 48s
container-test-run-dm-wireguard-star: ~~~~^^^^^^^^^^^^^^^^^^^^^^^^^^^^^^^^^^^^^^^^^^^^ File "<string>", line 5, in <module> File "/nix/store/7pcwg3l52sf …
container-test-run-dm-wireguard-star:
    ~~~~^^^^^^^^^^^^^^^^^^^^^^^^^^^^^^^^^^^^^^^^^^^^
  File "<string>", line 5, in <module>
  File "/nix/store/7pcwg3l52sff9p90k03qhavpaqk1zhfi-test-driver-0.0.1/lib/python3.13/site-packages/test_driver/__init__.py", line 467, in wait_for_unit
    retry(check_active, timeout)
    ~~~~~^^^^^^^^^^^^^^^^^^^^^^^
  File "/nix/store/7pcwg3l52sff9p90k03qhavpaqk1zhfi-test-driver-0.0.1/lib/python3.13/site-packages/test_driver/__init__.py", line 202, in retry
    raise Error(msg)
test_driver.Error: action timed out after 900 seconds
failed checks.x86_64-linux.pocket-id 57s
container-test-run-pocket-id: Sep 28 20:02:24 server systemd[1]: Starting Reconcile Pocket ID OIDC clients against the clan-declared spec... Sep 28 20:02:24 ser …
container-test-run-pocket-id:
Sep 28 20:02:24 server systemd[1]: Starting Reconcile Pocket ID OIDC clients against the clan-declared spec...
Sep 28 20:02:24 server pocket-id-clients-reconcile[321]: curl: (7) Failed to connect to 127.0.0.1:1411 after 0 ms: Could not connect to server
Sep 28 20:02:25 server pocket-id-clients-reconcile[385]: [dashboard] create
Sep 28 20:02:25 server pocket-id-clients-reconcile[392]: curl: (22) The requested URL returned error: 404
Sep 28 20:02:25 server systemd[1]: pocket-id-clients.service: Main process exited, code=exited, status=22/n/a
Sep 28 20:02:25 server systemd[1]: pocket-id-clients.service: Failed with result 'exit-code'.
Sep 28 20:02:25 server systemd[1]: Failed to start Reconcile Pocket ID OIDC clients against the clan-declared spec.
failed checks.x86_64-linux.punchcard 52s
container-test-run-punchcard: Status: "loading new config: loading http app module: provision http: getting tls app: loading tls app module: provision tls: …
container-test-run-punchcard:
     Status: "loading new config: loading http app module: provision http: getting tls app: loading tls app module: provision tls: loading certificates: tls: private key does not match public key"
        CPU: 286ms
Sep 28 20:02:31 server systemd[1]: Starting Caddy...
Sep 28 20:02:31 server caddy[387]: Error: loading initial config: loading new config: loading http app module: provision http: getting tls app: loading tls app module: provision tls: loading certificates: tls: private key does not match public key
Sep 28 20:02:31 server systemd[1]: Started Caddy.
Sep 28 20:02:31 server systemd[1]: caddy.service: Main process exited, code=exited, status=1/FAILURE
Sep 28 20:02:31 server systemd[1]: caddy.service: Failed with result 'exit-code'.
10 succeeded ⚠ 1
succeeded attributes
status attribute duration
succeeded checks.aarch64-darwin.nix-unit
  • Dependency of package 'nix-unit' uses a nested list in attribute 'nativeBuildInputs'. This is deprecated as of Nixpkgs release 26.05, and support will be removed in a future nixpkgs release.
23s
succeeded checks.aarch64-darwin.treefmt 4s
succeeded checks.aarch64-linux.coredns 3m 44s
succeeded checks.aarch64-linux.nix-unit 25s
succeeded checks.aarch64-linux.treefmt 4s
succeeded checks.aarch64-linux.webapps 4m 3s
succeeded checks.x86_64-linux.coredns 54s
succeeded checks.x86_64-linux.nix-unit 14s
succeeded checks.x86_64-linux.treefmt 4s
succeeded checks.x86_64-linux.webapps 1m 9s
8 already built
skipped attributes
status attribute duration
loading…