nixbot

builds

clan/clan-community build #250 failed

branch 26.05 · PR #251 · commit 5c4ab1f922 · · took 2m 19s · eval 36s

eval warnings 6 kinds · 19 occurrences
  • error …-merged-test-dir-dm-wireguard-star.drv: gi-build-x86-02: gi-build-x86-02: input not substitutable: error: path '/nix/store/…-test-vars-generated' is required, but there is no substituter that can build it, asking the scheduler again ×7
  • error …-merged-test-dir-dm-wireguard-star.drv: build-x86-01: build-x86-01: input not substitutable: error: path '/nix/store/…-test-vars-generated' is required, but there is no substituter that can build it, asking the scheduler again ×6
  • error ×2
  • error build of '/nix/store/…-merged-test-dir-dm-wireguard-star.drv^out' failed: error: gave up after 9 reschedules ×2
  • error nix-store.geninf.io:50051: local nix-daemon connection lost: error: Nix daemon disconnected unexpectedly (maybe it crashed?), retrying ×1
  • warn Dependency of package 'nix-unit' uses a nested list in attribute 'nativeBuildInputs'. ×1

8 failed ⚠ 1
failed attributes
status attribute duration
failed checks.aarch64-darwin.nix-unit
  • Dependency of package 'nix-unit' uses a nested list in attribute 'nativeBuildInputs'. This is deprecated as of Nixpkgs release 26.05, and support will be removed in a future nixpkgs release.
2m 1s
setup: don't know how to build these paths: /nix/store/hlmck8jr9r9vvai008iar7fymlhwc1zv-nix-unit-check.drv warning: ignoring the client-specified setting 'sto …
setup:
don't know how to build these paths:
  /nix/store/hlmck8jr9r9vvai008iar7fymlhwc1zv-nix-unit-check.drv
warning: ignoring the client-specified setting 'store', because it is a restricted setting and you are not a trusted user
warning: hlmck8jr9r9vvai008iar7fymlhwc1zv-nix-unit-check.drv: no connected, non-draining worker for system 'aarch64-darwin' offers features {}, the workers offer {}, waiting up to 120s for a worker
hlmck8jr9r9vvai008iar7fymlhwc1zv-nix-unit-check.drv: no connected, non-draining worker for system 'aarch64-darwin' offers features {}, the workers offer {}
error: no connected, non-draining worker for system 'aarch64-darwin' offers features {}, the workers offer {}
failed checks.aarch64-darwin.treefmt 2m 3s
setup: don't know how to build these paths: /nix/store/slp71q03g14rkiyq86ypacvkdww2jr60-treefmt-check.drv warning: ignoring the client-specified setting 'stor …
setup:
don't know how to build these paths:
  /nix/store/slp71q03g14rkiyq86ypacvkdww2jr60-treefmt-check.drv
warning: ignoring the client-specified setting 'store', because it is a restricted setting and you are not a trusted user
warning: slp71q03g14rkiyq86ypacvkdww2jr60-treefmt-check.drv: no connected, non-draining worker for system 'aarch64-darwin' offers features {}, the workers offer {}, waiting up to 120s for a worker
slp71q03g14rkiyq86ypacvkdww2jr60-treefmt-check.drv: no connected, non-draining worker for system 'aarch64-darwin' offers features {}, the workers offer {}
error: no connected, non-draining worker for system 'aarch64-darwin' offers features {}, the workers offer {}
failed eval checks.aarch64-linux.dm-wireguard-star —
error: … while evaluating the attribute 'drvPath' at «https://releases.nixos.org/nixos/26.05/nixos-26.05.11045.774debe7a0d1/nixexprs.tar.xz?narH …
error:
       … while evaluating the attribute 'drvPath'
         at «https://releases.nixos.org/nixos/26.05/nixos-26.05.11045.774debe7a0d1/nixexprs.tar.xz?narHash=sha256-S5MjznoY0gbQbcANPLz5RYjg%2B5/WQmFRgNbHcP%2Bydcg%3D»/lib/customisation.nix:427:7:
          426|     // {
          427|       drvPath =
             |       ^
          428|         assert condition;

       … while calling the 'derivationStrict' builtin
         at «nix-internal»/derivation-internal.nix:37:12:
           36|
           37|   strict = derivationStrict drvAttrs;
             |            ^
           38|

       … while evaluating the option `nodes.controller.networking.interfaces':

       … while evaluating definitions from `/nix/store/csk881ggvmifg4qf1cal0r1ffflbmlhp-source/nixos/modules/hardware/facter/networking':

       … while evaluating the option `nodes.controller.hardware.facter.enable':

       … while evaluating the option `nodes.controller.hardware.facter.report':

       … while evaluating the option `nodes.controller.hardware.facter.reportPath':

       … while evaluating definitions from `/nix/store/ws2m25334bs7klda239x7sd7y2kp07hc-source/nixosModules/clanCore/nixos-facter.nix':

       (stack trace truncated; use '--show-trace' to show the full, detailed trace)

       error: build of '/nix/store/h22vlvza8nhkbwqm498xd6lzbbb2mx9m-merged-test-dir-dm-wireguard-star.drv^out' failed: error: gave up after 9 reschedules
failed checks.aarch64-linux.nix-unit 7s
setup: cl7iarzf6j70mjjbrh74cwx1f1w8xfla-nix-unit-check.drv: build01: build01: input not substitutable: error: path '/nix/store/wl748g7i5xrpd008gggal2qbkz5iwb9f- …
setup:
cl7iarzf6j70mjjbrh74cwx1f1w8xfla-nix-unit-check.drv: build01: build01: input not substitutable: error: path '/nix/store/wl748g7i5xrpd008gggal2qbkz5iwb9f-nix-unit-2.35.1' is required, but there is no substituter that can build it, asking the scheduler again
cl7iarzf6j70mjjbrh74cwx1f1w8xfla-nix-unit-check.drv: build01: build01: input not substitutable: error: path '/nix/store/wl748g7i5xrpd008gggal2qbkz5iwb9f-nix-unit-2.35.1' is required, but there is no substituter that can build it, asking the scheduler again
cl7iarzf6j70mjjbrh74cwx1f1w8xfla-nix-unit-check.drv: build01: build01: input not substitutable: error: path '/nix/store/wl748g7i5xrpd008gggal2qbkz5iwb9f-nix-unit-2.35.1' is required, but there is no substituter that can build it, asking the scheduler again
cl7iarzf6j70mjjbrh74cwx1f1w8xfla-nix-unit-check.drv: build01: build01: input not substitutable: error: path '/nix/store/wl748g7i5xrpd008gggal2qbkz5iwb9f-nix-unit-2.35.1' is required, but there is no substituter that can build it, asking the scheduler again
cl7iarzf6j70mjjbrh74cwx1f1w8xfla-nix-unit-check.drv: build01: build01: input not substitutable: error: path '/nix/store/wl748g7i5xrpd008gggal2qbkz5iwb9f-nix-unit-2.35.1' is required, but there is no substituter that can build it, asking the scheduler again
cl7iarzf6j70mjjbrh74cwx1f1w8xfla-nix-unit-check.drv: build01: build01: input not substitutable: error: path '/nix/store/wl748g7i5xrpd008gggal2qbkz5iwb9f-nix-unit-2.35.1' is required, but there is no substituter that can build it, asking the scheduler again
cl7iarzf6j70mjjbrh74cwx1f1w8xfla-nix-unit-check.drv: build01: build01: input not substitutable: error: path '/nix/store/wl748g7i5xrpd008gggal2qbkz5iwb9f-nix-unit-2.35.1' is required, but there is no substituter that can build it, asking the scheduler again
error: gave up after 9 reschedules
failed checks.aarch64-linux.pocket-id 4s
setup: don't know how to build these paths: /nix/store/g2zqgdq7g5vsfdpx6ry03k56fcx0cmwj-container-test-run-pocket-id.drv warning: ignoring the client-specifie …
setup:
don't know how to build these paths:
  /nix/store/g2zqgdq7g5vsfdpx6ry03k56fcx0cmwj-container-test-run-pocket-id.drv
warning: ignoring the client-specified setting 'store', because it is a restricted setting and you are not a trusted user
g2zqgdq7g5vsfdpx6ry03k56fcx0cmwj-container-test-run-pocket-id.drv: error: gRPC AddMultipleToStore on 'nix-store.geninf.io:50051' failed: error: some references of path '/nix/store/n2p02gjiqfhl4sy08ay55klv7jbz845l-perl-5.42.0-env.drv' could not be realised
error: error: gRPC AddMultipleToStore on 'nix-store.geninf.io:50051' failed: error: some references of path '/nix/store/n2p02gjiqfhl4sy08ay55klv7jbz845l-perl-5.42.0-env.drv' could not be realised
failed checks.aarch64-linux.treefmt 6s
setup: 836j8rdnnabqg63gw3bqiqr4w1yr1b1l-treefmt-check.drv: build01: build01: input not substitutable: error: some references of path '/nix/store/b59rwab6z16av0h …
setup:
836j8rdnnabqg63gw3bqiqr4w1yr1b1l-treefmt-check.drv: build01: build01: input not substitutable: error: some references of path '/nix/store/b59rwab6z16av0hxz93wv63kzwglyqq5-treefmt' could not be realised, asking the scheduler again
836j8rdnnabqg63gw3bqiqr4w1yr1b1l-treefmt-check.drv: build01: build01: input not substitutable: error: some references of path '/nix/store/b59rwab6z16av0hxz93wv63kzwglyqq5-treefmt' could not be realised, asking the scheduler again
836j8rdnnabqg63gw3bqiqr4w1yr1b1l-treefmt-check.drv: build01: build01: input not substitutable: error: some references of path '/nix/store/b59rwab6z16av0hxz93wv63kzwglyqq5-treefmt' could not be realised, asking the scheduler again
836j8rdnnabqg63gw3bqiqr4w1yr1b1l-treefmt-check.drv: build01: build01: input not substitutable: error: some references of path '/nix/store/b59rwab6z16av0hxz93wv63kzwglyqq5-treefmt' could not be realised, asking the scheduler again
836j8rdnnabqg63gw3bqiqr4w1yr1b1l-treefmt-check.drv: build01: build01: input not substitutable: error: some references of path '/nix/store/b59rwab6z16av0hxz93wv63kzwglyqq5-treefmt' could not be realised, asking the scheduler again
836j8rdnnabqg63gw3bqiqr4w1yr1b1l-treefmt-check.drv: build01: build01: input not substitutable: error: some references of path '/nix/store/b59rwab6z16av0hxz93wv63kzwglyqq5-treefmt' could not be realised, asking the scheduler again
836j8rdnnabqg63gw3bqiqr4w1yr1b1l-treefmt-check.drv: build01: build01: input not substitutable: error: some references of path '/nix/store/b59rwab6z16av0hxz93wv63kzwglyqq5-treefmt' could not be realised, asking the scheduler again
error: gave up after 9 reschedules
failed eval checks.x86_64-linux.dm-wireguard-star —
error: … while evaluating the attribute 'drvPath' at «https://releases.nixos.org/nixos/26.05/nixos-26.05.11045.774debe7a0d1/nixexprs.tar.xz?narH …
error:
       … while evaluating the attribute 'drvPath'
         at «https://releases.nixos.org/nixos/26.05/nixos-26.05.11045.774debe7a0d1/nixexprs.tar.xz?narHash=sha256-S5MjznoY0gbQbcANPLz5RYjg%2B5/WQmFRgNbHcP%2Bydcg%3D»/lib/customisation.nix:427:7:
          426|     // {
          427|       drvPath =
             |       ^
          428|         assert condition;

       … while calling the 'derivationStrict' builtin
         at «nix-internal»/derivation-internal.nix:37:12:
           36|
           37|   strict = derivationStrict drvAttrs;
             |            ^
           38|

       … while evaluating the option `nodes.controller.networking.interfaces':

       … while evaluating definitions from `/nix/store/csk881ggvmifg4qf1cal0r1ffflbmlhp-source/nixos/modules/hardware/facter/networking':

       … while evaluating the option `nodes.controller.hardware.facter.enable':

       … while evaluating the option `nodes.controller.hardware.facter.report':

       … while evaluating the option `nodes.controller.hardware.facter.reportPath':

       … while evaluating definitions from `/nix/store/ws2m25334bs7klda239x7sd7y2kp07hc-source/nixosModules/clanCore/nixos-facter.nix':

       (stack trace truncated; use '--show-trace' to show the full, detailed trace)

       error: build of '/nix/store/h22vlvza8nhkbwqm498xd6lzbbb2mx9m-merged-test-dir-dm-wireguard-star.drv^out' failed: error: gave up after 9 reschedules
failed checks.x86_64-linux.pocket-id 6s
container-test-run-pocket-id: Oct 09 00:02:17 server systemd[1]: Starting Reconcile Pocket ID OIDC clients against the clan-declared spec... Oct 09 00:02:17 ser …
container-test-run-pocket-id:
Oct 09 00:02:17 server systemd[1]: Starting Reconcile Pocket ID OIDC clients against the clan-declared spec...
Oct 09 00:02:17 server pocket-id-clients-reconcile[320]: curl: (7) Failed to connect to 127.0.0.1:1411 after 0 ms: Could not connect to server
Oct 09 00:02:18 server pocket-id-clients-reconcile[385]: [dashboard] create
Oct 09 00:02:18 server pocket-id-clients-reconcile[392]: curl: (22) The requested URL returned error: 404
Oct 09 00:02:18 server systemd[1]: pocket-id-clients.service: Main process exited, code=exited, status=22/n/a
Oct 09 00:02:18 server systemd[1]: pocket-id-clients.service: Failed with result 'exit-code'.
Oct 09 00:02:18 server systemd[1]: Failed to start Reconcile Pocket ID OIDC clients against the clan-declared spec.
2 succeeded
succeeded attributes
status attribute duration
loading…
16 already built
skipped attributes
status attribute duration
loading…