nixbot

builds

clan/clan-community build #251 failed

branch main · PR #247 · commit f5d6ce85bd · · took 2m 13s · eval 1m 0s

eval warnings 17 kinds · 54 occurrences
  • error …-merged-test-dir-webapps.drv: build01: build01: input not substitutable: error: path '/nix/store/…-test-vars-generated' is required, but there is no substituter that can build it, asking the scheduler again ×9
  • error …-merged-test-dir-authelia.drv: build01: build01: input not substitutable: error: path '/nix/store/…-test-vars-generated' is required, but there is no substituter that can build it, asking the scheduler again ×9
  • error …-merged-test-dir-pocket-id.drv: gi-build-x86-02: gi-build-x86-02: input not substitutable: error: path '/nix/store/…-test-vars-generated' is required, but there is no substituter that can build it, asking the scheduler again ×5
  • error …-merged-test-dir-pocket-id.drv: build-x86-01: build-x86-01: input not substitutable: error: path '/nix/store/…-test-vars-generated' is required, but there is no substituter that can build it, asking the scheduler again ×4
  • error …-merged-test-dir-wifi.drv: build01: build01: input not substitutable: error: path '/nix/store/…-test-vars-generated' is required, but there is no substituter that can build it, asking the scheduler again ×9
  • error ×7
  • error build of '/nix/store/…-merged-test-dir-pocket-id.drv^out' failed: error: gave up after 9 reschedules ×1
  • error build of '/nix/store/…-merged-test-dir-webapps.drv^out' failed: error: gave up after 9 reschedules ×1
  • error build of '/nix/store/…-merged-test-dir-authelia.drv^out' failed: error: gave up after 9 reschedules ×1
  • error build of '/nix/store/…-merged-test-dir-wifi.drv^out' failed: error: gave up after 9 reschedules ×1
  • error …-merged-test-dir-coredns.drv: error: gRPC AddMultipleToStore on 'nix-store.geninf.io:50051' failed: error: path '/nix/store/…-vm' is required, but there is no substituter that can build it ×1
  • error build of '/nix/store/…-merged-test-dir-coredns.drv^out' failed: error: error: gRPC AddMultipleToStore on 'nix-store.geninf.io:50051' failed: error: path '/nix/store/…-vm' is required, but there is no substituter that can build it ×1
  • error …-merged-test-dir-punchcard.drv: error: gRPC AddMultipleToStore on 'nix-store.geninf.io:50051' failed: error: path '/nix/store/…-vm' is required, but there is no substituter that can build it ×1
  • error build of '/nix/store/…-merged-test-dir-punchcard.drv^out' failed: error: error: gRPC AddMultipleToStore on 'nix-store.geninf.io:50051' failed: error: path '/nix/store/…-vm' is required, but there is no substituter that can build it ×1
  • error …-merged-test-dir-pocket-id.drv: error: gRPC AddMultipleToStore on 'nix-store.geninf.io:50051' failed: error: path '/nix/store/…-vm' is required, but there is no substituter that can build it ×1
  • error build of '/nix/store/…-merged-test-dir-pocket-id.drv^out' failed: error: error: gRPC AddMultipleToStore on 'nix-store.geninf.io:50051' failed: error: path '/nix/store/…-vm' is required, but there is no substituter that can build it ×1
  • warn Dependency of package 'nix-unit' uses a nested list in attribute 'nativeBuildInputs'. ×1

11 failed ⚠ 1
failed attributes
status attribute duration
failed checks.aarch64-darwin.nix-unit
  • Dependency of package 'nix-unit' uses a nested list in attribute 'nativeBuildInputs'. This is deprecated as of Nixpkgs release 26.05, and support will be removed in a future nixpkgs release.
2m 0s
setup: don't know how to build these paths: /nix/store/66lf6dlp62jc3ixb9985axiifcpzz9lk-nix-unit-check.drv warning: ignoring the client-specified setting 'sto …
setup:
don't know how to build these paths:
  /nix/store/66lf6dlp62jc3ixb9985axiifcpzz9lk-nix-unit-check.drv
warning: ignoring the client-specified setting 'store', because it is a restricted setting and you are not a trusted user
warning: 66lf6dlp62jc3ixb9985axiifcpzz9lk-nix-unit-check.drv: no connected, non-draining worker for system 'aarch64-darwin' offers features {}, the workers offer {}, waiting up to 120s for a worker
66lf6dlp62jc3ixb9985axiifcpzz9lk-nix-unit-check.drv: no connected, non-draining worker for system 'aarch64-darwin' offers features {}, the workers offer {}
error: no connected, non-draining worker for system 'aarch64-darwin' offers features {}, the workers offer {}
failed checks.aarch64-darwin.treefmt 2m 5s
setup: don't know how to build these paths: /nix/store/ph9r45h5w7i4wlc1h4mhb6zpnfsabnvz-treefmt-check.drv warning: ignoring the client-specified setting 'stor …
setup:
don't know how to build these paths:
  /nix/store/ph9r45h5w7i4wlc1h4mhb6zpnfsabnvz-treefmt-check.drv
warning: ignoring the client-specified setting 'store', because it is a restricted setting and you are not a trusted user
warning: ph9r45h5w7i4wlc1h4mhb6zpnfsabnvz-treefmt-check.drv: no connected, non-draining worker for system 'aarch64-darwin' offers features {}, the workers offer {}, waiting up to 120s for a worker
ph9r45h5w7i4wlc1h4mhb6zpnfsabnvz-treefmt-check.drv: no connected, non-draining worker for system 'aarch64-darwin' offers features {}, the workers offer {}
error: no connected, non-draining worker for system 'aarch64-darwin' offers features {}, the workers offer {}
failed eval checks.aarch64-linux.authelia —
error: … while evaluating the attribute 'drvPath' at «https://releases.nixos.org/nixpkgs/nixpkgs-26.11pre1085827.aa48d3470809/nixexprs.tar.xz?na …
error:
       … while evaluating the attribute 'drvPath'
         at «https://releases.nixos.org/nixpkgs/nixpkgs-26.11pre1085827.aa48d3470809/nixexprs.tar.xz?narHash=sha256-R4B%2BRRYmze9htmPZ8xeF19mchTSH99GdaqanKCW8CF8%3D»/lib/customisation.nix:416:11:
          415|         // {
          416|           drvPath =
             |           ^
          417|             assert condition;

       … while calling the 'derivationStrict' builtin
         at «nix-internal»/derivation-internal.nix:37:12:
           36|
           37|   strict = derivationStrict drvAttrs;
             |            ^
           38|

       … while evaluating the option `driverConfiguration.vlans':

       … while evaluating definitions from `/nix/store/vlhb7haagkjabf20g1vg9kxi53fcpi17-source/nixos/lib/testing/driver-configuration.nix':

       … while evaluating the option `containers.server.networking.interfaces':

       … while evaluating definitions from `/nix/store/vlhb7haagkjabf20g1vg9kxi53fcpi17-source/nixos/modules/hardware/facter/networking':

       … while evaluating the option `containers.server.hardware.facter.enable':

       … while evaluating the option `containers.server.hardware.facter.report':

       … while evaluating the option `containers.server.hardware.facter.reportPath':

       … while evaluating definitions from `/nix/store/g52lkm6qg5w9qj8n2w4r0pfb8akkvbg3-source/nixosModules/clanCore/nixos-facter.nix':

       (stack trace truncated; use '--show-trace' to show the full, detailed trace)

       error: build of '/nix/store/dgabrcxmpgrfr3cbzil69sz4fjy2rmny-merged-test-dir-authelia.drv^out' failed: error: gave up after 9 reschedules
failed eval checks.aarch64-linux.coredns —
error: … while evaluating the attribute 'drvPath' at «https://releases.nixos.org/nixpkgs/nixpkgs-26.11pre1085827.aa48d3470809/nixexprs.tar.xz?na …
error:
       … while evaluating the attribute 'drvPath'
         at «https://releases.nixos.org/nixpkgs/nixpkgs-26.11pre1085827.aa48d3470809/nixexprs.tar.xz?narHash=sha256-R4B%2BRRYmze9htmPZ8xeF19mchTSH99GdaqanKCW8CF8%3D»/lib/customisation.nix:416:11:
          415|         // {
          416|           drvPath =
             |           ^
          417|             assert condition;

       … while calling the 'derivationStrict' builtin
         at «nix-internal»/derivation-internal.nix:37:12:
           36|
           37|   strict = derivationStrict drvAttrs;
             |            ^
           38|

       … while evaluating the option `driverConfiguration.vlans':

       … while evaluating definitions from `/nix/store/vlhb7haagkjabf20g1vg9kxi53fcpi17-source/nixos/lib/testing/driver-configuration.nix':

       … while evaluating the option `containers.client.networking.interfaces':

       … while evaluating definitions from `/nix/store/vlhb7haagkjabf20g1vg9kxi53fcpi17-source/nixos/modules/hardware/facter/networking':

       … while evaluating the option `containers.client.hardware.facter.enable':

       … while evaluating the option `containers.client.hardware.facter.report':

       … while evaluating the option `containers.client.hardware.facter.reportPath':

       … while evaluating definitions from `/nix/store/g52lkm6qg5w9qj8n2w4r0pfb8akkvbg3-source/nixosModules/clanCore/nixos-facter.nix':

       (stack trace truncated; use '--show-trace' to show the full, detailed trace)

       error: build of '/nix/store/i3mg34axb0blj6355wsw8wxdzavwd1ak-merged-test-dir-coredns.drv^out' failed: error: error: gRPC AddMultipleToStore on 'nix-store.geninf.io:50051' failed: error: path '/nix/store/vkwbab0cjq3iwca0j4f075kk4hm64cg2-vm' is required, but there is no substituter that can build it
failed checks.aarch64-linux.nix-unit 7s
setup: 4lldz2d3wgvj129faw8p0maj8aynjykv-nix-unit-check.drv: build01: build01: input not substitutable: error: path '/nix/store/2dmic4gmry0rdx58s1pwwvsyzmpvly6s- …
setup:
4lldz2d3wgvj129faw8p0maj8aynjykv-nix-unit-check.drv: build01: build01: input not substitutable: error: path '/nix/store/2dmic4gmry0rdx58s1pwwvsyzmpvly6s-nix-unit-2.35.1' is required, but there is no substituter that can build it, asking the scheduler again
4lldz2d3wgvj129faw8p0maj8aynjykv-nix-unit-check.drv: build01: build01: input not substitutable: error: path '/nix/store/2dmic4gmry0rdx58s1pwwvsyzmpvly6s-nix-unit-2.35.1' is required, but there is no substituter that can build it, asking the scheduler again
4lldz2d3wgvj129faw8p0maj8aynjykv-nix-unit-check.drv: build01: build01: input not substitutable: error: path '/nix/store/2dmic4gmry0rdx58s1pwwvsyzmpvly6s-nix-unit-2.35.1' is required, but there is no substituter that can build it, asking the scheduler again
4lldz2d3wgvj129faw8p0maj8aynjykv-nix-unit-check.drv: build01: build01: input not substitutable: error: path '/nix/store/2dmic4gmry0rdx58s1pwwvsyzmpvly6s-nix-unit-2.35.1' is required, but there is no substituter that can build it, asking the scheduler again
4lldz2d3wgvj129faw8p0maj8aynjykv-nix-unit-check.drv: build01: build01: input not substitutable: error: path '/nix/store/2dmic4gmry0rdx58s1pwwvsyzmpvly6s-nix-unit-2.35.1' is required, but there is no substituter that can build it, asking the scheduler again
4lldz2d3wgvj129faw8p0maj8aynjykv-nix-unit-check.drv: build01: build01: input not substitutable: error: path '/nix/store/2dmic4gmry0rdx58s1pwwvsyzmpvly6s-nix-unit-2.35.1' is required, but there is no substituter that can build it, asking the scheduler again
4lldz2d3wgvj129faw8p0maj8aynjykv-nix-unit-check.drv: build01: build01: input not substitutable: error: path '/nix/store/2dmic4gmry0rdx58s1pwwvsyzmpvly6s-nix-unit-2.35.1' is required, but there is no substituter that can build it, asking the scheduler again
error: gave up after 9 reschedules
failed eval checks.aarch64-linux.pocket-id —
error: … while evaluating the attribute 'drvPath' at «https://releases.nixos.org/nixpkgs/nixpkgs-26.11pre1085827.aa48d3470809/nixexprs.tar.xz?na …
error:
       … while evaluating the attribute 'drvPath'
         at «https://releases.nixos.org/nixpkgs/nixpkgs-26.11pre1085827.aa48d3470809/nixexprs.tar.xz?narHash=sha256-R4B%2BRRYmze9htmPZ8xeF19mchTSH99GdaqanKCW8CF8%3D»/lib/customisation.nix:416:11:
          415|         // {
          416|           drvPath =
             |           ^
          417|             assert condition;

       … while calling the 'derivationStrict' builtin
         at «nix-internal»/derivation-internal.nix:37:12:
           36|
           37|   strict = derivationStrict drvAttrs;
             |            ^
           38|

       … while evaluating the option `driverConfiguration.vlans':

       … while evaluating definitions from `/nix/store/vlhb7haagkjabf20g1vg9kxi53fcpi17-source/nixos/lib/testing/driver-configuration.nix':

       … while evaluating the option `containers.server.networking.interfaces':

       … while evaluating definitions from `/nix/store/vlhb7haagkjabf20g1vg9kxi53fcpi17-source/nixos/modules/hardware/facter/networking':

       … while evaluating the option `containers.server.hardware.facter.enable':

       … while evaluating the option `containers.server.hardware.facter.report':

       … while evaluating the option `containers.server.hardware.facter.reportPath':

       … while evaluating definitions from `/nix/store/g52lkm6qg5w9qj8n2w4r0pfb8akkvbg3-source/nixosModules/clanCore/nixos-facter.nix':

       (stack trace truncated; use '--show-trace' to show the full, detailed trace)

       error: build of '/nix/store/n11k3z0ddj7c4sm6ynj3fq05x1sbxyiz-merged-test-dir-pocket-id.drv^out' failed: error: error: gRPC AddMultipleToStore on 'nix-store.geninf.io:50051' failed: error: path '/nix/store/n1nc6qizq759j2n5lpihw673j27gxn0d-vm' is required, but there is no substituter that can build it
failed eval checks.aarch64-linux.punchcard —
error: … while evaluating the attribute 'drvPath' at «https://releases.nixos.org/nixpkgs/nixpkgs-26.11pre1085827.aa48d3470809/nixexprs.tar.xz?na …
error:
       … while evaluating the attribute 'drvPath'
         at «https://releases.nixos.org/nixpkgs/nixpkgs-26.11pre1085827.aa48d3470809/nixexprs.tar.xz?narHash=sha256-R4B%2BRRYmze9htmPZ8xeF19mchTSH99GdaqanKCW8CF8%3D»/lib/customisation.nix:416:11:
          415|         // {
          416|           drvPath =
             |           ^
          417|             assert condition;

       … while calling the 'derivationStrict' builtin
         at «nix-internal»/derivation-internal.nix:37:12:
           36|
           37|   strict = derivationStrict drvAttrs;
             |            ^
           38|

       … while evaluating the option `driverConfiguration.vlans':

       … while evaluating definitions from `/nix/store/vlhb7haagkjabf20g1vg9kxi53fcpi17-source/nixos/lib/testing/driver-configuration.nix':

       … while evaluating the option `containers.server.networking.interfaces':

       … while evaluating definitions from `/nix/store/vlhb7haagkjabf20g1vg9kxi53fcpi17-source/nixos/modules/hardware/facter/networking':

       … while evaluating the option `containers.server.hardware.facter.enable':

       … while evaluating the option `containers.server.hardware.facter.report':

       … while evaluating the option `containers.server.hardware.facter.reportPath':

       … while evaluating definitions from `/nix/store/g52lkm6qg5w9qj8n2w4r0pfb8akkvbg3-source/nixosModules/clanCore/nixos-facter.nix':

       (stack trace truncated; use '--show-trace' to show the full, detailed trace)

       error: build of '/nix/store/xgyb47kbs7wbh31bx2yjp9kkd0aw49pp-merged-test-dir-punchcard.drv^out' failed: error: error: gRPC AddMultipleToStore on 'nix-store.geninf.io:50051' failed: error: path '/nix/store/9vvmkx9ppl0zjj4m7nphwh9ril0fic86-vm' is required, but there is no substituter that can build it
failed checks.aarch64-linux.treefmt 6s
setup: hj587h68icsk4z1r18bz9jlxw3abfpi9-treefmt-check.drv: build01: build01: input not substitutable: error: some references of path '/nix/store/pi5p8bhyvwrg1w1 …
setup:
hj587h68icsk4z1r18bz9jlxw3abfpi9-treefmt-check.drv: build01: build01: input not substitutable: error: some references of path '/nix/store/pi5p8bhyvwrg1w1nd12704i9gg6ki694-treefmt' could not be realised, asking the scheduler again
hj587h68icsk4z1r18bz9jlxw3abfpi9-treefmt-check.drv: build01: build01: input not substitutable: error: some references of path '/nix/store/pi5p8bhyvwrg1w1nd12704i9gg6ki694-treefmt' could not be realised, asking the scheduler again
hj587h68icsk4z1r18bz9jlxw3abfpi9-treefmt-check.drv: build01: build01: input not substitutable: error: some references of path '/nix/store/pi5p8bhyvwrg1w1nd12704i9gg6ki694-treefmt' could not be realised, asking the scheduler again
hj587h68icsk4z1r18bz9jlxw3abfpi9-treefmt-check.drv: build01: build01: input not substitutable: error: some references of path '/nix/store/pi5p8bhyvwrg1w1nd12704i9gg6ki694-treefmt' could not be realised, asking the scheduler again
hj587h68icsk4z1r18bz9jlxw3abfpi9-treefmt-check.drv: build01: build01: input not substitutable: error: some references of path '/nix/store/pi5p8bhyvwrg1w1nd12704i9gg6ki694-treefmt' could not be realised, asking the scheduler again
hj587h68icsk4z1r18bz9jlxw3abfpi9-treefmt-check.drv: build01: build01: input not substitutable: error: some references of path '/nix/store/pi5p8bhyvwrg1w1nd12704i9gg6ki694-treefmt' could not be realised, asking the scheduler again
hj587h68icsk4z1r18bz9jlxw3abfpi9-treefmt-check.drv: build01: build01: input not substitutable: error: some references of path '/nix/store/pi5p8bhyvwrg1w1nd12704i9gg6ki694-treefmt' could not be realised, asking the scheduler again
error: gave up after 9 reschedules
failed eval checks.aarch64-linux.webapps —
error: … while evaluating the attribute 'drvPath' at «https://releases.nixos.org/nixpkgs/nixpkgs-26.11pre1085827.aa48d3470809/nixexprs.tar.xz?na …
error:
       … while evaluating the attribute 'drvPath'
         at «https://releases.nixos.org/nixpkgs/nixpkgs-26.11pre1085827.aa48d3470809/nixexprs.tar.xz?narHash=sha256-R4B%2BRRYmze9htmPZ8xeF19mchTSH99GdaqanKCW8CF8%3D»/lib/customisation.nix:416:11:
          415|         // {
          416|           drvPath =
             |           ^
          417|             assert condition;

       … while calling the 'derivationStrict' builtin
         at «nix-internal»/derivation-internal.nix:37:12:
           36|
           37|   strict = derivationStrict drvAttrs;
             |            ^
           38|

       … while evaluating the option `driverConfiguration.vlans':

       … while evaluating definitions from `/nix/store/vlhb7haagkjabf20g1vg9kxi53fcpi17-source/nixos/lib/testing/driver-configuration.nix':

       … while evaluating the option `containers.server.networking.interfaces':

       … while evaluating definitions from `/nix/store/vlhb7haagkjabf20g1vg9kxi53fcpi17-source/nixos/modules/hardware/facter/networking':

       … while evaluating the option `containers.server.hardware.facter.enable':

       … while evaluating the option `containers.server.hardware.facter.report':

       … while evaluating the option `containers.server.hardware.facter.reportPath':

       … while evaluating definitions from `/nix/store/g52lkm6qg5w9qj8n2w4r0pfb8akkvbg3-source/nixosModules/clanCore/nixos-facter.nix':

       (stack trace truncated; use '--show-trace' to show the full, detailed trace)

       error: build of '/nix/store/4ccg8dxlmvfv62v9srfxg0njk8hsrh4s-merged-test-dir-webapps.drv^out' failed: error: gave up after 9 reschedules
failed eval checks.aarch64-linux.wifi —
error: … while evaluating the attribute 'drvPath' at «https://releases.nixos.org/nixpkgs/nixpkgs-26.11pre1085827.aa48d3470809/nixexprs.tar.xz?na …
error:
       … while evaluating the attribute 'drvPath'
         at «https://releases.nixos.org/nixpkgs/nixpkgs-26.11pre1085827.aa48d3470809/nixexprs.tar.xz?narHash=sha256-R4B%2BRRYmze9htmPZ8xeF19mchTSH99GdaqanKCW8CF8%3D»/lib/customisation.nix:416:11:
          415|         // {
          416|           drvPath =
             |           ^
          417|             assert condition;

       … while calling the 'derivationStrict' builtin
         at «nix-internal»/derivation-internal.nix:37:12:
           36|
           37|   strict = derivationStrict drvAttrs;
             |            ^
           38|

       … while evaluating the option `driverConfiguration.vlans':

       … while evaluating definitions from `/nix/store/vlhb7haagkjabf20g1vg9kxi53fcpi17-source/nixos/lib/testing/driver-configuration.nix':

       … while evaluating the option `nodes.second.networking.interfaces':

       … while evaluating definitions from `/nix/store/vlhb7haagkjabf20g1vg9kxi53fcpi17-source/nixos/modules/hardware/facter/networking':

       … while evaluating the option `nodes.second.hardware.facter.enable':

       … while evaluating the option `nodes.second.hardware.facter.report':

       … while evaluating the option `nodes.second.hardware.facter.reportPath':

       … while evaluating definitions from `/nix/store/g52lkm6qg5w9qj8n2w4r0pfb8akkvbg3-source/nixosModules/clanCore/nixos-facter.nix':

       (stack trace truncated; use '--show-trace' to show the full, detailed trace)

       error: build of '/nix/store/bl9p211xr8lyxfh0zwwwzs1y5dk0i95k-merged-test-dir-wifi.drv^out' failed: error: gave up after 9 reschedules
failed eval checks.x86_64-linux.pocket-id —
error: … while evaluating the attribute 'drvPath' at «https://releases.nixos.org/nixpkgs/nixpkgs-26.11pre1085827.aa48d3470809/nixexprs.tar.xz?na …
error:
       … while evaluating the attribute 'drvPath'
         at «https://releases.nixos.org/nixpkgs/nixpkgs-26.11pre1085827.aa48d3470809/nixexprs.tar.xz?narHash=sha256-R4B%2BRRYmze9htmPZ8xeF19mchTSH99GdaqanKCW8CF8%3D»/lib/customisation.nix:416:11:
          415|         // {
          416|           drvPath =
             |           ^
          417|             assert condition;

       … while calling the 'derivationStrict' builtin
         at «nix-internal»/derivation-internal.nix:37:12:
           36|
           37|   strict = derivationStrict drvAttrs;
             |            ^
           38|

       … while evaluating the option `driverConfiguration.vlans':

       … while evaluating definitions from `/nix/store/vlhb7haagkjabf20g1vg9kxi53fcpi17-source/nixos/lib/testing/driver-configuration.nix':

       … while evaluating the option `containers.server.networking.interfaces':

       … while evaluating definitions from `/nix/store/vlhb7haagkjabf20g1vg9kxi53fcpi17-source/nixos/modules/hardware/facter/networking':

       … while evaluating the option `containers.server.hardware.facter.enable':

       … while evaluating the option `containers.server.hardware.facter.report':

       … while evaluating the option `containers.server.hardware.facter.reportPath':

       … while evaluating definitions from `/nix/store/g52lkm6qg5w9qj8n2w4r0pfb8akkvbg3-source/nixosModules/clanCore/nixos-facter.nix':

       (stack trace truncated; use '--show-trace' to show the full, detailed trace)

       error: build of '/nix/store/x64jhk6lwnnb00w5wdl2ih98j3qj5a4h-merged-test-dir-pocket-id.drv^out' failed: error: gave up after 9 reschedules
2 succeeded
succeeded attributes
status attribute duration
loading…
13 already built
skipped attributes
status attribute duration
loading…