clan/clan-core build #1047 failed ← #1046 #1048 →
nix-eval-jobs failed with exit code 1: error: gRPC QueryValidPaths on 'nix-store.geninf.io:50051' failed: error: unable to download 'https://cache-local.geninf.io/p1jcx11zh0mph99mg9s6fiz33jn9sb95.narinfo': HTTP error 200 (curl error: Stream error in the HTTP/2 framing layer)
eval warnings
1 kind
· 1 occurrence
- error gRPC QueryValidPaths on 'nix-store.geninf.io:50051' failed: error: unable to download 'https://cache-local.geninf.io/…': HTTP error 200 (curl error: Stream error in the HTTP/2 framing layer) ×1
18 cancelled
| status | attribute | duration |
|---|---|---|
| loading… | ||
6 succeeded
| status | attribute | duration |
|---|---|---|
| loading… | ||
21 already built
| status | attribute | duration |
|---|---|---|
| loading… | ||