nixbot

builds

clan/clan-core build #1048 failed

branch main · PR #8258 · commit 78958dda93 · · took 2m 10s

nix-eval-jobs failed with exit code 1:
       … while evaluating definitions from `/nix/store/4b8fr08m7yklfr8vmfsjsclvv2aa0764-source/nixos/modules/system/activation/top-level.nix':

       … while evaluating the option `containers.machine.assertions':

       … while evaluating definitions from `/nix/store/9xlfs4fc7h82mkvvnifbhng24082gqin-source/modules/sops':

       … while evaluating the option `containers.machine.sops.secrets':

       … while evaluating definitions from `/nix/store/bdgda00miwpfryv6z30vdgrw0szvviya-source/nixosModules/clanCore/sops.nix':

       (stack trace truncated; use '--show-trace' to show the full, detailed trace)

       error: gRPC QueryValidPaths on 'nix-store.geninf.io:50051' failed: error: substituter 'https://cache-local.geninf.io' is disabled
error:
       … while evaluating the attribute 'drvPath'
         at «https://releases.nixos.org/nixpkgs/nixpkgs-26.11pre1093421.f20cd90e28fe/nixexprs.tar.xz?narHash=sha256-MTJCMrhDFb%2BGRbLxBPTp8kB4dDlO%2BegmQ5qsJgYuaWw%3D»/lib/customisation.nix:416:11:
          415|         // {
          416|           drvPath =
             |           ^
          417|             assert condition;

       … while calling the 'derivationStrict' builtin
         at «nix-internal»/derivation-internal.nix:37:12:
           36|
           37|   strict = derivationStrict drvAttrs;
             |            ^
           38|

       … while evaluating the option `driverConfiguration.containers.server.start_script':

       … while evaluating definitions from `/nix/store/4b8fr08m7yklfr8vmfsjsclvv2aa0764-source/nixos/lib/testing/driver-configuration.nix':

       … while evaluating definitions from `/nix/store/4b8fr08m7yklfr8vmfsjsclvv2aa0764-source/nixos/modules/virtualisation/nspawn-container':

       … while evaluating the option `co …
eval warnings 13 kinds · 101 occurrences
  • error ×50
  • error gRPC QueryValidPaths on 'nix-store.geninf.io:50051' failed: error: substituter 'https://cache-local.geninf.io/…' is disabled ×39
  • error path '/nix/store/…-merged-test-dir-packages' is not valid ×1
  • error gRPC FetchNars failed: error: path '/nix/store/…-merged-test-dir-pki' is required, but there is no substituter that can build it ×1
  • error path '/nix/store/…-merged-test-dir-sshd' is not valid ×2
  • error path '/nix/store/…-merged-test-dir-dm-dns' is not valid ×1
  • error gRPC FetchNars failed: error: path '/nix/store/…-merged-test-dir-hello-service' is required, but there is no substituter that can build it ×1
  • error gRPC FetchNars failed: error: path '/nix/store/…-merged-test-dir-localbackup' is required, but there is no substituter that can build it ×1
  • error path '/nix/store/…-merged-test-dir-service-state-version' is not valid ×1
  • error path '/nix/store/…-merged-test-dir-trusted-nix-caches' is not valid ×1
  • error gRPC FetchNars failed: error: path '/nix/store/…-merged-test-dir-sshd' is required, but there is no substituter that can build it ×1
  • error path '/nix/store/…-merged-test-dir-yggdrasil' is not valid ×1
  • error gRPC QueryValidPaths on 'nix-store.geninf.io:50051' failed: error: unable to download 'https://cache-local.geninf.io/…': HTTP error 200 (curl error: Stream error in the HTTP/2 framing layer) ×1

52 failed
failed attributes
status attribute duration
failed checks.aarch64-linux.devShell-clan-cli 1m 19s
setup: this derivation will be built: /nix/store/358shzxgmavklk6a30x8ny6ixvd4cyaq-clan-cli.drv this path will be fetched (0.0 KiB download, 2.8 KiB unpacked): …
setup:
this derivation will be built:
  /nix/store/358shzxgmavklk6a30x8ny6ixvd4cyaq-clan-cli.drv
this path will be fetched (0.0 KiB download, 2.8 KiB unpacked):
  /nix/store/dqy5sb3smj8bdvqxsj8xqqjc8r6z8xwr-clan-runtime
warning: ignoring the client-specified setting 'store', because it is a restricted setting and you are not a trusted user
error: gRPC QueryValidPaths on 'nix-store.geninf.io:50051' failed: error: substituter 'https://cache-local.geninf.io' is disabled
failed checks.aarch64-linux.eval-tests 1m 19s
setup: don't know how to build these paths: /nix/store/6cy5d8375n7m0icsb07bwnp260nn7dw3-eval-tests-aarch64-linux.drv warning: ignoring the client-specified se …
setup:
don't know how to build these paths:
  /nix/store/6cy5d8375n7m0icsb07bwnp260nn7dw3-eval-tests-aarch64-linux.drv
warning: ignoring the client-specified setting 'store', because it is a restricted setting and you are not a trusted user
error: gRPC QueryValidPaths on 'nix-store.geninf.io:50051' failed: error: substituter 'https://cache-local.geninf.io' is disabled
failed eval checks.aarch64-linux.nixos-test-password-store-mounts —
error: … while evaluating the attribute 'drvPath' at «https://releases.nixos.org/nixpkgs/nixpkgs-26.11pre1093421.f20cd90e28fe/nixexprs.tar.xz?na …
error:
       … while evaluating the attribute 'drvPath'
         at «https://releases.nixos.org/nixpkgs/nixpkgs-26.11pre1093421.f20cd90e28fe/nixexprs.tar.xz?narHash=sha256-MTJCMrhDFb%2BGRbLxBPTp8kB4dDlO%2BegmQ5qsJgYuaWw%3D»/lib/customisation.nix:416:11:
          415|         // {
          416|           drvPath =
             |           ^
          417|             assert condition;

       … while calling the 'derivationStrict' builtin
         at «nix-internal»/derivation-internal.nix:37:12:
           36|
           37|   strict = derivationStrict drvAttrs;
             |            ^
           38|

       … while evaluating the option `driverConfiguration.vms.machine.start_script':

       … while evaluating definitions from `/nix/store/4b8fr08m7yklfr8vmfsjsclvv2aa0764-source/nixos/lib/testing/driver-configuration.nix':

       … while evaluating the option `nodes.machine.system.build.toplevel':

       … while evaluating definitions from `/nix/store/4b8fr08m7yklfr8vmfsjsclvv2aa0764-source/nixos/modules/system/activation/top-level.nix':

       … while evaluating the option `nodes.machine.warnings':

       … while evaluating definitions from `/nix/store/bdgda00miwpfryv6z30vdgrw0szvviya-source/nixosModules/clanCore/nixos-facter.nix':

       (stack trace truncated; use '--show-trace' to show the full, detailed trace)

       error: gRPC QueryValidPaths on 'nix-store.geninf.io:50051' failed: error: substituter 'https://cache-local.geninf.io' is disabled
failed eval checks.aarch64-linux.p2p-ssh-iroh —
error: … while evaluating the attribute 'drvPath' at «https://releases.nixos.org/nixpkgs/nixpkgs-26.11pre1093421.f20cd90e28fe/nixexprs.tar.xz?na …
error:
       … while evaluating the attribute 'drvPath'
         at «https://releases.nixos.org/nixpkgs/nixpkgs-26.11pre1093421.f20cd90e28fe/nixexprs.tar.xz?narHash=sha256-MTJCMrhDFb%2BGRbLxBPTp8kB4dDlO%2BegmQ5qsJgYuaWw%3D»/lib/customisation.nix:416:11:
          415|         // {
          416|           drvPath =
             |           ^
          417|             assert condition;

       … while calling the 'derivationStrict' builtin
         at «nix-internal»/derivation-internal.nix:37:12:
           36|
           37|   strict = derivationStrict drvAttrs;
             |            ^
           38|

       … while evaluating the option `driverConfiguration.vlans':

       … while evaluating definitions from `/nix/store/4b8fr08m7yklfr8vmfsjsclvv2aa0764-source/nixos/lib/testing/driver-configuration.nix':

       … while evaluating the option `containers.client.networking.interfaces':

       … while evaluating definitions from `/nix/store/4b8fr08m7yklfr8vmfsjsclvv2aa0764-source/nixos/modules/hardware/facter/networking':

       … while evaluating the option `containers.client.hardware.facter.enable':

       … while evaluating the option `containers.client.hardware.facter.report':

       … while evaluating the option `containers.client.hardware.facter.reportPath':

       … while evaluating definitions from `/nix/store/bdgda00miwpfryv6z30vdgrw0szvviya-source/nixosModules/clanCore/nixos-facter.nix':

       (stack trace truncated; use '--show-trace' to show the full, detailed trace)

       error: gRPC QueryValidPaths on 'nix-store.geninf.io:50051' failed: error: substituter 'https://cache-local.geninf.io' is disabled
failed eval checks.aarch64-linux.packages —
error: … while evaluating the attribute 'drvPath' at «https://releases.nixos.org/nixpkgs/nixpkgs-26.11pre1093421.f20cd90e28fe/nixexprs.tar.xz?na …
error:
       … while evaluating the attribute 'drvPath'
         at «https://releases.nixos.org/nixpkgs/nixpkgs-26.11pre1093421.f20cd90e28fe/nixexprs.tar.xz?narHash=sha256-MTJCMrhDFb%2BGRbLxBPTp8kB4dDlO%2BegmQ5qsJgYuaWw%3D»/lib/customisation.nix:416:11:
          415|         // {
          416|           drvPath =
             |           ^
          417|             assert condition;

       … while calling the 'derivationStrict' builtin
         at «nix-internal»/derivation-internal.nix:37:12:
           36|
           37|   strict = derivationStrict drvAttrs;
             |            ^
           38|

       … while evaluating the option `driverConfiguration.vlans':

       … while evaluating definitions from `/nix/store/4b8fr08m7yklfr8vmfsjsclvv2aa0764-source/nixos/lib/testing/driver-configuration.nix':

       … while evaluating the option `containers.server.networking.interfaces':

       … while evaluating definitions from `/nix/store/4b8fr08m7yklfr8vmfsjsclvv2aa0764-source/nixos/modules/hardware/facter/networking':

       … while evaluating the option `containers.server.hardware.facter.enable':

       … while evaluating the option `containers.server.hardware.facter.report':

       … while evaluating the option `containers.server.hardware.facter.reportPath':

       … while evaluating definitions from `/nix/store/bdgda00miwpfryv6z30vdgrw0szvviya-source/nixosModules/clanCore/nixos-facter.nix':

       (stack trace truncated; use '--show-trace' to show the full, detailed trace)

       error: path '/nix/store/6b8amixxzllrwdmc5372vyaprndlsi68-merged-test-dir-packages' is not valid
failed eval checks.aarch64-linux.pki —
error: … while evaluating the attribute 'drvPath' at «https://releases.nixos.org/nixpkgs/nixpkgs-26.11pre1093421.f20cd90e28fe/nixexprs.tar.xz?na …
error:
       … while evaluating the attribute 'drvPath'
         at «https://releases.nixos.org/nixpkgs/nixpkgs-26.11pre1093421.f20cd90e28fe/nixexprs.tar.xz?narHash=sha256-MTJCMrhDFb%2BGRbLxBPTp8kB4dDlO%2BegmQ5qsJgYuaWw%3D»/lib/customisation.nix:416:11:
          415|         // {
          416|           drvPath =
             |           ^
          417|             assert condition;

       … while calling the 'derivationStrict' builtin
         at «nix-internal»/derivation-internal.nix:37:12:
           36|
           37|   strict = derivationStrict drvAttrs;
             |            ^
           38|

       … while evaluating the option `driverConfiguration.vlans':

       … while evaluating definitions from `/nix/store/4b8fr08m7yklfr8vmfsjsclvv2aa0764-source/nixos/lib/testing/driver-configuration.nix':

       … while evaluating the option `nodes.caddy.networking.interfaces':

       … while evaluating definitions from `/nix/store/4b8fr08m7yklfr8vmfsjsclvv2aa0764-source/nixos/modules/hardware/facter/networking':

       … while evaluating the option `nodes.caddy.hardware.facter.enable':

       … while evaluating the option `nodes.caddy.hardware.facter.report':

       … while evaluating the option `nodes.caddy.hardware.facter.reportPath':

       … while evaluating definitions from `/nix/store/bdgda00miwpfryv6z30vdgrw0szvviya-source/nixosModules/clanCore/nixos-facter.nix':

       (stack trace truncated; use '--show-trace' to show the full, detailed trace)

       error: gRPC FetchNars failed: error: path '/nix/store/3fm1whm3vzf28ij49zpsq41hxc5i1zq3-merged-test-dir-pki' is required, but there is no substituter that can build it
failed eval checks.aarch64-linux.postgresql —
error: … while evaluating the attribute 'drvPath' at «https://releases.nixos.org/nixpkgs/nixpkgs-26.11pre1093421.f20cd90e28fe/nixexprs.tar.xz?na …
error:
       … while evaluating the attribute 'drvPath'
         at «https://releases.nixos.org/nixpkgs/nixpkgs-26.11pre1093421.f20cd90e28fe/nixexprs.tar.xz?narHash=sha256-MTJCMrhDFb%2BGRbLxBPTp8kB4dDlO%2BegmQ5qsJgYuaWw%3D»/lib/customisation.nix:416:11:
          415|         // {
          416|           drvPath =
             |           ^
          417|             assert condition;

       … while calling the 'derivationStrict' builtin
         at «nix-internal»/derivation-internal.nix:37:12:
           36|
           37|   strict = derivationStrict drvAttrs;
             |            ^
           38|

       … while evaluating the option `driverConfiguration.containers.machine.start_script':

       … while evaluating definitions from `/nix/store/4b8fr08m7yklfr8vmfsjsclvv2aa0764-source/nixos/lib/testing/driver-configuration.nix':

       … while evaluating definitions from `/nix/store/4b8fr08m7yklfr8vmfsjsclvv2aa0764-source/nixos/modules/virtualisation/nspawn-container':

       … while evaluating the option `containers.machine.system.build.toplevel':

       … while evaluating definitions from `/nix/store/4b8fr08m7yklfr8vmfsjsclvv2aa0764-source/nixos/modules/system/activation/top-level.nix':

       … while evaluating the option `containers.machine.assertions':

       … while evaluating definitions from `/nix/store/9xlfs4fc7h82mkvvnifbhng24082gqin-source/modules/sops':

       … while evaluating the option `containers.machine.sops.secrets':

       … while evaluating definitions from `/nix/store/bdgda00miwpfryv6z30vdgrw0szvviya-source/nixosModules/clanCore/sops.nix':

       (stack trace truncated; use '--show-trace' to show the full, detailed trace)

       error: gRPC QueryValidPaths on 'nix-store.geninf.io:50051' failed: error: substituter 'https://cache-local.geninf.io' is disabled
failed eval checks.aarch64-linux.service-dummy-test —
error: … while evaluating the attribute 'drvPath' at «https://releases.nixos.org/nixpkgs/nixpkgs-26.11pre1093421.f20cd90e28fe/nixexprs.tar.xz?na …
error:
       … while evaluating the attribute 'drvPath'
         at «https://releases.nixos.org/nixpkgs/nixpkgs-26.11pre1093421.f20cd90e28fe/nixexprs.tar.xz?narHash=sha256-MTJCMrhDFb%2BGRbLxBPTp8kB4dDlO%2BegmQ5qsJgYuaWw%3D»/lib/customisation.nix:416:11:
          415|         // {
          416|           drvPath =
             |           ^
          417|             assert condition;

       … while calling the 'derivationStrict' builtin
         at «nix-internal»/derivation-internal.nix:37:12:
           36|
           37|   strict = derivationStrict drvAttrs;
             |            ^
           38|

       … while evaluating the option `driverConfiguration.vlans':

       … while evaluating definitions from `/nix/store/4b8fr08m7yklfr8vmfsjsclvv2aa0764-source/nixos/lib/testing/driver-configuration.nix':

       … while evaluating the option `containers.admin1.networking.interfaces':

       … while evaluating definitions from `/nix/store/4b8fr08m7yklfr8vmfsjsclvv2aa0764-source/nixos/modules/hardware/facter/networking':

       … while evaluating the option `containers.admin1.hardware.facter.enable':

       … while evaluating the option `containers.admin1.hardware.facter.report':

       … while evaluating the option `containers.admin1.hardware.facter.reportPath':

       … while evaluating definitions from `/nix/store/bdgda00miwpfryv6z30vdgrw0szvviya-source/nixosModules/clanCore/nixos-facter.nix':

       (stack trace truncated; use '--show-trace' to show the full, detailed trace)

       error: gRPC QueryValidPaths on 'nix-store.geninf.io:50051' failed: error: substituter 'https://cache-local.geninf.io' is disabled
failed eval checks.aarch64-linux.service-dummy-test-from-flake —
error: … while evaluating the attribute 'drvPath' at «https://releases.nixos.org/nixpkgs/nixpkgs-26.11pre1093421.f20cd90e28fe/nixexprs.tar.xz?na …
error:
       … while evaluating the attribute 'drvPath'
         at «https://releases.nixos.org/nixpkgs/nixpkgs-26.11pre1093421.f20cd90e28fe/nixexprs.tar.xz?narHash=sha256-MTJCMrhDFb%2BGRbLxBPTp8kB4dDlO%2BegmQ5qsJgYuaWw%3D»/lib/customisation.nix:416:11:
          415|         // {
          416|           drvPath =
             |           ^
          417|             assert condition;

       … while calling the 'derivationStrict' builtin
         at «nix-internal»/derivation-internal.nix:37:12:
           36|
           37|   strict = derivationStrict drvAttrs;
             |            ^
           38|

       … while evaluating the option `driverConfiguration.vlans':

       … while evaluating definitions from `/nix/store/4b8fr08m7yklfr8vmfsjsclvv2aa0764-source/nixos/lib/testing/driver-configuration.nix':

       … while evaluating the option `containers.peer1.networking.interfaces':

       … while evaluating definitions from `/nix/store/4b8fr08m7yklfr8vmfsjsclvv2aa0764-source/nixos/modules/hardware/facter/networking':

       … while evaluating the option `containers.peer1.hardware.facter.enable':

       … while evaluating the option `containers.peer1.hardware.facter.report':

       … while evaluating the option `containers.peer1.hardware.facter.reportPath':

       … while evaluating definitions from `/nix/store/bdgda00miwpfryv6z30vdgrw0szvviya-source/nixosModules/clanCore/nixos-facter.nix':

       (stack trace truncated; use '--show-trace' to show the full, detailed trace)

       error: gRPC QueryValidPaths on 'nix-store.geninf.io:50051' failed: error: substituter 'https://cache-local.geninf.io' is disabled
failed eval checks.aarch64-linux.sshd —
error: … while evaluating the attribute 'drvPath' at «https://releases.nixos.org/nixpkgs/nixpkgs-26.11pre1093421.f20cd90e28fe/nixexprs.tar.xz?na …
error:
       … while evaluating the attribute 'drvPath'
         at «https://releases.nixos.org/nixpkgs/nixpkgs-26.11pre1093421.f20cd90e28fe/nixexprs.tar.xz?narHash=sha256-MTJCMrhDFb%2BGRbLxBPTp8kB4dDlO%2BegmQ5qsJgYuaWw%3D»/lib/customisation.nix:416:11:
          415|         // {
          416|           drvPath =
             |           ^
          417|             assert condition;

       … while calling the 'derivationStrict' builtin
         at «nix-internal»/derivation-internal.nix:37:12:
           36|
           37|   strict = derivationStrict drvAttrs;
             |            ^
           38|

       … while evaluating the option `driverConfiguration.vlans':

       … while evaluating definitions from `/nix/store/4b8fr08m7yklfr8vmfsjsclvv2aa0764-source/nixos/lib/testing/driver-configuration.nix':

       … while evaluating the option `containers.client.networking.interfaces':

       … while evaluating definitions from `/nix/store/4b8fr08m7yklfr8vmfsjsclvv2aa0764-source/nixos/modules/hardware/facter/networking':

       … while evaluating the option `containers.client.hardware.facter.enable':

       … while evaluating the option `containers.client.hardware.facter.report':

       … while evaluating the option `containers.client.hardware.facter.reportPath':

       … while evaluating definitions from `/nix/store/bdgda00miwpfryv6z30vdgrw0szvviya-source/nixosModules/clanCore/nixos-facter.nix':

       (stack trace truncated; use '--show-trace' to show the full, detailed trace)

       error: path '/nix/store/r1630b4nb5lqlv7c50afqcf4xy0520r8-merged-test-dir-sshd' is not valid
failed eval checks.aarch64-linux.sshd-no-ca —
error: … while evaluating the attribute 'drvPath' at «https://releases.nixos.org/nixpkgs/nixpkgs-26.11pre1093421.f20cd90e28fe/nixexprs.tar.xz?na …
error:
       … while evaluating the attribute 'drvPath'
         at «https://releases.nixos.org/nixpkgs/nixpkgs-26.11pre1093421.f20cd90e28fe/nixexprs.tar.xz?narHash=sha256-MTJCMrhDFb%2BGRbLxBPTp8kB4dDlO%2BegmQ5qsJgYuaWw%3D»/lib/customisation.nix:416:11:
          415|         // {
          416|           drvPath =
             |           ^
          417|             assert condition;

       … while calling the 'derivationStrict' builtin
         at «nix-internal»/derivation-internal.nix:37:12:
           36|
           37|   strict = derivationStrict drvAttrs;
             |            ^
           38|

       … while evaluating the option `driverConfiguration.vlans':

       … while evaluating definitions from `/nix/store/4b8fr08m7yklfr8vmfsjsclvv2aa0764-source/nixos/lib/testing/driver-configuration.nix':

       … while evaluating the option `containers.client.networking.interfaces':

       … while evaluating definitions from `/nix/store/4b8fr08m7yklfr8vmfsjsclvv2aa0764-source/nixos/modules/hardware/facter/networking':

       … while evaluating the option `containers.client.hardware.facter.enable':

       … while evaluating the option `containers.client.hardware.facter.report':

       … while evaluating the option `containers.client.hardware.facter.reportPath':

       … while evaluating definitions from `/nix/store/bdgda00miwpfryv6z30vdgrw0szvviya-source/nixosModules/clanCore/nixos-facter.nix':

       (stack trace truncated; use '--show-trace' to show the full, detailed trace)

       error: gRPC QueryValidPaths on 'nix-store.geninf.io:50051' failed: error: substituter 'https://cache-local.geninf.io' is disabled
failed eval checks.aarch64-linux.syncthing-service —
error: … while evaluating the attribute 'drvPath' at «https://releases.nixos.org/nixpkgs/nixpkgs-26.11pre1093421.f20cd90e28fe/nixexprs.tar.xz?na …
error:
       … while evaluating the attribute 'drvPath'
         at «https://releases.nixos.org/nixpkgs/nixpkgs-26.11pre1093421.f20cd90e28fe/nixexprs.tar.xz?narHash=sha256-MTJCMrhDFb%2BGRbLxBPTp8kB4dDlO%2BegmQ5qsJgYuaWw%3D»/lib/customisation.nix:416:11:
          415|         // {
          416|           drvPath =
             |           ^
          417|             assert condition;

       … while calling the 'derivationStrict' builtin
         at «nix-internal»/derivation-internal.nix:37:12:
           36|
           37|   strict = derivationStrict drvAttrs;
             |            ^
           38|

       … while evaluating the option `driverConfiguration.vlans':

       … while evaluating definitions from `/nix/store/4b8fr08m7yklfr8vmfsjsclvv2aa0764-source/nixos/lib/testing/driver-configuration.nix':

       … while evaluating the option `containers.machine1.networking.interfaces':

       … while evaluating definitions from `/nix/store/4b8fr08m7yklfr8vmfsjsclvv2aa0764-source/nixos/modules/hardware/facter/networking':

       … while evaluating the option `containers.machine1.hardware.facter.enable':

       … while evaluating the option `containers.machine1.hardware.facter.report':

       … while evaluating the option `containers.machine1.hardware.facter.reportPath':

       … while evaluating definitions from `/nix/store/bdgda00miwpfryv6z30vdgrw0szvviya-source/nixosModules/clanCore/nixos-facter.nix':

       (stack trace truncated; use '--show-trace' to show the full, detailed trace)

       error: gRPC QueryValidPaths on 'nix-store.geninf.io:50051' failed: error: substituter 'https://cache-local.geninf.io' is disabled
failed eval checks.aarch64-linux.users —
error: … while evaluating the attribute 'drvPath' at «https://releases.nixos.org/nixpkgs/nixpkgs-26.11pre1093421.f20cd90e28fe/nixexprs.tar.xz?na …
error:
       … while evaluating the attribute 'drvPath'
         at «https://releases.nixos.org/nixpkgs/nixpkgs-26.11pre1093421.f20cd90e28fe/nixexprs.tar.xz?narHash=sha256-MTJCMrhDFb%2BGRbLxBPTp8kB4dDlO%2BegmQ5qsJgYuaWw%3D»/lib/customisation.nix:416:11:
          415|         // {
          416|           drvPath =
             |           ^
          417|             assert condition;

       … while calling the 'derivationStrict' builtin
         at «nix-internal»/derivation-internal.nix:37:12:
           36|
           37|   strict = derivationStrict drvAttrs;
             |            ^
           38|

       … while evaluating the option `driverConfiguration.vlans':

       … while evaluating definitions from `/nix/store/4b8fr08m7yklfr8vmfsjsclvv2aa0764-source/nixos/lib/testing/driver-configuration.nix':

       … while evaluating the option `containers.server.networking.interfaces':

       … while evaluating definitions from `/nix/store/4b8fr08m7yklfr8vmfsjsclvv2aa0764-source/nixos/modules/hardware/facter/networking':

       … while evaluating the option `containers.server.hardware.facter.enable':

       … while evaluating the option `containers.server.hardware.facter.report':

       … while evaluating the option `containers.server.hardware.facter.reportPath':

       … while evaluating definitions from `/nix/store/bdgda00miwpfryv6z30vdgrw0szvviya-source/nixosModules/clanCore/nixos-facter.nix':

       (stack trace truncated; use '--show-trace' to show the full, detailed trace)

       error: gRPC QueryValidPaths on 'nix-store.geninf.io:50051' failed: error: substituter 'https://cache-local.geninf.io' is disabled
failed eval checks.aarch64-linux.wifi —
error: … while evaluating the attribute 'drvPath' at «https://releases.nixos.org/nixpkgs/nixpkgs-26.11pre1093421.f20cd90e28fe/nixexprs.tar.xz?na …
error:
       … while evaluating the attribute 'drvPath'
         at «https://releases.nixos.org/nixpkgs/nixpkgs-26.11pre1093421.f20cd90e28fe/nixexprs.tar.xz?narHash=sha256-MTJCMrhDFb%2BGRbLxBPTp8kB4dDlO%2BegmQ5qsJgYuaWw%3D»/lib/customisation.nix:416:11:
          415|         // {
          416|           drvPath =
             |           ^
          417|             assert condition;

       … while calling the 'derivationStrict' builtin
         at «nix-internal»/derivation-internal.nix:37:12:
           36|
           37|   strict = derivationStrict drvAttrs;
             |            ^
           38|

       … while evaluating the option `driverConfiguration.vlans':

       … while evaluating definitions from `/nix/store/4b8fr08m7yklfr8vmfsjsclvv2aa0764-source/nixos/lib/testing/driver-configuration.nix':

       … while evaluating the option `nodes.second.networking.interfaces':

       … while evaluating definitions from `/nix/store/4b8fr08m7yklfr8vmfsjsclvv2aa0764-source/nixos/modules/hardware/facter/networking':

       … while evaluating the option `nodes.second.hardware.facter.enable':

       … while evaluating the option `nodes.second.hardware.facter.report':

       … while evaluating the option `nodes.second.hardware.facter.reportPath':

       … while evaluating definitions from `/nix/store/bdgda00miwpfryv6z30vdgrw0szvviya-source/nixosModules/clanCore/nixos-facter.nix':

       (stack trace truncated; use '--show-trace' to show the full, detailed trace)

       error: gRPC QueryValidPaths on 'nix-store.geninf.io:50051' failed: error: substituter 'https://cache-local.geninf.io' is disabled
failed eval checks.aarch64-linux.wireguard —
error: … while evaluating the attribute 'drvPath' at «https://releases.nixos.org/nixpkgs/nixpkgs-26.11pre1093421.f20cd90e28fe/nixexprs.tar.xz?na …
error:
       … while evaluating the attribute 'drvPath'
         at «https://releases.nixos.org/nixpkgs/nixpkgs-26.11pre1093421.f20cd90e28fe/nixexprs.tar.xz?narHash=sha256-MTJCMrhDFb%2BGRbLxBPTp8kB4dDlO%2BegmQ5qsJgYuaWw%3D»/lib/customisation.nix:416:11:
          415|         // {
          416|           drvPath =
             |           ^
          417|             assert condition;

       … while calling the 'derivationStrict' builtin
         at «nix-internal»/derivation-internal.nix:37:12:
           36|
           37|   strict = derivationStrict drvAttrs;
             |            ^
           38|

       … while evaluating the option `driverConfiguration.vlans':

       … while evaluating definitions from `/nix/store/4b8fr08m7yklfr8vmfsjsclvv2aa0764-source/nixos/lib/testing/driver-configuration.nix':

       … while evaluating the option `containers.peer1.networking.interfaces':

       … while evaluating definitions from `/nix/store/4b8fr08m7yklfr8vmfsjsclvv2aa0764-source/nixos/modules/hardware/facter/networking':

       … while evaluating the option `containers.peer1.hardware.facter.enable':

       … while evaluating the option `containers.peer1.hardware.facter.report':

       … while evaluating the option `containers.peer1.hardware.facter.reportPath':

       … while evaluating definitions from `/nix/store/bdgda00miwpfryv6z30vdgrw0szvviya-source/nixosModules/clanCore/nixos-facter.nix':

       (stack trace truncated; use '--show-trace' to show the full, detailed trace)

       error: gRPC QueryValidPaths on 'nix-store.geninf.io:50051' failed: error: substituter 'https://cache-local.geninf.io' is disabled
failed eval checks.aarch64-linux.yggdrasil —
error: … while evaluating the attribute 'drvPath' at «https://releases.nixos.org/nixpkgs/nixpkgs-26.11pre1093421.f20cd90e28fe/nixexprs.tar.xz?na …
error:
       … while evaluating the attribute 'drvPath'
         at «https://releases.nixos.org/nixpkgs/nixpkgs-26.11pre1093421.f20cd90e28fe/nixexprs.tar.xz?narHash=sha256-MTJCMrhDFb%2BGRbLxBPTp8kB4dDlO%2BegmQ5qsJgYuaWw%3D»/lib/customisation.nix:416:11:
          415|         // {
          416|           drvPath =
             |           ^
          417|             assert condition;

       … while calling the 'derivationStrict' builtin
         at «nix-internal»/derivation-internal.nix:37:12:
           36|
           37|   strict = derivationStrict drvAttrs;
             |            ^
           38|

       … while evaluating the option `driverConfiguration.vlans':

       … while evaluating definitions from `/nix/store/4b8fr08m7yklfr8vmfsjsclvv2aa0764-source/nixos/lib/testing/driver-configuration.nix':

       … while evaluating the option `nodes.peer2.networking.interfaces':

       … while evaluating definitions from `/nix/store/4b8fr08m7yklfr8vmfsjsclvv2aa0764-source/nixos/modules/hardware/facter/networking':

       … while evaluating the option `nodes.peer2.hardware.facter.enable':

       … while evaluating the option `nodes.peer2.hardware.facter.report':

       … while evaluating the option `nodes.peer2.hardware.facter.reportPath':

       … while evaluating definitions from `/nix/store/bdgda00miwpfryv6z30vdgrw0szvviya-source/nixosModules/clanCore/nixos-facter.nix':

       (stack trace truncated; use '--show-trace' to show the full, detailed trace)

       error: gRPC QueryValidPaths on 'nix-store.geninf.io:50051' failed: error: substituter 'https://cache-local.geninf.io' is disabled
failed eval checks.aarch64-linux.zerotier —
error: … while evaluating the attribute 'drvPath' at «https://releases.nixos.org/nixpkgs/nixpkgs-26.11pre1093421.f20cd90e28fe/nixexprs.tar.xz?na …
error:
       … while evaluating the attribute 'drvPath'
         at «https://releases.nixos.org/nixpkgs/nixpkgs-26.11pre1093421.f20cd90e28fe/nixexprs.tar.xz?narHash=sha256-MTJCMrhDFb%2BGRbLxBPTp8kB4dDlO%2BegmQ5qsJgYuaWw%3D»/lib/customisation.nix:416:11:
          415|         // {
          416|           drvPath =
             |           ^
          417|             assert condition;

       … while calling the 'derivationStrict' builtin
         at «nix-internal»/derivation-internal.nix:37:12:
           36|
           37|   strict = derivationStrict drvAttrs;
             |            ^
           38|

       … while evaluating the option `driverConfiguration.vlans':

       … while evaluating definitions from `/nix/store/4b8fr08m7yklfr8vmfsjsclvv2aa0764-source/nixos/lib/testing/driver-configuration.nix':

       … while evaluating the option `nodes.controller.networking.interfaces':

       … while evaluating definitions from `/nix/store/4b8fr08m7yklfr8vmfsjsclvv2aa0764-source/nixos/modules/hardware/facter/networking':

       … while evaluating the option `nodes.controller.hardware.facter.enable':

       … while evaluating the option `nodes.controller.hardware.facter.report':

       … while evaluating the option `nodes.controller.hardware.facter.reportPath':

       … while evaluating definitions from `/nix/store/bdgda00miwpfryv6z30vdgrw0szvviya-source/nixosModules/clanCore/nixos-facter.nix':

       (stack trace truncated; use '--show-trace' to show the full, detailed trace)

       error: gRPC QueryValidPaths on 'nix-store.geninf.io:50051' failed: error: substituter 'https://cache-local.geninf.io' is disabled
failed eval checks.aarch64-linux.zerotier-multi-instance —
error: … while evaluating the attribute 'drvPath' at «https://releases.nixos.org/nixpkgs/nixpkgs-26.11pre1093421.f20cd90e28fe/nixexprs.tar.xz?na …
error:
       … while evaluating the attribute 'drvPath'
         at «https://releases.nixos.org/nixpkgs/nixpkgs-26.11pre1093421.f20cd90e28fe/nixexprs.tar.xz?narHash=sha256-MTJCMrhDFb%2BGRbLxBPTp8kB4dDlO%2BegmQ5qsJgYuaWw%3D»/lib/customisation.nix:416:11:
          415|         // {
          416|           drvPath =
             |           ^
          417|             assert condition;

       … while calling the 'derivationStrict' builtin
         at «nix-internal»/derivation-internal.nix:37:12:
           36|
           37|   strict = derivationStrict drvAttrs;
             |            ^
           38|

       … while evaluating the option `driverConfiguration.test_script':

       … while evaluating definitions from `/nix/store/4b8fr08m7yklfr8vmfsjsclvv2aa0764-source/nixos/lib/testing/driver-configuration.nix':

       … while evaluating the option `testScriptString':

       … while evaluating definitions from `/nix/store/4b8fr08m7yklfr8vmfsjsclvv2aa0764-source/nixos/lib/testing/testScript.nix':

       … while evaluating definitions from `/nix/store/bdgda00miwpfryv6z30vdgrw0szvviya-source/clanServices/zerotier/tests/vm-multi-instance/default.nix':

       … while evaluating the option `nodes.alpha.clan.core.vars.generators.zerotier-ip-alpha-net-a.files.ip.value':

       … while evaluating definitions from `/nix/store/bdgda00miwpfryv6z30vdgrw0szvviya-source/nixosModules/clanCore/vars/public/in_repo.nix, via option nodes.alpha.clan.core.vars.settings.fileModule':

       (stack trace truncated; use '--show-trace' to show the full, detailed trace)

       error: gRPC QueryValidPaths on 'nix-store.geninf.io:50051' failed: error: substituter 'https://cache-local.geninf.io' is disabled
failed eval checks.x86_64-linux.admin —
error: … while evaluating the attribute 'drvPath' at «https://releases.nixos.org/nixpkgs/nixpkgs-26.11pre1093421.f20cd90e28fe/nixexprs.tar.xz?na …
error:
       … while evaluating the attribute 'drvPath'
         at «https://releases.nixos.org/nixpkgs/nixpkgs-26.11pre1093421.f20cd90e28fe/nixexprs.tar.xz?narHash=sha256-MTJCMrhDFb%2BGRbLxBPTp8kB4dDlO%2BegmQ5qsJgYuaWw%3D»/lib/customisation.nix:416:11:
          415|         // {
          416|           drvPath =
             |           ^
          417|             assert condition;

       … while calling the 'derivationStrict' builtin
         at «nix-internal»/derivation-internal.nix:37:12:
           36|
           37|   strict = derivationStrict drvAttrs;
             |            ^
           38|

       … while evaluating the option `driverConfiguration.vlans':

       … while evaluating definitions from `/nix/store/4b8fr08m7yklfr8vmfsjsclvv2aa0764-source/nixos/lib/testing/driver-configuration.nix':

       … while evaluating the option `containers.server.networking.interfaces':

       … while evaluating definitions from `/nix/store/4b8fr08m7yklfr8vmfsjsclvv2aa0764-source/nixos/modules/hardware/facter/networking':

       … while evaluating the option `containers.server.hardware.facter.enable':

       … while evaluating the option `containers.server.hardware.facter.report':

       … while evaluating the option `containers.server.hardware.facter.reportPath':

       … while evaluating definitions from `/nix/store/bdgda00miwpfryv6z30vdgrw0szvviya-source/nixosModules/clanCore/nixos-facter.nix':

       (stack trace truncated; use '--show-trace' to show the full, detailed trace)

       error: gRPC QueryValidPaths on 'nix-store.geninf.io:50051' failed: error: substituter 'https://cache-local.geninf.io' is disabled
failed eval checks.x86_64-linux.borgbackup —
error: … while evaluating the attribute 'drvPath' at «https://releases.nixos.org/nixpkgs/nixpkgs-26.11pre1093421.f20cd90e28fe/nixexprs.tar.xz?na …
error:
       … while evaluating the attribute 'drvPath'
         at «https://releases.nixos.org/nixpkgs/nixpkgs-26.11pre1093421.f20cd90e28fe/nixexprs.tar.xz?narHash=sha256-MTJCMrhDFb%2BGRbLxBPTp8kB4dDlO%2BegmQ5qsJgYuaWw%3D»/lib/customisation.nix:416:11:
          415|         // {
          416|           drvPath =
             |           ^
          417|             assert condition;

       … while calling the 'derivationStrict' builtin
         at «nix-internal»/derivation-internal.nix:37:12:
           36|
           37|   strict = derivationStrict drvAttrs;
             |            ^
           38|

       … while evaluating the option `driverConfiguration.vlans':

       … while evaluating definitions from `/nix/store/4b8fr08m7yklfr8vmfsjsclvv2aa0764-source/nixos/lib/testing/driver-configuration.nix':

       … while evaluating the option `containers.serverone.networking.interfaces':

       … while evaluating definitions from `/nix/store/4b8fr08m7yklfr8vmfsjsclvv2aa0764-source/nixos/modules/hardware/facter/networking':

       … while evaluating the option `containers.serverone.hardware.facter.enable':

       … while evaluating the option `containers.serverone.hardware.facter.report':

       … while evaluating the option `containers.serverone.hardware.facter.reportPath':

       … while evaluating definitions from `/nix/store/bdgda00miwpfryv6z30vdgrw0szvviya-source/nixosModules/clanCore/nixos-facter.nix':

       (stack trace truncated; use '--show-trace' to show the full, detailed trace)

       error: gRPC QueryValidPaths on 'nix-store.geninf.io:50051' failed: error: substituter 'https://cache-local.geninf.io' is disabled
failed eval checks.x86_64-linux.certificates —
error: … while evaluating the attribute 'drvPath' at «https://releases.nixos.org/nixpkgs/nixpkgs-26.11pre1093421.f20cd90e28fe/nixexprs.tar.xz?na …
error:
       … while evaluating the attribute 'drvPath'
         at «https://releases.nixos.org/nixpkgs/nixpkgs-26.11pre1093421.f20cd90e28fe/nixexprs.tar.xz?narHash=sha256-MTJCMrhDFb%2BGRbLxBPTp8kB4dDlO%2BegmQ5qsJgYuaWw%3D»/lib/customisation.nix:416:11:
          415|         // {
          416|           drvPath =
             |           ^
          417|             assert condition;

       … while calling the 'derivationStrict' builtin
         at «nix-internal»/derivation-internal.nix:37:12:
           36|
           37|   strict = derivationStrict drvAttrs;
             |            ^
           38|

       … while evaluating the option `driverConfiguration.vlans':

       … while evaluating definitions from `/nix/store/4b8fr08m7yklfr8vmfsjsclvv2aa0764-source/nixos/lib/testing/driver-configuration.nix':

       … while evaluating the option `containers.ca.networking.interfaces':

       … while evaluating definitions from `/nix/store/4b8fr08m7yklfr8vmfsjsclvv2aa0764-source/nixos/modules/hardware/facter/networking':

       … while evaluating the option `containers.ca.hardware.facter.enable':

       … while evaluating the option `containers.ca.hardware.facter.report':

       … while evaluating the option `containers.ca.hardware.facter.reportPath':

       … while evaluating definitions from `/nix/store/bdgda00miwpfryv6z30vdgrw0szvviya-source/nixosModules/clanCore/nixos-facter.nix':

       (stack trace truncated; use '--show-trace' to show the full, detailed trace)

       error: gRPC QueryValidPaths on 'nix-store.geninf.io:50051' failed: error: substituter 'https://cache-local.geninf.io' is disabled
failed eval checks.x86_64-linux.clan-test-update —
error: … while evaluating the attribute 'drvPath' at «https://releases.nixos.org/nixpkgs/nixpkgs-26.11pre1093421.f20cd90e28fe/nixexprs.tar.xz?na …
error:
       … while evaluating the attribute 'drvPath'
         at «https://releases.nixos.org/nixpkgs/nixpkgs-26.11pre1093421.f20cd90e28fe/nixexprs.tar.xz?narHash=sha256-MTJCMrhDFb%2BGRbLxBPTp8kB4dDlO%2BegmQ5qsJgYuaWw%3D»/lib/customisation.nix:416:11:
          415|         // {
          416|           drvPath =
             |           ^
          417|             assert condition;

       … while calling the 'derivationStrict' builtin
         at «nix-internal»/derivation-internal.nix:37:12:
           36|
           37|   strict = derivationStrict drvAttrs;
             |            ^
           38|

       … while evaluating the option `driverConfiguration.vlans':

       … while evaluating definitions from `/nix/store/4b8fr08m7yklfr8vmfsjsclvv2aa0764-source/nixos/lib/testing/driver-configuration.nix':

       … while evaluating the option `nodes.machine.networking.interfaces':

       … while evaluating definitions from `/nix/store/4b8fr08m7yklfr8vmfsjsclvv2aa0764-source/nixos/modules/hardware/facter/networking':

       … while evaluating the option `nodes.machine.hardware.facter.enable':

       … while evaluating the option `nodes.machine.hardware.facter.report':

       … while evaluating the option `nodes.machine.hardware.facter.reportPath':

       … while evaluating definitions from `/nix/store/bdgda00miwpfryv6z30vdgrw0szvviya-source/nixosModules/clanCore/nixos-facter.nix':

       (stack trace truncated; use '--show-trace' to show the full, detailed trace)

       error: gRPC QueryValidPaths on 'nix-store.geninf.io:50051' failed: error: substituter 'https://cache-local.geninf.io' is disabled
failed eval checks.x86_64-linux.data-mesher —
error: … while evaluating the attribute 'drvPath' at «https://releases.nixos.org/nixpkgs/nixpkgs-26.11pre1093421.f20cd90e28fe/nixexprs.tar.xz?na …
error:
       … while evaluating the attribute 'drvPath'
         at «https://releases.nixos.org/nixpkgs/nixpkgs-26.11pre1093421.f20cd90e28fe/nixexprs.tar.xz?narHash=sha256-MTJCMrhDFb%2BGRbLxBPTp8kB4dDlO%2BegmQ5qsJgYuaWw%3D»/lib/customisation.nix:416:11:
          415|         // {
          416|           drvPath =
             |           ^
          417|             assert condition;

       … while calling the 'derivationStrict' builtin
         at «nix-internal»/derivation-internal.nix:37:12:
           36|
           37|   strict = derivationStrict drvAttrs;
             |            ^
           38|

       … while evaluating the option `driverConfiguration.vlans':

       … while evaluating definitions from `/nix/store/4b8fr08m7yklfr8vmfsjsclvv2aa0764-source/nixos/lib/testing/driver-configuration.nix':

       … while evaluating the option `containers.alpha.networking.interfaces':

       … while evaluating definitions from `/nix/store/4b8fr08m7yklfr8vmfsjsclvv2aa0764-source/nixos/modules/hardware/facter/networking':

       … while evaluating the option `containers.alpha.hardware.facter.enable':

       … while evaluating the option `containers.alpha.hardware.facter.report':

       … while evaluating the option `containers.alpha.hardware.facter.reportPath':

       … while evaluating definitions from `/nix/store/bdgda00miwpfryv6z30vdgrw0szvviya-source/nixosModules/clanCore/nixos-facter.nix':

       (stack trace truncated; use '--show-trace' to show the full, detailed trace)

       error: gRPC QueryValidPaths on 'nix-store.geninf.io:50051' failed: error: substituter 'https://cache-local.geninf.io' is disabled
failed eval checks.x86_64-linux.dm-dns —
error: … while evaluating the attribute 'drvPath' at «https://releases.nixos.org/nixpkgs/nixpkgs-26.11pre1093421.f20cd90e28fe/nixexprs.tar.xz?na …
error:
       … while evaluating the attribute 'drvPath'
         at «https://releases.nixos.org/nixpkgs/nixpkgs-26.11pre1093421.f20cd90e28fe/nixexprs.tar.xz?narHash=sha256-MTJCMrhDFb%2BGRbLxBPTp8kB4dDlO%2BegmQ5qsJgYuaWw%3D»/lib/customisation.nix:416:11:
          415|         // {
          416|           drvPath =
             |           ^
          417|             assert condition;

       … while calling the 'derivationStrict' builtin
         at «nix-internal»/derivation-internal.nix:37:12:
           36|
           37|   strict = derivationStrict drvAttrs;
             |            ^
           38|

       … while evaluating the option `driverConfiguration.vlans':

       … while evaluating definitions from `/nix/store/4b8fr08m7yklfr8vmfsjsclvv2aa0764-source/nixos/lib/testing/driver-configuration.nix':

       … while evaluating the option `containers.client.networking.interfaces':

       … while evaluating definitions from `/nix/store/4b8fr08m7yklfr8vmfsjsclvv2aa0764-source/nixos/modules/hardware/facter/networking':

       … while evaluating the option `containers.client.hardware.facter.enable':

       … while evaluating the option `containers.client.hardware.facter.report':

       … while evaluating the option `containers.client.hardware.facter.reportPath':

       … while evaluating definitions from `/nix/store/bdgda00miwpfryv6z30vdgrw0szvviya-source/nixosModules/clanCore/nixos-facter.nix':

       (stack trace truncated; use '--show-trace' to show the full, detailed trace)

       error: path '/nix/store/7v27m93h7jbdn4lv3n1jkag660d5g4gp-merged-test-dir-dm-dns' is not valid
failed eval checks.x86_64-linux.dyndns —
error: … while evaluating the attribute 'drvPath' at «https://releases.nixos.org/nixpkgs/nixpkgs-26.11pre1093421.f20cd90e28fe/nixexprs.tar.xz?na …
error:
       … while evaluating the attribute 'drvPath'
         at «https://releases.nixos.org/nixpkgs/nixpkgs-26.11pre1093421.f20cd90e28fe/nixexprs.tar.xz?narHash=sha256-MTJCMrhDFb%2BGRbLxBPTp8kB4dDlO%2BegmQ5qsJgYuaWw%3D»/lib/customisation.nix:416:11:
          415|         // {
          416|           drvPath =
             |           ^
          417|             assert condition;

       … while calling the 'derivationStrict' builtin
         at «nix-internal»/derivation-internal.nix:37:12:
           36|
           37|   strict = derivationStrict drvAttrs;
             |            ^
           38|

       … while evaluating the option `driverConfiguration.vlans':

       … while evaluating definitions from `/nix/store/4b8fr08m7yklfr8vmfsjsclvv2aa0764-source/nixos/lib/testing/driver-configuration.nix':

       … while evaluating the option `containers.server.networking.interfaces':

       … while evaluating definitions from `/nix/store/4b8fr08m7yklfr8vmfsjsclvv2aa0764-source/nixos/modules/hardware/facter/networking':

       … while evaluating the option `containers.server.hardware.facter.enable':

       … while evaluating the option `containers.server.hardware.facter.report':

       … while evaluating the option `containers.server.hardware.facter.reportPath':

       … while evaluating definitions from `/nix/store/bdgda00miwpfryv6z30vdgrw0szvviya-source/nixosModules/clanCore/nixos-facter.nix':

       (stack trace truncated; use '--show-trace' to show the full, detailed trace)

       error: gRPC QueryValidPaths on 'nix-store.geninf.io:50051' failed: error: substituter 'https://cache-local.geninf.io' is disabled
failed eval checks.x86_64-linux.hello-service —
error: … while evaluating the attribute 'drvPath' at «https://releases.nixos.org/nixpkgs/nixpkgs-26.11pre1093421.f20cd90e28fe/nixexprs.tar.xz?na …
error:
       … while evaluating the attribute 'drvPath'
         at «https://releases.nixos.org/nixpkgs/nixpkgs-26.11pre1093421.f20cd90e28fe/nixexprs.tar.xz?narHash=sha256-MTJCMrhDFb%2BGRbLxBPTp8kB4dDlO%2BegmQ5qsJgYuaWw%3D»/lib/customisation.nix:416:11:
          415|         // {
          416|           drvPath =
             |           ^
          417|             assert condition;

       … while calling the 'derivationStrict' builtin
         at «nix-internal»/derivation-internal.nix:37:12:
           36|
           37|   strict = derivationStrict drvAttrs;
             |            ^
           38|

       … while evaluating the option `driverConfiguration.vlans':

       … while evaluating definitions from `/nix/store/4b8fr08m7yklfr8vmfsjsclvv2aa0764-source/nixos/lib/testing/driver-configuration.nix':

       … while evaluating the option `containers.peer1.networking.interfaces':

       … while evaluating definitions from `/nix/store/4b8fr08m7yklfr8vmfsjsclvv2aa0764-source/nixos/modules/hardware/facter/networking':

       … while evaluating the option `containers.peer1.hardware.facter.enable':

       … while evaluating the option `containers.peer1.hardware.facter.report':

       … while evaluating the option `containers.peer1.hardware.facter.reportPath':

       … while evaluating definitions from `/nix/store/bdgda00miwpfryv6z30vdgrw0szvviya-source/nixosModules/clanCore/nixos-facter.nix':

       (stack trace truncated; use '--show-trace' to show the full, detailed trace)

       error: gRPC FetchNars failed: error: path '/nix/store/ndg38p68611qx8677j5n5zav5n4f0czb-merged-test-dir-hello-service' is required, but there is no substituter that can build it
failed eval checks.x86_64-linux.kde —
error: … while evaluating the attribute 'drvPath' at «https://releases.nixos.org/nixpkgs/nixpkgs-26.11pre1093421.f20cd90e28fe/nixexprs.tar.xz?na …
error:
       … while evaluating the attribute 'drvPath'
         at «https://releases.nixos.org/nixpkgs/nixpkgs-26.11pre1093421.f20cd90e28fe/nixexprs.tar.xz?narHash=sha256-MTJCMrhDFb%2BGRbLxBPTp8kB4dDlO%2BegmQ5qsJgYuaWw%3D»/lib/customisation.nix:416:11:
          415|         // {
          416|           drvPath =
             |           ^
          417|             assert condition;

       … while calling the 'derivationStrict' builtin
         at «nix-internal»/derivation-internal.nix:37:12:
           36|
           37|   strict = derivationStrict drvAttrs;
             |            ^
           38|

       … while evaluating the option `driverConfiguration.containers.client.start_script':

       … while evaluating definitions from `/nix/store/4b8fr08m7yklfr8vmfsjsclvv2aa0764-source/nixos/lib/testing/driver-configuration.nix':

       … while evaluating definitions from `/nix/store/4b8fr08m7yklfr8vmfsjsclvv2aa0764-source/nixos/modules/virtualisation/nspawn-container':

       … while evaluating the option `containers.client.system.build.toplevel':

       … while evaluating definitions from `/nix/store/4b8fr08m7yklfr8vmfsjsclvv2aa0764-source/nixos/modules/system/activation/top-level.nix':

       … while evaluating the option `containers.client.assertions':

       … while evaluating definitions from `/nix/store/9xlfs4fc7h82mkvvnifbhng24082gqin-source/modules/sops':

       … while evaluating the option `containers.client.sops.secrets':

       … while evaluating definitions from `/nix/store/bdgda00miwpfryv6z30vdgrw0szvviya-source/nixosModules/clanCore/sops.nix':

       (stack trace truncated; use '--show-trace' to show the full, detailed trace)

       error: gRPC QueryValidPaths on 'nix-store.geninf.io:50051' failed: error: substituter 'https://cache-local.geninf.io' is disabled
failed eval checks.x86_64-linux.localbackup —
error: … while evaluating the attribute 'drvPath' at «https://releases.nixos.org/nixpkgs/nixpkgs-26.11pre1093421.f20cd90e28fe/nixexprs.tar.xz?na …
error:
       … while evaluating the attribute 'drvPath'
         at «https://releases.nixos.org/nixpkgs/nixpkgs-26.11pre1093421.f20cd90e28fe/nixexprs.tar.xz?narHash=sha256-MTJCMrhDFb%2BGRbLxBPTp8kB4dDlO%2BegmQ5qsJgYuaWw%3D»/lib/customisation.nix:416:11:
          415|         // {
          416|           drvPath =
             |           ^
          417|             assert condition;

       … while calling the 'derivationStrict' builtin
         at «nix-internal»/derivation-internal.nix:37:12:
           36|
           37|   strict = derivationStrict drvAttrs;
             |            ^
           38|

       … while evaluating the option `driverConfiguration.vlans':

       … while evaluating definitions from `/nix/store/4b8fr08m7yklfr8vmfsjsclvv2aa0764-source/nixos/lib/testing/driver-configuration.nix':

       … while evaluating the option `containers.machine.networking.interfaces':

       … while evaluating definitions from `/nix/store/4b8fr08m7yklfr8vmfsjsclvv2aa0764-source/nixos/modules/hardware/facter/networking':

       … while evaluating the option `containers.machine.hardware.facter.enable':

       … while evaluating the option `containers.machine.hardware.facter.report':

       … while evaluating the option `containers.machine.hardware.facter.reportPath':

       … while evaluating definitions from `/nix/store/bdgda00miwpfryv6z30vdgrw0szvviya-source/nixosModules/clanCore/nixos-facter.nix':

       (stack trace truncated; use '--show-trace' to show the full, detailed trace)

       error: gRPC FetchNars failed: error: path '/nix/store/chp7vvnsisnkjzgwvjpl9zl7q0nldwsq-merged-test-dir-localbackup' is required, but there is no substituter that can build it
failed eval checks.x86_64-linux.machine-id —
error: … while evaluating the attribute 'drvPath' at «https://releases.nixos.org/nixpkgs/nixpkgs-26.11pre1093421.f20cd90e28fe/nixexprs.tar.xz?na …
error:
       … while evaluating the attribute 'drvPath'
         at «https://releases.nixos.org/nixpkgs/nixpkgs-26.11pre1093421.f20cd90e28fe/nixexprs.tar.xz?narHash=sha256-MTJCMrhDFb%2BGRbLxBPTp8kB4dDlO%2BegmQ5qsJgYuaWw%3D»/lib/customisation.nix:416:11:
          415|         // {
          416|           drvPath =
             |           ^
          417|             assert condition;

       … while calling the 'derivationStrict' builtin
         at «nix-internal»/derivation-internal.nix:37:12:
           36|
           37|   strict = derivationStrict drvAttrs;
             |            ^
           38|

       … while evaluating the option `driverConfiguration.vlans':

       … while evaluating definitions from `/nix/store/4b8fr08m7yklfr8vmfsjsclvv2aa0764-source/nixos/lib/testing/driver-configuration.nix':

       … while evaluating the option `containers.server.networking.interfaces':

       … while evaluating definitions from `/nix/store/4b8fr08m7yklfr8vmfsjsclvv2aa0764-source/nixos/modules/hardware/facter/networking':

       … while evaluating the option `containers.server.hardware.facter.enable':

       … while evaluating the option `containers.server.hardware.facter.report':

       … while evaluating the option `containers.server.hardware.facter.reportPath':

       … while evaluating definitions from `/nix/store/bdgda00miwpfryv6z30vdgrw0szvviya-source/nixosModules/clanCore/nixos-facter.nix':

       (stack trace truncated; use '--show-trace' to show the full, detailed trace)

       error: gRPC QueryValidPaths on 'nix-store.geninf.io:50051' failed: error: substituter 'https://cache-local.geninf.io' is disabled
failed eval checks.x86_64-linux.matrix-synapse —
error: … while evaluating the attribute 'drvPath' at «https://releases.nixos.org/nixpkgs/nixpkgs-26.11pre1093421.f20cd90e28fe/nixexprs.tar.xz?na …
error:
       … while evaluating the attribute 'drvPath'
         at «https://releases.nixos.org/nixpkgs/nixpkgs-26.11pre1093421.f20cd90e28fe/nixexprs.tar.xz?narHash=sha256-MTJCMrhDFb%2BGRbLxBPTp8kB4dDlO%2BegmQ5qsJgYuaWw%3D»/lib/customisation.nix:416:11:
          415|         // {
          416|           drvPath =
             |           ^
          417|             assert condition;

       … while calling the 'derivationStrict' builtin
         at «nix-internal»/derivation-internal.nix:37:12:
           36|
           37|   strict = derivationStrict drvAttrs;
             |            ^
           38|

       … while evaluating the option `driverConfiguration.containers.machine.start_script':

       … while evaluating definitions from `/nix/store/4b8fr08m7yklfr8vmfsjsclvv2aa0764-source/nixos/lib/testing/driver-configuration.nix':

       … while evaluating definitions from `/nix/store/4b8fr08m7yklfr8vmfsjsclvv2aa0764-source/nixos/modules/virtualisation/nspawn-container':

       … while evaluating the option `containers.machine.system.build.toplevel':

       … while evaluating definitions from `/nix/store/4b8fr08m7yklfr8vmfsjsclvv2aa0764-source/nixos/modules/system/activation/top-level.nix':

       … while evaluating the option `containers.machine.assertions':

       … while evaluating definitions from `/nix/store/9xlfs4fc7h82mkvvnifbhng24082gqin-source/modules/sops':

       … while evaluating the option `containers.machine.sops.secrets':

       … while evaluating definitions from `/nix/store/bdgda00miwpfryv6z30vdgrw0szvviya-source/nixosModules/clanCore/sops.nix':

       (stack trace truncated; use '--show-trace' to show the full, detailed trace)

       error: gRPC QueryValidPaths on 'nix-store.geninf.io:50051' failed: error: substituter 'https://cache-local.geninf.io' is disabled
failed eval checks.x86_64-linux.monitoring —
error: … while evaluating the attribute 'drvPath' at «https://releases.nixos.org/nixpkgs/nixpkgs-26.11pre1093421.f20cd90e28fe/nixexprs.tar.xz?na …
error:
       … while evaluating the attribute 'drvPath'
         at «https://releases.nixos.org/nixpkgs/nixpkgs-26.11pre1093421.f20cd90e28fe/nixexprs.tar.xz?narHash=sha256-MTJCMrhDFb%2BGRbLxBPTp8kB4dDlO%2BegmQ5qsJgYuaWw%3D»/lib/customisation.nix:416:11:
          415|         // {
          416|           drvPath =
             |           ^
          417|             assert condition;

       … while calling the 'derivationStrict' builtin
         at «nix-internal»/derivation-internal.nix:37:12:
           36|
           37|   strict = derivationStrict drvAttrs;
             |            ^
           38|

       … while evaluating the option `driverConfiguration.vlans':

       … while evaluating definitions from `/nix/store/4b8fr08m7yklfr8vmfsjsclvv2aa0764-source/nixos/lib/testing/driver-configuration.nix':

       … while evaluating the option `containers.machine1.networking.interfaces':

       … while evaluating definitions from `/nix/store/4b8fr08m7yklfr8vmfsjsclvv2aa0764-source/nixos/modules/hardware/facter/networking':

       … while evaluating the option `containers.machine1.hardware.facter.enable':

       … while evaluating the option `containers.machine1.hardware.facter.report':

       … while evaluating the option `containers.machine1.hardware.facter.reportPath':

       … while evaluating definitions from `/nix/store/bdgda00miwpfryv6z30vdgrw0szvviya-source/nixosModules/clanCore/nixos-facter.nix':

       (stack trace truncated; use '--show-trace' to show the full, detailed trace)

       error: gRPC QueryValidPaths on 'nix-store.geninf.io:50051' failed: error: substituter 'https://cache-local.geninf.io' is disabled
failed eval checks.x86_64-linux.mycelium —
error: … while evaluating the attribute 'drvPath' at «https://releases.nixos.org/nixpkgs/nixpkgs-26.11pre1093421.f20cd90e28fe/nixexprs.tar.xz?na …
error:
       … while evaluating the attribute 'drvPath'
         at «https://releases.nixos.org/nixpkgs/nixpkgs-26.11pre1093421.f20cd90e28fe/nixexprs.tar.xz?narHash=sha256-MTJCMrhDFb%2BGRbLxBPTp8kB4dDlO%2BegmQ5qsJgYuaWw%3D»/lib/customisation.nix:416:11:
          415|         // {
          416|           drvPath =
             |           ^
          417|             assert condition;

       … while calling the 'derivationStrict' builtin
         at «nix-internal»/derivation-internal.nix:37:12:
           36|
           37|   strict = derivationStrict drvAttrs;
             |            ^
           38|

       … while evaluating the option `driverConfiguration.vlans':

       … while evaluating definitions from `/nix/store/4b8fr08m7yklfr8vmfsjsclvv2aa0764-source/nixos/lib/testing/driver-configuration.nix':

       … while evaluating the option `nodes.server.networking.interfaces':

       … while evaluating definitions from `/nix/store/4b8fr08m7yklfr8vmfsjsclvv2aa0764-source/nixos/modules/hardware/facter/networking':

       … while evaluating the option `nodes.server.hardware.facter.enable':

       … while evaluating the option `nodes.server.hardware.facter.report':

       … while evaluating the option `nodes.server.hardware.facter.reportPath':

       … while evaluating definitions from `/nix/store/bdgda00miwpfryv6z30vdgrw0szvviya-source/nixosModules/clanCore/nixos-facter.nix':

       (stack trace truncated; use '--show-trace' to show the full, detailed trace)

       error: gRPC QueryValidPaths on 'nix-store.geninf.io:50051' failed: error: substituter 'https://cache-local.geninf.io' is disabled
failed eval checks.x86_64-linux.ncps —
error: … while evaluating the attribute 'drvPath' at «https://releases.nixos.org/nixpkgs/nixpkgs-26.11pre1093421.f20cd90e28fe/nixexprs.tar.xz?na …
error:
       … while evaluating the attribute 'drvPath'
         at «https://releases.nixos.org/nixpkgs/nixpkgs-26.11pre1093421.f20cd90e28fe/nixexprs.tar.xz?narHash=sha256-MTJCMrhDFb%2BGRbLxBPTp8kB4dDlO%2BegmQ5qsJgYuaWw%3D»/lib/customisation.nix:416:11:
          415|         // {
          416|           drvPath =
             |           ^
          417|             assert condition;

       … while calling the 'derivationStrict' builtin
         at «nix-internal»/derivation-internal.nix:37:12:
           36|
           37|   strict = derivationStrict drvAttrs;
             |            ^
           38|

       … while evaluating the option `driverConfiguration.vlans':

       … while evaluating definitions from `/nix/store/4b8fr08m7yklfr8vmfsjsclvv2aa0764-source/nixos/lib/testing/driver-configuration.nix':

       … while evaluating the option `nodes.clare.networking.interfaces':

       … while evaluating definitions from `/nix/store/4b8fr08m7yklfr8vmfsjsclvv2aa0764-source/nixos/modules/hardware/facter/networking':

       … while evaluating the option `nodes.clare.hardware.facter.enable':

       … while evaluating the option `nodes.clare.hardware.facter.report':

       … while evaluating the option `nodes.clare.hardware.facter.reportPath':

       … while evaluating definitions from `/nix/store/bdgda00miwpfryv6z30vdgrw0szvviya-source/nixosModules/clanCore/nixos-facter.nix':

       (stack trace truncated; use '--show-trace' to show the full, detailed trace)

       error: gRPC QueryValidPaths on 'nix-store.geninf.io:50051' failed: error: substituter 'https://cache-local.geninf.io' is disabled
failed eval checks.x86_64-linux.nixos-test-password-store-mounts —
error: … while evaluating the attribute 'drvPath' at «https://releases.nixos.org/nixpkgs/nixpkgs-26.11pre1093421.f20cd90e28fe/nixexprs.tar.xz?na …
error:
       … while evaluating the attribute 'drvPath'
         at «https://releases.nixos.org/nixpkgs/nixpkgs-26.11pre1093421.f20cd90e28fe/nixexprs.tar.xz?narHash=sha256-MTJCMrhDFb%2BGRbLxBPTp8kB4dDlO%2BegmQ5qsJgYuaWw%3D»/lib/customisation.nix:416:11:
          415|         // {
          416|           drvPath =
             |           ^
          417|             assert condition;

       … while calling the 'derivationStrict' builtin
         at «nix-internal»/derivation-internal.nix:37:12:
           36|
           37|   strict = derivationStrict drvAttrs;
             |            ^
           38|

       … while evaluating the option `driverConfiguration.vms.machine.start_script':

       … while evaluating definitions from `/nix/store/4b8fr08m7yklfr8vmfsjsclvv2aa0764-source/nixos/lib/testing/driver-configuration.nix':

       … while evaluating the option `nodes.machine.system.build.toplevel':

       … while evaluating definitions from `/nix/store/4b8fr08m7yklfr8vmfsjsclvv2aa0764-source/nixos/modules/system/activation/top-level.nix':

       … while evaluating the option `nodes.machine.assertions':

       … while evaluating definitions from `/nix/store/9xlfs4fc7h82mkvvnifbhng24082gqin-source/modules/sops':

       … while evaluating the option `nodes.machine.sops.secrets':

       … while evaluating definitions from `/nix/store/bdgda00miwpfryv6z30vdgrw0szvviya-source/nixosModules/clanCore/sops.nix':

       (stack trace truncated; use '--show-trace' to show the full, detailed trace)

       error: gRPC QueryValidPaths on 'nix-store.geninf.io:50051' failed: error: substituter 'https://cache-local.geninf.io' is disabled
failed eval checks.x86_64-linux.p2p-ssh-iroh —
error: … while evaluating the attribute 'drvPath' at «https://releases.nixos.org/nixpkgs/nixpkgs-26.11pre1093421.f20cd90e28fe/nixexprs.tar.xz?na …
error:
       … while evaluating the attribute 'drvPath'
         at «https://releases.nixos.org/nixpkgs/nixpkgs-26.11pre1093421.f20cd90e28fe/nixexprs.tar.xz?narHash=sha256-MTJCMrhDFb%2BGRbLxBPTp8kB4dDlO%2BegmQ5qsJgYuaWw%3D»/lib/customisation.nix:416:11:
          415|         // {
          416|           drvPath =
             |           ^
          417|             assert condition;

       … while calling the 'derivationStrict' builtin
         at «nix-internal»/derivation-internal.nix:37:12:
           36|
           37|   strict = derivationStrict drvAttrs;
             |            ^
           38|

       … while evaluating the option `driverConfiguration.containers.server.start_script':

       … while evaluating definitions from `/nix/store/4b8fr08m7yklfr8vmfsjsclvv2aa0764-source/nixos/lib/testing/driver-configuration.nix':

       … while evaluating definitions from `/nix/store/4b8fr08m7yklfr8vmfsjsclvv2aa0764-source/nixos/modules/virtualisation/nspawn-container':

       … while evaluating the option `containers.server.system.build.toplevel':

       … while evaluating definitions from `/nix/store/4b8fr08m7yklfr8vmfsjsclvv2aa0764-source/nixos/modules/system/activation/top-level.nix':

       … while evaluating the option `containers.server.assertions':

       … while evaluating definitions from `/nix/store/9xlfs4fc7h82mkvvnifbhng24082gqin-source/modules/sops':

       … while evaluating the option `containers.server.sops.secrets':

       … while evaluating definitions from `/nix/store/bdgda00miwpfryv6z30vdgrw0szvviya-source/nixosModules/clanCore/sops.nix':

       (stack trace truncated; use '--show-trace' to show the full, detailed trace)

       error: gRPC QueryValidPaths on 'nix-store.geninf.io:50051' failed: error: substituter 'https://cache-local.geninf.io' is disabled
failed eval checks.x86_64-linux.packages —
error: … while evaluating the attribute 'drvPath' at «https://releases.nixos.org/nixpkgs/nixpkgs-26.11pre1093421.f20cd90e28fe/nixexprs.tar.xz?na …
error:
       … while evaluating the attribute 'drvPath'
         at «https://releases.nixos.org/nixpkgs/nixpkgs-26.11pre1093421.f20cd90e28fe/nixexprs.tar.xz?narHash=sha256-MTJCMrhDFb%2BGRbLxBPTp8kB4dDlO%2BegmQ5qsJgYuaWw%3D»/lib/customisation.nix:416:11:
          415|         // {
          416|           drvPath =
             |           ^
          417|             assert condition;

       … while calling the 'derivationStrict' builtin
         at «nix-internal»/derivation-internal.nix:37:12:
           36|
           37|   strict = derivationStrict drvAttrs;
             |            ^
           38|

       … while evaluating the option `driverConfiguration.vlans':

       … while evaluating definitions from `/nix/store/4b8fr08m7yklfr8vmfsjsclvv2aa0764-source/nixos/lib/testing/driver-configuration.nix':

       … while evaluating the option `containers.server.networking.interfaces':

       … while evaluating definitions from `/nix/store/4b8fr08m7yklfr8vmfsjsclvv2aa0764-source/nixos/modules/hardware/facter/networking':

       … while evaluating the option `containers.server.hardware.facter.enable':

       … while evaluating the option `containers.server.hardware.facter.report':

       … while evaluating the option `containers.server.hardware.facter.reportPath':

       … while evaluating definitions from `/nix/store/bdgda00miwpfryv6z30vdgrw0szvviya-source/nixosModules/clanCore/nixos-facter.nix':

       (stack trace truncated; use '--show-trace' to show the full, detailed trace)

       error: gRPC QueryValidPaths on 'nix-store.geninf.io:50051' failed: error: substituter 'https://cache-local.geninf.io' is disabled
failed eval checks.x86_64-linux.pki —
error: … while evaluating the attribute 'drvPath' at «https://releases.nixos.org/nixpkgs/nixpkgs-26.11pre1093421.f20cd90e28fe/nixexprs.tar.xz?na …
error:
       … while evaluating the attribute 'drvPath'
         at «https://releases.nixos.org/nixpkgs/nixpkgs-26.11pre1093421.f20cd90e28fe/nixexprs.tar.xz?narHash=sha256-MTJCMrhDFb%2BGRbLxBPTp8kB4dDlO%2BegmQ5qsJgYuaWw%3D»/lib/customisation.nix:416:11:
          415|         // {
          416|           drvPath =
             |           ^
          417|             assert condition;

       … while calling the 'derivationStrict' builtin
         at «nix-internal»/derivation-internal.nix:37:12:
           36|
           37|   strict = derivationStrict drvAttrs;
             |            ^
           38|

       … while evaluating the option `driverConfiguration.vlans':

       … while evaluating definitions from `/nix/store/4b8fr08m7yklfr8vmfsjsclvv2aa0764-source/nixos/lib/testing/driver-configuration.nix':

       … while evaluating the option `nodes.caddy.networking.interfaces':

       … while evaluating definitions from `/nix/store/4b8fr08m7yklfr8vmfsjsclvv2aa0764-source/nixos/modules/hardware/facter/networking':

       … while evaluating the option `nodes.caddy.hardware.facter.enable':

       … while evaluating the option `nodes.caddy.hardware.facter.report':

       … while evaluating the option `nodes.caddy.hardware.facter.reportPath':

       … while evaluating definitions from `/nix/store/bdgda00miwpfryv6z30vdgrw0szvviya-source/nixosModules/clanCore/nixos-facter.nix':

       (stack trace truncated; use '--show-trace' to show the full, detailed trace)

       error: gRPC QueryValidPaths on 'nix-store.geninf.io:50051' failed: error: substituter 'https://cache-local.geninf.io' is disabled
failed eval checks.x86_64-linux.postgresql —
error: … while evaluating the attribute 'drvPath' at «https://releases.nixos.org/nixpkgs/nixpkgs-26.11pre1093421.f20cd90e28fe/nixexprs.tar.xz?na …
error:
       … while evaluating the attribute 'drvPath'
         at «https://releases.nixos.org/nixpkgs/nixpkgs-26.11pre1093421.f20cd90e28fe/nixexprs.tar.xz?narHash=sha256-MTJCMrhDFb%2BGRbLxBPTp8kB4dDlO%2BegmQ5qsJgYuaWw%3D»/lib/customisation.nix:416:11:
          415|         // {
          416|           drvPath =
             |           ^
          417|             assert condition;

       … while calling the 'derivationStrict' builtin
         at «nix-internal»/derivation-internal.nix:37:12:
           36|
           37|   strict = derivationStrict drvAttrs;
             |            ^
           38|

       … while evaluating the option `driverConfiguration.vlans':

       … while evaluating definitions from `/nix/store/4b8fr08m7yklfr8vmfsjsclvv2aa0764-source/nixos/lib/testing/driver-configuration.nix':

       … while evaluating the option `containers.machine.networking.interfaces':

       … while evaluating definitions from `/nix/store/4b8fr08m7yklfr8vmfsjsclvv2aa0764-source/nixos/modules/hardware/facter/networking':

       … while evaluating the option `containers.machine.hardware.facter.enable':

       … while evaluating the option `containers.machine.hardware.facter.report':

       … while evaluating the option `containers.machine.hardware.facter.reportPath':

       … while evaluating definitions from `/nix/store/bdgda00miwpfryv6z30vdgrw0szvviya-source/nixosModules/clanCore/nixos-facter.nix':

       (stack trace truncated; use '--show-trace' to show the full, detailed trace)

       error: gRPC QueryValidPaths on 'nix-store.geninf.io:50051' failed: error: substituter 'https://cache-local.geninf.io' is disabled
failed eval checks.x86_64-linux.service-dummy-test —
error: … while evaluating the attribute 'drvPath' at «https://releases.nixos.org/nixpkgs/nixpkgs-26.11pre1093421.f20cd90e28fe/nixexprs.tar.xz?na …
error:
       … while evaluating the attribute 'drvPath'
         at «https://releases.nixos.org/nixpkgs/nixpkgs-26.11pre1093421.f20cd90e28fe/nixexprs.tar.xz?narHash=sha256-MTJCMrhDFb%2BGRbLxBPTp8kB4dDlO%2BegmQ5qsJgYuaWw%3D»/lib/customisation.nix:416:11:
          415|         // {
          416|           drvPath =
             |           ^
          417|             assert condition;

       … while calling the 'derivationStrict' builtin
         at «nix-internal»/derivation-internal.nix:37:12:
           36|
           37|   strict = derivationStrict drvAttrs;
             |            ^
           38|

       … while evaluating the option `driverConfiguration.vlans':

       … while evaluating definitions from `/nix/store/4b8fr08m7yklfr8vmfsjsclvv2aa0764-source/nixos/lib/testing/driver-configuration.nix':

       … while evaluating the option `containers.admin1.networking.interfaces':

       … while evaluating definitions from `/nix/store/4b8fr08m7yklfr8vmfsjsclvv2aa0764-source/nixos/modules/hardware/facter/networking':

       … while evaluating the option `containers.admin1.hardware.facter.enable':

       … while evaluating the option `containers.admin1.hardware.facter.report':

       … while evaluating the option `containers.admin1.hardware.facter.reportPath':

       … while evaluating definitions from `/nix/store/bdgda00miwpfryv6z30vdgrw0szvviya-source/nixosModules/clanCore/nixos-facter.nix':

       (stack trace truncated; use '--show-trace' to show the full, detailed trace)

       error: gRPC QueryValidPaths on 'nix-store.geninf.io:50051' failed: error: substituter 'https://cache-local.geninf.io' is disabled
failed eval checks.x86_64-linux.service-dummy-test-from-flake —
error: … while evaluating the attribute 'drvPath' at «https://releases.nixos.org/nixpkgs/nixpkgs-26.11pre1093421.f20cd90e28fe/nixexprs.tar.xz?na …
error:
       … while evaluating the attribute 'drvPath'
         at «https://releases.nixos.org/nixpkgs/nixpkgs-26.11pre1093421.f20cd90e28fe/nixexprs.tar.xz?narHash=sha256-MTJCMrhDFb%2BGRbLxBPTp8kB4dDlO%2BegmQ5qsJgYuaWw%3D»/lib/customisation.nix:416:11:
          415|         // {
          416|           drvPath =
             |           ^
          417|             assert condition;

       … while calling the 'derivationStrict' builtin
         at «nix-internal»/derivation-internal.nix:37:12:
           36|
           37|   strict = derivationStrict drvAttrs;
             |            ^
           38|

       … while evaluating the option `driverConfiguration.vlans':

       … while evaluating definitions from `/nix/store/4b8fr08m7yklfr8vmfsjsclvv2aa0764-source/nixos/lib/testing/driver-configuration.nix':

       … while evaluating the option `containers.peer1.networking.interfaces':

       … while evaluating definitions from `/nix/store/4b8fr08m7yklfr8vmfsjsclvv2aa0764-source/nixos/modules/hardware/facter/networking':

       … while evaluating the option `containers.peer1.hardware.facter.enable':

       … while evaluating the option `containers.peer1.hardware.facter.report':

       … while evaluating the option `containers.peer1.hardware.facter.reportPath':

       … while evaluating definitions from `/nix/store/bdgda00miwpfryv6z30vdgrw0szvviya-source/nixosModules/clanCore/nixos-facter.nix':

       (stack trace truncated; use '--show-trace' to show the full, detailed trace)

       error: gRPC QueryValidPaths on 'nix-store.geninf.io:50051' failed: error: substituter 'https://cache-local.geninf.io' is disabled
failed eval checks.x86_64-linux.sshd —
error: … while evaluating the attribute 'drvPath' at «https://releases.nixos.org/nixpkgs/nixpkgs-26.11pre1093421.f20cd90e28fe/nixexprs.tar.xz?na …
error:
       … while evaluating the attribute 'drvPath'
         at «https://releases.nixos.org/nixpkgs/nixpkgs-26.11pre1093421.f20cd90e28fe/nixexprs.tar.xz?narHash=sha256-MTJCMrhDFb%2BGRbLxBPTp8kB4dDlO%2BegmQ5qsJgYuaWw%3D»/lib/customisation.nix:416:11:
          415|         // {
          416|           drvPath =
             |           ^
          417|             assert condition;

       … while calling the 'derivationStrict' builtin
         at «nix-internal»/derivation-internal.nix:37:12:
           36|
           37|   strict = derivationStrict drvAttrs;
             |            ^
           38|

       … while evaluating the option `driverConfiguration.vlans':

       … while evaluating definitions from `/nix/store/4b8fr08m7yklfr8vmfsjsclvv2aa0764-source/nixos/lib/testing/driver-configuration.nix':

       … while evaluating the option `containers.client.networking.interfaces':

       … while evaluating definitions from `/nix/store/4b8fr08m7yklfr8vmfsjsclvv2aa0764-source/nixos/modules/hardware/facter/networking':

       … while evaluating the option `containers.client.hardware.facter.enable':

       … while evaluating the option `containers.client.hardware.facter.report':

       … while evaluating the option `containers.client.hardware.facter.reportPath':

       … while evaluating definitions from `/nix/store/bdgda00miwpfryv6z30vdgrw0szvviya-source/nixosModules/clanCore/nixos-facter.nix':

       (stack trace truncated; use '--show-trace' to show the full, detailed trace)

       error: path '/nix/store/vkli75cmjvhb8fqr8hdwmvq4f7a171a5-merged-test-dir-sshd' is not valid
failed eval checks.x86_64-linux.sshd-no-ca —
error: … while evaluating the attribute 'drvPath' at «https://releases.nixos.org/nixpkgs/nixpkgs-26.11pre1093421.f20cd90e28fe/nixexprs.tar.xz?na …
error:
       … while evaluating the attribute 'drvPath'
         at «https://releases.nixos.org/nixpkgs/nixpkgs-26.11pre1093421.f20cd90e28fe/nixexprs.tar.xz?narHash=sha256-MTJCMrhDFb%2BGRbLxBPTp8kB4dDlO%2BegmQ5qsJgYuaWw%3D»/lib/customisation.nix:416:11:
          415|         // {
          416|           drvPath =
             |           ^
          417|             assert condition;

       … while calling the 'derivationStrict' builtin
         at «nix-internal»/derivation-internal.nix:37:12:
           36|
           37|   strict = derivationStrict drvAttrs;
             |            ^
           38|

       … while evaluating the option `driverConfiguration.vlans':

       … while evaluating definitions from `/nix/store/4b8fr08m7yklfr8vmfsjsclvv2aa0764-source/nixos/lib/testing/driver-configuration.nix':

       … while evaluating the option `containers.client.networking.interfaces':

       … while evaluating definitions from `/nix/store/4b8fr08m7yklfr8vmfsjsclvv2aa0764-source/nixos/modules/hardware/facter/networking':

       … while evaluating the option `containers.client.hardware.facter.enable':

       … while evaluating the option `containers.client.hardware.facter.report':

       … while evaluating the option `containers.client.hardware.facter.reportPath':

       … while evaluating definitions from `/nix/store/bdgda00miwpfryv6z30vdgrw0szvviya-source/nixosModules/clanCore/nixos-facter.nix':

       (stack trace truncated; use '--show-trace' to show the full, detailed trace)

       error: gRPC FetchNars failed: error: path '/nix/store/3rk26p5fsksf4phzyza3w8sips1prpvx-merged-test-dir-sshd' is required, but there is no substituter that can build it
failed eval checks.x86_64-linux.state-version —
error: … while evaluating the attribute 'drvPath' at «https://releases.nixos.org/nixpkgs/nixpkgs-26.11pre1093421.f20cd90e28fe/nixexprs.tar.xz?na …
error:
       … while evaluating the attribute 'drvPath'
         at «https://releases.nixos.org/nixpkgs/nixpkgs-26.11pre1093421.f20cd90e28fe/nixexprs.tar.xz?narHash=sha256-MTJCMrhDFb%2BGRbLxBPTp8kB4dDlO%2BegmQ5qsJgYuaWw%3D»/lib/customisation.nix:416:11:
          415|         // {
          416|           drvPath =
             |           ^
          417|             assert condition;

       … while calling the 'derivationStrict' builtin
         at «nix-internal»/derivation-internal.nix:37:12:
           36|
           37|   strict = derivationStrict drvAttrs;
             |            ^
           38|

       … while evaluating the option `driverConfiguration.vlans':

       … while evaluating definitions from `/nix/store/4b8fr08m7yklfr8vmfsjsclvv2aa0764-source/nixos/lib/testing/driver-configuration.nix':

       … while evaluating the option `containers.server.networking.interfaces':

       … while evaluating definitions from `/nix/store/4b8fr08m7yklfr8vmfsjsclvv2aa0764-source/nixos/modules/hardware/facter/networking':

       … while evaluating the option `containers.server.hardware.facter.enable':

       … while evaluating the option `containers.server.hardware.facter.report':

       … while evaluating the option `containers.server.hardware.facter.reportPath':

       … while evaluating definitions from `/nix/store/bdgda00miwpfryv6z30vdgrw0szvviya-source/nixosModules/clanCore/nixos-facter.nix':

       (stack trace truncated; use '--show-trace' to show the full, detailed trace)

       error: path '/nix/store/s7sfws69mkwxi2b354sxysbd50zcdgfv-merged-test-dir-service-state-version' is not valid
failed eval checks.x86_64-linux.syncthing-service —
error: … while evaluating the attribute 'drvPath' at «https://releases.nixos.org/nixpkgs/nixpkgs-26.11pre1093421.f20cd90e28fe/nixexprs.tar.xz?na …
error:
       … while evaluating the attribute 'drvPath'
         at «https://releases.nixos.org/nixpkgs/nixpkgs-26.11pre1093421.f20cd90e28fe/nixexprs.tar.xz?narHash=sha256-MTJCMrhDFb%2BGRbLxBPTp8kB4dDlO%2BegmQ5qsJgYuaWw%3D»/lib/customisation.nix:416:11:
          415|         // {
          416|           drvPath =
             |           ^
          417|             assert condition;

       … while calling the 'derivationStrict' builtin
         at «nix-internal»/derivation-internal.nix:37:12:
           36|
           37|   strict = derivationStrict drvAttrs;
             |            ^
           38|

       … while evaluating the option `driverConfiguration.vlans':

       … while evaluating definitions from `/nix/store/4b8fr08m7yklfr8vmfsjsclvv2aa0764-source/nixos/lib/testing/driver-configuration.nix':

       … while evaluating the option `containers.machine1.networking.interfaces':

       … while evaluating definitions from `/nix/store/4b8fr08m7yklfr8vmfsjsclvv2aa0764-source/nixos/modules/hardware/facter/networking':

       … while evaluating the option `containers.machine1.hardware.facter.enable':

       … while evaluating the option `containers.machine1.hardware.facter.report':

       … while evaluating the option `containers.machine1.hardware.facter.reportPath':

       … while evaluating definitions from `/nix/store/bdgda00miwpfryv6z30vdgrw0szvviya-source/nixosModules/clanCore/nixos-facter.nix':

       (stack trace truncated; use '--show-trace' to show the full, detailed trace)

       error: gRPC QueryValidPaths on 'nix-store.geninf.io:50051' failed: error: substituter 'https://cache-local.geninf.io' is disabled
failed eval checks.x86_64-linux.template-minimal —
error: … while evaluating the attribute 'nixosConfigurations.testmachine.config.system.build.toplevel' at /nix/store/lnd453b3xm5ri54szzdqqkz5iqf …
error:
       … while evaluating the attribute 'nixosConfigurations.testmachine.config.system.build.toplevel'
         at /nix/store/lnd453b3xm5ri54szzdqqkz5iqfw9k37-minimal-clan-flake/flake.nix:19:29:
           18|       # all machines managed by Clan
           19|       inherit (clan.config) nixosConfigurations nixosModules clanInternals;
             |                             ^
           20|       clan = clan.config;

       … while evaluating the attribute 'value'
         at «https://releases.nixos.org/nixpkgs/nixpkgs-26.11pre1093421.f20cd90e28fe/nixexprs.tar.xz?narHash=sha256-MTJCMrhDFb%2BGRbLxBPTp8kB4dDlO%2BegmQ5qsJgYuaWw%3D»/lib/modules.nix:1181:7:
         1180|     // {
         1181|       value = addErrorContext "while evaluating the option `${showOption loc}':" (
             |       ^
         1182|         # Apply the 'apply' function to the merged value. This allows options to

       … while evaluating the option `nixosConfigurations':

       … while evaluating definitions from `/nix/store/bdgda00miwpfryv6z30vdgrw0szvviya-source/modules/clan/module.nix':

       … while evaluating the option `clanInternals.inventoryClass.machines':

       … while evaluating definitions from `/nix/store/bdgda00miwpfryv6z30vdgrw0szvviya-source/modules/clan/distributed-services.nix':

       … while evaluating the option `_allMachines':

       … while evaluating the option `inventory':

       (stack trace truncated; use '--show-trace' to show the full, detailed trace)

       error: gRPC QueryValidPaths on 'nix-store.geninf.io:50051' failed: error: substituter 'https://cache-local.geninf.io' is disabled
failed eval checks.x86_64-linux.trusted-nix-caches —
error: … while evaluating the attribute 'drvPath' at «https://releases.nixos.org/nixpkgs/nixpkgs-26.11pre1093421.f20cd90e28fe/nixexprs.tar.xz?na …
error:
       … while evaluating the attribute 'drvPath'
         at «https://releases.nixos.org/nixpkgs/nixpkgs-26.11pre1093421.f20cd90e28fe/nixexprs.tar.xz?narHash=sha256-MTJCMrhDFb%2BGRbLxBPTp8kB4dDlO%2BegmQ5qsJgYuaWw%3D»/lib/customisation.nix:416:11:
          415|         // {
          416|           drvPath =
             |           ^
          417|             assert condition;

       … while calling the 'derivationStrict' builtin
         at «nix-internal»/derivation-internal.nix:37:12:
           36|
           37|   strict = derivationStrict drvAttrs;
             |            ^
           38|

       … while evaluating the option `driverConfiguration.vlans':

       … while evaluating definitions from `/nix/store/4b8fr08m7yklfr8vmfsjsclvv2aa0764-source/nixos/lib/testing/driver-configuration.nix':

       … while evaluating the option `containers.server.networking.interfaces':

       … while evaluating definitions from `/nix/store/4b8fr08m7yklfr8vmfsjsclvv2aa0764-source/nixos/modules/hardware/facter/networking':

       … while evaluating the option `containers.server.hardware.facter.enable':

       … while evaluating the option `containers.server.hardware.facter.report':

       … while evaluating the option `containers.server.hardware.facter.reportPath':

       … while evaluating definitions from `/nix/store/bdgda00miwpfryv6z30vdgrw0szvviya-source/nixosModules/clanCore/nixos-facter.nix':

       (stack trace truncated; use '--show-trace' to show the full, detailed trace)

       error: path '/nix/store/vpnlam3n7p100683pyxs7262x24cp8d9-merged-test-dir-trusted-nix-caches' is not valid
failed eval checks.x86_64-linux.users —
error: … while evaluating the attribute 'drvPath' at «https://releases.nixos.org/nixpkgs/nixpkgs-26.11pre1093421.f20cd90e28fe/nixexprs.tar.xz?na …
error:
       … while evaluating the attribute 'drvPath'
         at «https://releases.nixos.org/nixpkgs/nixpkgs-26.11pre1093421.f20cd90e28fe/nixexprs.tar.xz?narHash=sha256-MTJCMrhDFb%2BGRbLxBPTp8kB4dDlO%2BegmQ5qsJgYuaWw%3D»/lib/customisation.nix:416:11:
          415|         // {
          416|           drvPath =
             |           ^
          417|             assert condition;

       … while calling the 'derivationStrict' builtin
         at «nix-internal»/derivation-internal.nix:37:12:
           36|
           37|   strict = derivationStrict drvAttrs;
             |            ^
           38|

       … while evaluating the option `driverConfiguration.vlans':

       … while evaluating definitions from `/nix/store/4b8fr08m7yklfr8vmfsjsclvv2aa0764-source/nixos/lib/testing/driver-configuration.nix':

       … while evaluating the option `containers.server.networking.interfaces':

       … while evaluating definitions from `/nix/store/4b8fr08m7yklfr8vmfsjsclvv2aa0764-source/nixos/modules/hardware/facter/networking':

       … while evaluating the option `containers.server.hardware.facter.enable':

       … while evaluating the option `containers.server.hardware.facter.report':

       … while evaluating the option `containers.server.hardware.facter.reportPath':

       … while evaluating definitions from `/nix/store/bdgda00miwpfryv6z30vdgrw0szvviya-source/nixosModules/clanCore/nixos-facter.nix':

       (stack trace truncated; use '--show-trace' to show the full, detailed trace)

       error: gRPC QueryValidPaths on 'nix-store.geninf.io:50051' failed: error: substituter 'https://cache-local.geninf.io' is disabled
failed eval checks.x86_64-linux.wifi —
error: … while evaluating the attribute 'drvPath' at «https://releases.nixos.org/nixpkgs/nixpkgs-26.11pre1093421.f20cd90e28fe/nixexprs.tar.xz?na …
error:
       … while evaluating the attribute 'drvPath'
         at «https://releases.nixos.org/nixpkgs/nixpkgs-26.11pre1093421.f20cd90e28fe/nixexprs.tar.xz?narHash=sha256-MTJCMrhDFb%2BGRbLxBPTp8kB4dDlO%2BegmQ5qsJgYuaWw%3D»/lib/customisation.nix:416:11:
          415|         // {
          416|           drvPath =
             |           ^
          417|             assert condition;

       … while calling the 'derivationStrict' builtin
         at «nix-internal»/derivation-internal.nix:37:12:
           36|
           37|   strict = derivationStrict drvAttrs;
             |            ^
           38|

       … while evaluating the option `driverConfiguration.vlans':

       … while evaluating definitions from `/nix/store/4b8fr08m7yklfr8vmfsjsclvv2aa0764-source/nixos/lib/testing/driver-configuration.nix':

       … while evaluating the option `nodes.second.networking.interfaces':

       … while evaluating definitions from `/nix/store/4b8fr08m7yklfr8vmfsjsclvv2aa0764-source/nixos/modules/hardware/facter/networking':

       … while evaluating the option `nodes.second.hardware.facter.enable':

       … while evaluating the option `nodes.second.hardware.facter.report':

       … while evaluating the option `nodes.second.hardware.facter.reportPath':

       … while evaluating definitions from `/nix/store/bdgda00miwpfryv6z30vdgrw0szvviya-source/nixosModules/clanCore/nixos-facter.nix':

       (stack trace truncated; use '--show-trace' to show the full, detailed trace)

       error: gRPC QueryValidPaths on 'nix-store.geninf.io:50051' failed: error: substituter 'https://cache-local.geninf.io' is disabled
failed eval checks.x86_64-linux.wireguard —
error: … while evaluating the attribute 'drvPath' at «https://releases.nixos.org/nixpkgs/nixpkgs-26.11pre1093421.f20cd90e28fe/nixexprs.tar.xz?na …
error:
       … while evaluating the attribute 'drvPath'
         at «https://releases.nixos.org/nixpkgs/nixpkgs-26.11pre1093421.f20cd90e28fe/nixexprs.tar.xz?narHash=sha256-MTJCMrhDFb%2BGRbLxBPTp8kB4dDlO%2BegmQ5qsJgYuaWw%3D»/lib/customisation.nix:416:11:
          415|         // {
          416|           drvPath =
             |           ^
          417|             assert condition;

       … while calling the 'derivationStrict' builtin
         at «nix-internal»/derivation-internal.nix:37:12:
           36|
           37|   strict = derivationStrict drvAttrs;
             |            ^
           38|

       … while evaluating the option `driverConfiguration.vlans':

       … while evaluating definitions from `/nix/store/4b8fr08m7yklfr8vmfsjsclvv2aa0764-source/nixos/lib/testing/driver-configuration.nix':

       … while evaluating the option `containers.ctrl1.networking.interfaces':

       … while evaluating definitions from `/nix/store/4b8fr08m7yklfr8vmfsjsclvv2aa0764-source/nixos/modules/hardware/facter/networking':

       … while evaluating the option `containers.ctrl1.hardware.facter.enable':

       … while evaluating the option `containers.ctrl1.hardware.facter.report':

       … while evaluating the option `containers.ctrl1.hardware.facter.reportPath':

       … while evaluating definitions from `/nix/store/bdgda00miwpfryv6z30vdgrw0szvviya-source/nixosModules/clanCore/nixos-facter.nix':

       (stack trace truncated; use '--show-trace' to show the full, detailed trace)

       error: gRPC QueryValidPaths on 'nix-store.geninf.io:50051' failed: error: substituter 'https://cache-local.geninf.io' is disabled
failed eval checks.x86_64-linux.yggdrasil —
error: … while evaluating the attribute 'drvPath' at «https://releases.nixos.org/nixpkgs/nixpkgs-26.11pre1093421.f20cd90e28fe/nixexprs.tar.xz?na …
error:
       … while evaluating the attribute 'drvPath'
         at «https://releases.nixos.org/nixpkgs/nixpkgs-26.11pre1093421.f20cd90e28fe/nixexprs.tar.xz?narHash=sha256-MTJCMrhDFb%2BGRbLxBPTp8kB4dDlO%2BegmQ5qsJgYuaWw%3D»/lib/customisation.nix:416:11:
          415|         // {
          416|           drvPath =
             |           ^
          417|             assert condition;

       … while calling the 'derivationStrict' builtin
         at «nix-internal»/derivation-internal.nix:37:12:
           36|
           37|   strict = derivationStrict drvAttrs;
             |            ^
           38|

       … while evaluating the option `driverConfiguration.vlans':

       … while evaluating definitions from `/nix/store/4b8fr08m7yklfr8vmfsjsclvv2aa0764-source/nixos/lib/testing/driver-configuration.nix':

       … while evaluating the option `nodes.outsider.networking.interfaces':

       … while evaluating definitions from `/nix/store/4b8fr08m7yklfr8vmfsjsclvv2aa0764-source/nixos/modules/hardware/facter/networking':

       … while evaluating the option `nodes.outsider.hardware.facter.enable':

       … while evaluating the option `nodes.outsider.hardware.facter.report':

       … while evaluating the option `nodes.outsider.hardware.facter.reportPath':

       … while evaluating definitions from `/nix/store/bdgda00miwpfryv6z30vdgrw0szvviya-source/nixosModules/clanCore/nixos-facter.nix':

       (stack trace truncated; use '--show-trace' to show the full, detailed trace)

       error: path '/nix/store/28g5drrx5dkhbc17c3z1xmr9r9by0v6g-merged-test-dir-yggdrasil' is not valid
failed eval checks.x86_64-linux.zerotier —
error: … while evaluating the attribute 'drvPath' at «https://releases.nixos.org/nixpkgs/nixpkgs-26.11pre1093421.f20cd90e28fe/nixexprs.tar.xz?na …
error:
       … while evaluating the attribute 'drvPath'
         at «https://releases.nixos.org/nixpkgs/nixpkgs-26.11pre1093421.f20cd90e28fe/nixexprs.tar.xz?narHash=sha256-MTJCMrhDFb%2BGRbLxBPTp8kB4dDlO%2BegmQ5qsJgYuaWw%3D»/lib/customisation.nix:416:11:
          415|         // {
          416|           drvPath =
             |           ^
          417|             assert condition;

       … while calling the 'derivationStrict' builtin
         at «nix-internal»/derivation-internal.nix:37:12:
           36|
           37|   strict = derivationStrict drvAttrs;
             |            ^
           38|

       … while evaluating the option `driverConfiguration.vlans':

       … while evaluating definitions from `/nix/store/4b8fr08m7yklfr8vmfsjsclvv2aa0764-source/nixos/lib/testing/driver-configuration.nix':

       … while evaluating the option `nodes.controller.networking.interfaces':

       … while evaluating definitions from `/nix/store/4b8fr08m7yklfr8vmfsjsclvv2aa0764-source/nixos/modules/hardware/facter/networking':

       … while evaluating the option `nodes.controller.hardware.facter.enable':

       … while evaluating the option `nodes.controller.hardware.facter.report':

       … while evaluating the option `nodes.controller.hardware.facter.reportPath':

       … while evaluating definitions from `/nix/store/bdgda00miwpfryv6z30vdgrw0szvviya-source/nixosModules/clanCore/nixos-facter.nix':

       (stack trace truncated; use '--show-trace' to show the full, detailed trace)

       error: gRPC QueryValidPaths on 'nix-store.geninf.io:50051' failed: error: substituter 'https://cache-local.geninf.io' is disabled
failed eval checks.x86_64-linux.zerotier-multi-instance —
error: … while evaluating the attribute 'drvPath' at «https://releases.nixos.org/nixpkgs/nixpkgs-26.11pre1093421.f20cd90e28fe/nixexprs.tar.xz?na …
error:
       … while evaluating the attribute 'drvPath'
         at «https://releases.nixos.org/nixpkgs/nixpkgs-26.11pre1093421.f20cd90e28fe/nixexprs.tar.xz?narHash=sha256-MTJCMrhDFb%2BGRbLxBPTp8kB4dDlO%2BegmQ5qsJgYuaWw%3D»/lib/customisation.nix:416:11:
          415|         // {
          416|           drvPath =
             |           ^
          417|             assert condition;

       … while calling the 'derivationStrict' builtin
         at «nix-internal»/derivation-internal.nix:37:12:
           36|
           37|   strict = derivationStrict drvAttrs;
             |            ^
           38|

       … while evaluating the option `driverConfiguration.test_script':

       … while evaluating definitions from `/nix/store/4b8fr08m7yklfr8vmfsjsclvv2aa0764-source/nixos/lib/testing/driver-configuration.nix':

       … while evaluating the option `testScriptString':

       … while evaluating definitions from `/nix/store/4b8fr08m7yklfr8vmfsjsclvv2aa0764-source/nixos/lib/testing/testScript.nix':

       … while evaluating definitions from `/nix/store/bdgda00miwpfryv6z30vdgrw0szvviya-source/clanServices/zerotier/tests/vm-multi-instance/default.nix':

       … while evaluating the option `nodes.alpha.clan.core.vars.generators.zerotier-ip-alpha-net-a.files.ip.value':

       … while evaluating definitions from `/nix/store/bdgda00miwpfryv6z30vdgrw0szvviya-source/nixosModules/clanCore/vars/public/in_repo.nix, via option nodes.alpha.clan.core.vars.settings.fileModule':

       … while evaluating the option `nodes.alpha.clan.core.vars.generators.zerotier-ip-alpha-net-a.files.ip.exists':

       … while evaluating definitions from `/nix/store/bdgda00miwpfryv6z30vdgrw0szvviya-source/nixosModules/clanCore/vars/public/in_repo.nix, via option nodes.alpha.clan.core.vars.settings.fileModule':

       (stack trace truncated; use '--show-trace' to show the full, detailed trace)

       error: gRPC QueryValidPaths on 'nix-store.geninf.io:50051' failed: error: substituter 'https://cache-local.geninf.io' is disabled
10 cancelled
cancelled attributes
status attribute duration
loading…
9 succeeded
succeeded attributes
status attribute duration
loading…
18 already built
skipped attributes
status attribute duration
loading…