nixbot

builds

clan/clan-core build #1050 failed

branch 26.05 · PR #8259 · commit d7419c8aef · · took 4m 16s

nix-eval-jobs failed with exit code 1:
       … while evaluating the option `nodes.client.networking.interfaces':

       … while evaluating definitions from `/nix/store/jbynv157ydjc1f6nsn97c67h4q41yvjf-source/nixos/modules/hardware/facter/networking':

       … while evaluating the option `nodes.client.hardware.facter.enable':

       … while evaluating the option `nodes.client.hardware.facter.report':

       … while evaluating the option `nodes.client.hardware.facter.reportPath':

       … while evaluating definitions from `/nix/store/cy9pmr064f1qh8w2mhh1h82b0rdqjqva-source/nixosModules/clanCore/nixos-facter.nix':

       (stack trace truncated; use '--show-trace' to show the full, detailed trace)

       error: gRPC QueryValidPaths on 'nix-store.geninf.io:50051' failed: error: substituter 'https://cache-local.geninf.io' is disabled
error:
       … while evaluating the attribute 'drvPath'
         at «https://releases.nixos.org/nixos/26.05/nixos-26.05.12250.f3a73bcf5d1c/nixexprs.tar.xz?narHash=sha256-9vaC514eu0ogJHxt6A0qQLtdfqHA15OnBVEstArd2NY%3D»/lib/customisation.nix:427:7:
          426|     // {
          427|       drvPath =
             |       ^
          428|         assert condition;

       … while calling the 'derivationStrict' builtin
         at «nix-internal»/derivation-internal.nix:37:12:
           36|
           37|   strict = derivationStrict drvAttrs;
             |            ^
           38|

       … while evaluating the option `driverConfiguration.vlans':

       … while evaluating definitions from `/nix/store/jbynv157ydjc1f6nsn97c67h4q41yvjf-source/nixos/lib/testing/driver-configuration.nix':

       … while evaluating the option `nodes.server.networking.interfaces':

       … while evaluating definitions from `/nix/store/jbynv157ydjc1f6nsn97c67h4q41yvjf-source/ni …
eval warnings 3 kinds · 7 occurrences
  • error ×3
  • error gRPC QueryValidPaths on 'nix-store.geninf.io:50051' failed: error: substituter 'https://cache-local.geninf.io/…' is disabled ×3
  • error path '/nix/store/…-merged-test-dir-mycelium' is not valid ×1

4 failed
failed attributes
status attribute duration
failed checks.x86_64-linux.all-packages 2m 8s
setup: /nix/store/y8pcfmrf6byyda20a4pp901hbg0wi1qz-zbar-0.23.93 /nix/store/d8f2wmq1x0zdscvbl2754cdni852fdar-zbar-0.23.93-lib /nix/store/9rqr0vy9hbnnmzsf26 …
setup:
  /nix/store/y8pcfmrf6byyda20a4pp901hbg0wi1qz-zbar-0.23.93
  /nix/store/d8f2wmq1x0zdscvbl2754cdni852fdar-zbar-0.23.93-lib
  /nix/store/9rqr0vy9hbnnmzsf26zy95xhzd5ax75x-zerotier-tools-0.1.0
  /nix/store/jq9s7f576pnd0ccbjwb5ybr427d2glfk-zerotierone-1.16.0
  /nix/store/yss4h5wz16171c7jfhfhi5gd9610rs4s-zfs-user-2.4.4
  /nix/store/1hjg44rywjpc52nnhs1z9iba9vgr2s3n-zstd-1.5.7-dev
warning: ignoring the client-specified setting 'store', because it is a restricted setting and you are not a trusted user
error: gRPC QueryValidPaths on 'nix-store.geninf.io:50051' failed: error: substituter 'https://cache-local.geninf.io' is disabled
failed eval checks.x86_64-linux.clan-test-update —
error: … while evaluating the attribute 'drvPath' at «https://releases.nixos.org/nixos/26.05/nixos-26.05.12250.f3a73bcf5d1c/nixexprs.tar.xz?narH …
error:
       … while evaluating the attribute 'drvPath'
         at «https://releases.nixos.org/nixos/26.05/nixos-26.05.12250.f3a73bcf5d1c/nixexprs.tar.xz?narHash=sha256-9vaC514eu0ogJHxt6A0qQLtdfqHA15OnBVEstArd2NY%3D»/lib/customisation.nix:427:7:
          426|     // {
          427|       drvPath =
             |       ^
          428|         assert condition;

       … while calling the 'derivationStrict' builtin
         at «nix-internal»/derivation-internal.nix:37:12:
           36|
           37|   strict = derivationStrict drvAttrs;
             |            ^
           38|

       … while evaluating the option `nodes.test-update-machine.networking.interfaces':

       … while evaluating definitions from `/nix/store/jbynv157ydjc1f6nsn97c67h4q41yvjf-source/nixos/modules/hardware/facter/networking':

       … while evaluating the option `nodes.test-update-machine.hardware.facter.enable':

       … while evaluating the option `nodes.test-update-machine.hardware.facter.report':

       … while evaluating the option `nodes.test-update-machine.hardware.facter.reportPath':

       … while evaluating definitions from `/nix/store/cy9pmr064f1qh8w2mhh1h82b0rdqjqva-source/nixosModules/clanCore/nixos-facter.nix':

       (stack trace truncated; use '--show-trace' to show the full, detailed trace)

       error: gRPC QueryValidPaths on 'nix-store.geninf.io:50051' failed: error: substituter 'https://cache-local.geninf.io' is disabled
failed eval checks.x86_64-linux.kde —
error: … while evaluating the attribute 'drvPath' at «https://releases.nixos.org/nixos/26.05/nixos-26.05.12250.f3a73bcf5d1c/nixexprs.tar.xz?narH …
error:
       … while evaluating the attribute 'drvPath'
         at «https://releases.nixos.org/nixos/26.05/nixos-26.05.12250.f3a73bcf5d1c/nixexprs.tar.xz?narHash=sha256-9vaC514eu0ogJHxt6A0qQLtdfqHA15OnBVEstArd2NY%3D»/lib/customisation.nix:427:7:
          426|     // {
          427|       drvPath =
             |       ^
          428|         assert condition;

       … while calling the 'derivationStrict' builtin
         at «nix-internal»/derivation-internal.nix:37:12:
           36|
           37|   strict = derivationStrict drvAttrs;
             |            ^
           38|

       … while evaluating the option `nodes.client.networking.interfaces':

       … while evaluating definitions from `/nix/store/jbynv157ydjc1f6nsn97c67h4q41yvjf-source/nixos/modules/hardware/facter/networking':

       … while evaluating the option `nodes.client.hardware.facter.enable':

       … while evaluating the option `nodes.client.hardware.facter.report':

       … while evaluating the option `nodes.client.hardware.facter.reportPath':

       … while evaluating definitions from `/nix/store/cy9pmr064f1qh8w2mhh1h82b0rdqjqva-source/nixosModules/clanCore/nixos-facter.nix':

       (stack trace truncated; use '--show-trace' to show the full, detailed trace)

       error: gRPC QueryValidPaths on 'nix-store.geninf.io:50051' failed: error: substituter 'https://cache-local.geninf.io' is disabled
failed eval checks.x86_64-linux.mycelium —
error: … while evaluating the attribute 'drvPath' at «https://releases.nixos.org/nixos/26.05/nixos-26.05.12250.f3a73bcf5d1c/nixexprs.tar.xz?narH …
error:
       … while evaluating the attribute 'drvPath'
         at «https://releases.nixos.org/nixos/26.05/nixos-26.05.12250.f3a73bcf5d1c/nixexprs.tar.xz?narHash=sha256-9vaC514eu0ogJHxt6A0qQLtdfqHA15OnBVEstArd2NY%3D»/lib/customisation.nix:427:7:
          426|     // {
          427|       drvPath =
             |       ^
          428|         assert condition;

       … while calling the 'derivationStrict' builtin
         at «nix-internal»/derivation-internal.nix:37:12:
           36|
           37|   strict = derivationStrict drvAttrs;
             |            ^
           38|

       … while evaluating the option `driverConfiguration.vlans':

       … while evaluating definitions from `/nix/store/jbynv157ydjc1f6nsn97c67h4q41yvjf-source/nixos/lib/testing/driver-configuration.nix':

       … while evaluating the option `nodes.server.networking.interfaces':

       … while evaluating definitions from `/nix/store/jbynv157ydjc1f6nsn97c67h4q41yvjf-source/nixos/modules/hardware/facter/networking':

       … while evaluating the option `nodes.server.hardware.facter.enable':

       … while evaluating the option `nodes.server.hardware.facter.report':

       … while evaluating the option `nodes.server.hardware.facter.reportPath':

       … while evaluating definitions from `/nix/store/cy9pmr064f1qh8w2mhh1h82b0rdqjqva-source/nixosModules/clanCore/nixos-facter.nix':

       (stack trace truncated; use '--show-trace' to show the full, detailed trace)

       error: path '/nix/store/v1fjdi8yq4svd6yx0fkl35gji8yjarsg-merged-test-dir-mycelium' is not valid
9 succeeded
succeeded attributes
status attribute duration
loading…
80 already built
skipped attributes
status attribute duration
loading…