nixbot

builds

clan/clan-core build #1049 failed

branch main · PR #8254 · commit 6efa8e7774 · · took 1m 20s

nix-eval-jobs failed with exit code 1:
       … while evaluating definitions from `/nix/store/zsrn88vjmb5hmshm6fimai52blbk3nlc-source/nixos/modules/hardware/facter/networking':

       … while evaluating the option `containers.machine.hardware.facter.enable':

       … while evaluating the option `containers.machine.hardware.facter.report':

       … while evaluating the option `containers.machine.hardware.facter.reportPath':

       … while evaluating definitions from `/nix/store/m6r41z6xm7kxdy9dii1zzqr1x7czg2ss-source/nixosModules/clanCore/nixos-facter.nix':

       (stack trace truncated; use '--show-trace' to show the full, detailed trace)

       error: gRPC QueryValidPaths on 'nix-store.geninf.io:50051' failed: error: substituter 'https://cache-local.geninf.io' is disabled
error:
       … while evaluating the attribute 'drvPath'
         at «https://releases.nixos.org/nixpkgs/nixpkgs-26.11pre1097569.e513db7b0a65/nixexprs.tar.xz?narHash=sha256-jWdazKTNUOJQ3KE%2B9BAvpBOo6THrD0Qyb3S8F2GduUI%3D»/lib/customisation.nix:416:11:
          415|         // {
          416|           drvPath =
             |           ^
          417|             assert condition;

       … while calling the 'derivationStrict' builtin
         at «nix-internal»/derivation-internal.nix:37:12:
           36|
           37|   strict = derivationStrict drvAttrs;
             |            ^
           38|

       … while evaluating the option `driverConfiguration.containers.client.start_script':

       … while evaluating definitions from `/nix/store/zsrn88vjmb5hmshm6fimai52blbk3nlc-source/nixos/lib/testing/driver-configuration.nix':

       … while evaluating definitions from `/nix/store/zsrn88vjmb5hmshm6fimai52blbk3nlc-source/nixos/modules/virtualisation/nspawn-container':

       … while evaluating the option `con …
eval warnings 6 kinds · 71 occurrences
  • error ×34
  • error gRPC QueryValidPaths on 'nix-store.geninf.io:50051' failed: error: substituter 'https://cache-local.geninf.io/…' is disabled ×32
  • error path '/nix/store/…-merged-test-dir-dyndns' is not valid ×1
  • error path '/nix/store/…-merged-test-dir-ncps' is not valid ×1
  • error path '/nix/store/…-merged-test-dir-sshd' is not valid ×1
  • warn stdenv.isDarwin is deprecated, use stdenv.hostPlatform.isDarwin instead ×2

34 failed
failed attributes
status attribute duration
failed eval checks.aarch64-linux.borgbackup —
error: … while evaluating the attribute 'drvPath' at «https://releases.nixos.org/nixpkgs/nixpkgs-26.11pre1097569.e513db7b0a65/nixexprs.tar.xz?na …
error:
       … while evaluating the attribute 'drvPath'
         at «https://releases.nixos.org/nixpkgs/nixpkgs-26.11pre1097569.e513db7b0a65/nixexprs.tar.xz?narHash=sha256-jWdazKTNUOJQ3KE%2B9BAvpBOo6THrD0Qyb3S8F2GduUI%3D»/lib/customisation.nix:416:11:
          415|         // {
          416|           drvPath =
             |           ^
          417|             assert condition;

       … while calling the 'derivationStrict' builtin
         at «nix-internal»/derivation-internal.nix:37:12:
           36|
           37|   strict = derivationStrict drvAttrs;
             |            ^
           38|

       … while evaluating the option `driverConfiguration.vlans':

       … while evaluating definitions from `/nix/store/zsrn88vjmb5hmshm6fimai52blbk3nlc-source/nixos/lib/testing/driver-configuration.nix':

       … while evaluating the option `containers.clientone.networking.interfaces':

       … while evaluating definitions from `/nix/store/zsrn88vjmb5hmshm6fimai52blbk3nlc-source/nixos/modules/hardware/facter/networking':

       … while evaluating the option `containers.clientone.hardware.facter.enable':

       … while evaluating the option `containers.clientone.hardware.facter.report':

       … while evaluating the option `containers.clientone.hardware.facter.reportPath':

       … while evaluating definitions from `/nix/store/m6r41z6xm7kxdy9dii1zzqr1x7czg2ss-source/nixosModules/clanCore/nixos-facter.nix':

       (stack trace truncated; use '--show-trace' to show the full, detailed trace)

       error: gRPC QueryValidPaths on 'nix-store.geninf.io:50051' failed: error: substituter 'https://cache-local.geninf.io' is disabled
failed eval checks.aarch64-linux.certificates —
error: … while evaluating the attribute 'drvPath' at «https://releases.nixos.org/nixpkgs/nixpkgs-26.11pre1097569.e513db7b0a65/nixexprs.tar.xz?na …
error:
       … while evaluating the attribute 'drvPath'
         at «https://releases.nixos.org/nixpkgs/nixpkgs-26.11pre1097569.e513db7b0a65/nixexprs.tar.xz?narHash=sha256-jWdazKTNUOJQ3KE%2B9BAvpBOo6THrD0Qyb3S8F2GduUI%3D»/lib/customisation.nix:416:11:
          415|         // {
          416|           drvPath =
             |           ^
          417|             assert condition;

       … while calling the 'derivationStrict' builtin
         at «nix-internal»/derivation-internal.nix:37:12:
           36|
           37|   strict = derivationStrict drvAttrs;
             |            ^
           38|

       … while evaluating the option `driverConfiguration.vlans':

       … while evaluating definitions from `/nix/store/zsrn88vjmb5hmshm6fimai52blbk3nlc-source/nixos/lib/testing/driver-configuration.nix':

       … while evaluating the option `containers.ca.networking.interfaces':

       … while evaluating definitions from `/nix/store/zsrn88vjmb5hmshm6fimai52blbk3nlc-source/nixos/modules/hardware/facter/networking':

       … while evaluating the option `containers.ca.hardware.facter.enable':

       … while evaluating the option `containers.ca.hardware.facter.report':

       … while evaluating the option `containers.ca.hardware.facter.reportPath':

       … while evaluating definitions from `/nix/store/m6r41z6xm7kxdy9dii1zzqr1x7czg2ss-source/nixosModules/clanCore/nixos-facter.nix':

       (stack trace truncated; use '--show-trace' to show the full, detailed trace)

       error: gRPC QueryValidPaths on 'nix-store.geninf.io:50051' failed: error: substituter 'https://cache-local.geninf.io' is disabled
failed eval checks.aarch64-linux.data-mesher —
error: … while evaluating the attribute 'drvPath' at «https://releases.nixos.org/nixpkgs/nixpkgs-26.11pre1097569.e513db7b0a65/nixexprs.tar.xz?na …
error:
       … while evaluating the attribute 'drvPath'
         at «https://releases.nixos.org/nixpkgs/nixpkgs-26.11pre1097569.e513db7b0a65/nixexprs.tar.xz?narHash=sha256-jWdazKTNUOJQ3KE%2B9BAvpBOo6THrD0Qyb3S8F2GduUI%3D»/lib/customisation.nix:416:11:
          415|         // {
          416|           drvPath =
             |           ^
          417|             assert condition;

       … while calling the 'derivationStrict' builtin
         at «nix-internal»/derivation-internal.nix:37:12:
           36|
           37|   strict = derivationStrict drvAttrs;
             |            ^
           38|

       … while evaluating the option `driverConfiguration.test_script':

       … while evaluating definitions from `/nix/store/zsrn88vjmb5hmshm6fimai52blbk3nlc-source/nixos/lib/testing/driver-configuration.nix':

       … while evaluating the option `testScriptString':

       … while evaluating definitions from `/nix/store/zsrn88vjmb5hmshm6fimai52blbk3nlc-source/nixos/lib/testing/testScript.nix':

       … while evaluating definitions from `/nix/store/m6r41z6xm7kxdy9dii1zzqr1x7czg2ss-source/clanServices/data-mesher/tests/vm/default.nix':

       … while evaluating the option `containers.alpha.clan.core.vars.generators.data-mesher-node-identity.files."identity.pub".path':

       (stack trace truncated; use '--show-trace' to show the full, detailed trace)

       error: gRPC QueryValidPaths on 'nix-store.geninf.io:50051' failed: error: substituter 'https://cache-local.geninf.io' is disabled
failed eval checks.aarch64-linux.dm-dns —
error: … while evaluating the attribute 'drvPath' at «https://releases.nixos.org/nixpkgs/nixpkgs-26.11pre1097569.e513db7b0a65/nixexprs.tar.xz?na …
error:
       … while evaluating the attribute 'drvPath'
         at «https://releases.nixos.org/nixpkgs/nixpkgs-26.11pre1097569.e513db7b0a65/nixexprs.tar.xz?narHash=sha256-jWdazKTNUOJQ3KE%2B9BAvpBOo6THrD0Qyb3S8F2GduUI%3D»/lib/customisation.nix:416:11:
          415|         // {
          416|           drvPath =
             |           ^
          417|             assert condition;

       … while calling the 'derivationStrict' builtin
         at «nix-internal»/derivation-internal.nix:37:12:
           36|
           37|   strict = derivationStrict drvAttrs;
             |            ^
           38|

       … while evaluating the option `driverConfiguration.vlans':

       … while evaluating definitions from `/nix/store/zsrn88vjmb5hmshm6fimai52blbk3nlc-source/nixos/lib/testing/driver-configuration.nix':

       … while evaluating the option `containers.client.networking.interfaces':

       … while evaluating definitions from `/nix/store/zsrn88vjmb5hmshm6fimai52blbk3nlc-source/nixos/modules/hardware/facter/networking':

       … while evaluating the option `containers.client.hardware.facter.enable':

       … while evaluating the option `containers.client.hardware.facter.report':

       … while evaluating the option `containers.client.hardware.facter.reportPath':

       … while evaluating definitions from `/nix/store/m6r41z6xm7kxdy9dii1zzqr1x7czg2ss-source/nixosModules/clanCore/nixos-facter.nix':

       (stack trace truncated; use '--show-trace' to show the full, detailed trace)

       error: gRPC QueryValidPaths on 'nix-store.geninf.io:50051' failed: error: substituter 'https://cache-local.geninf.io' is disabled
failed eval checks.aarch64-linux.dyndns —
error: … while evaluating the attribute 'drvPath' at «https://releases.nixos.org/nixpkgs/nixpkgs-26.11pre1097569.e513db7b0a65/nixexprs.tar.xz?na …
error:
       … while evaluating the attribute 'drvPath'
         at «https://releases.nixos.org/nixpkgs/nixpkgs-26.11pre1097569.e513db7b0a65/nixexprs.tar.xz?narHash=sha256-jWdazKTNUOJQ3KE%2B9BAvpBOo6THrD0Qyb3S8F2GduUI%3D»/lib/customisation.nix:416:11:
          415|         // {
          416|           drvPath =
             |           ^
          417|             assert condition;

       … while calling the 'derivationStrict' builtin
         at «nix-internal»/derivation-internal.nix:37:12:
           36|
           37|   strict = derivationStrict drvAttrs;
             |            ^
           38|

       … while evaluating the option `driverConfiguration.vlans':

       … while evaluating definitions from `/nix/store/zsrn88vjmb5hmshm6fimai52blbk3nlc-source/nixos/lib/testing/driver-configuration.nix':

       … while evaluating the option `containers.server.networking.interfaces':

       … while evaluating definitions from `/nix/store/zsrn88vjmb5hmshm6fimai52blbk3nlc-source/nixos/modules/hardware/facter/networking':

       … while evaluating the option `containers.server.hardware.facter.enable':

       … while evaluating the option `containers.server.hardware.facter.report':

       … while evaluating the option `containers.server.hardware.facter.reportPath':

       … while evaluating definitions from `/nix/store/m6r41z6xm7kxdy9dii1zzqr1x7czg2ss-source/nixosModules/clanCore/nixos-facter.nix':

       (stack trace truncated; use '--show-trace' to show the full, detailed trace)

       error: path '/nix/store/5gddpq67hw38l6r5bv2sjh9gzlaln6jz-merged-test-dir-dyndns' is not valid
failed eval checks.aarch64-linux.hello-service —
error: … while evaluating the attribute 'drvPath' at «https://releases.nixos.org/nixpkgs/nixpkgs-26.11pre1097569.e513db7b0a65/nixexprs.tar.xz?na …
error:
       … while evaluating the attribute 'drvPath'
         at «https://releases.nixos.org/nixpkgs/nixpkgs-26.11pre1097569.e513db7b0a65/nixexprs.tar.xz?narHash=sha256-jWdazKTNUOJQ3KE%2B9BAvpBOo6THrD0Qyb3S8F2GduUI%3D»/lib/customisation.nix:416:11:
          415|         // {
          416|           drvPath =
             |           ^
          417|             assert condition;

       … while calling the 'derivationStrict' builtin
         at «nix-internal»/derivation-internal.nix:37:12:
           36|
           37|   strict = derivationStrict drvAttrs;
             |            ^
           38|

       … while evaluating the option `driverConfiguration.vlans':

       … while evaluating definitions from `/nix/store/zsrn88vjmb5hmshm6fimai52blbk3nlc-source/nixos/lib/testing/driver-configuration.nix':

       … while evaluating the option `containers.peer1.networking.interfaces':

       … while evaluating definitions from `/nix/store/zsrn88vjmb5hmshm6fimai52blbk3nlc-source/nixos/modules/hardware/facter/networking':

       … while evaluating the option `containers.peer1.hardware.facter.enable':

       … while evaluating the option `containers.peer1.hardware.facter.report':

       … while evaluating the option `containers.peer1.hardware.facter.reportPath':

       … while evaluating definitions from `/nix/store/m6r41z6xm7kxdy9dii1zzqr1x7czg2ss-source/nixosModules/clanCore/nixos-facter.nix':

       (stack trace truncated; use '--show-trace' to show the full, detailed trace)

       error: gRPC QueryValidPaths on 'nix-store.geninf.io:50051' failed: error: substituter 'https://cache-local.geninf.io' is disabled
failed eval checks.aarch64-linux.kde —
error: … while evaluating the attribute 'drvPath' at «https://releases.nixos.org/nixpkgs/nixpkgs-26.11pre1097569.e513db7b0a65/nixexprs.tar.xz?na …
error:
       … while evaluating the attribute 'drvPath'
         at «https://releases.nixos.org/nixpkgs/nixpkgs-26.11pre1097569.e513db7b0a65/nixexprs.tar.xz?narHash=sha256-jWdazKTNUOJQ3KE%2B9BAvpBOo6THrD0Qyb3S8F2GduUI%3D»/lib/customisation.nix:416:11:
          415|         // {
          416|           drvPath =
             |           ^
          417|             assert condition;

       … while calling the 'derivationStrict' builtin
         at «nix-internal»/derivation-internal.nix:37:12:
           36|
           37|   strict = derivationStrict drvAttrs;
             |            ^
           38|

       … while evaluating the option `driverConfiguration.containers.client.start_script':

       … while evaluating definitions from `/nix/store/zsrn88vjmb5hmshm6fimai52blbk3nlc-source/nixos/lib/testing/driver-configuration.nix':

       … while evaluating definitions from `/nix/store/zsrn88vjmb5hmshm6fimai52blbk3nlc-source/nixos/modules/virtualisation/nspawn-container':

       … while evaluating the option `containers.client.system.build.toplevel':

       … while evaluating definitions from `/nix/store/zsrn88vjmb5hmshm6fimai52blbk3nlc-source/nixos/modules/system/activation/top-level.nix':

       … while evaluating the option `containers.client.assertions':

       … while evaluating definitions from `/nix/store/9xlfs4fc7h82mkvvnifbhng24082gqin-source/modules/sops':

       … while evaluating the option `containers.client.sops.secrets':

       … while evaluating definitions from `/nix/store/m6r41z6xm7kxdy9dii1zzqr1x7czg2ss-source/nixosModules/clanCore/sops.nix':

       (stack trace truncated; use '--show-trace' to show the full, detailed trace)

       error: gRPC QueryValidPaths on 'nix-store.geninf.io:50051' failed: error: substituter 'https://cache-local.geninf.io' is disabled
failed eval checks.aarch64-linux.localbackup —
error: … while evaluating the attribute 'drvPath' at «https://releases.nixos.org/nixpkgs/nixpkgs-26.11pre1097569.e513db7b0a65/nixexprs.tar.xz?na …
error:
       … while evaluating the attribute 'drvPath'
         at «https://releases.nixos.org/nixpkgs/nixpkgs-26.11pre1097569.e513db7b0a65/nixexprs.tar.xz?narHash=sha256-jWdazKTNUOJQ3KE%2B9BAvpBOo6THrD0Qyb3S8F2GduUI%3D»/lib/customisation.nix:416:11:
          415|         // {
          416|           drvPath =
             |           ^
          417|             assert condition;

       … while calling the 'derivationStrict' builtin
         at «nix-internal»/derivation-internal.nix:37:12:
           36|
           37|   strict = derivationStrict drvAttrs;
             |            ^
           38|

       … while evaluating the option `driverConfiguration.containers.machine.start_script':

       … while evaluating definitions from `/nix/store/zsrn88vjmb5hmshm6fimai52blbk3nlc-source/nixos/lib/testing/driver-configuration.nix':

       … while evaluating definitions from `/nix/store/zsrn88vjmb5hmshm6fimai52blbk3nlc-source/nixos/modules/virtualisation/nspawn-container':

       … while evaluating the option `containers.machine.system.build.toplevel':

       … while evaluating definitions from `/nix/store/zsrn88vjmb5hmshm6fimai52blbk3nlc-source/nixos/modules/system/activation/top-level.nix':

       … while evaluating the option `containers.machine.warnings':

       … while evaluating definitions from `/nix/store/m6r41z6xm7kxdy9dii1zzqr1x7czg2ss-source/nixosModules/clanCore/nixos-facter.nix':

       (stack trace truncated; use '--show-trace' to show the full, detailed trace)

       error: gRPC QueryValidPaths on 'nix-store.geninf.io:50051' failed: error: substituter 'https://cache-local.geninf.io' is disabled
failed eval checks.aarch64-linux.machine-id —
error: … while evaluating the attribute 'drvPath' at «https://releases.nixos.org/nixpkgs/nixpkgs-26.11pre1097569.e513db7b0a65/nixexprs.tar.xz?na …
error:
       … while evaluating the attribute 'drvPath'
         at «https://releases.nixos.org/nixpkgs/nixpkgs-26.11pre1097569.e513db7b0a65/nixexprs.tar.xz?narHash=sha256-jWdazKTNUOJQ3KE%2B9BAvpBOo6THrD0Qyb3S8F2GduUI%3D»/lib/customisation.nix:416:11:
          415|         // {
          416|           drvPath =
             |           ^
          417|             assert condition;

       … while calling the 'derivationStrict' builtin
         at «nix-internal»/derivation-internal.nix:37:12:
           36|
           37|   strict = derivationStrict drvAttrs;
             |            ^
           38|

       … while evaluating the option `driverConfiguration.containers.server.start_script':

       … while evaluating definitions from `/nix/store/zsrn88vjmb5hmshm6fimai52blbk3nlc-source/nixos/lib/testing/driver-configuration.nix':

       … while evaluating definitions from `/nix/store/zsrn88vjmb5hmshm6fimai52blbk3nlc-source/nixos/modules/virtualisation/nspawn-container':

       … while evaluating the option `containers.server.system.build.toplevel':

       … while evaluating definitions from `/nix/store/zsrn88vjmb5hmshm6fimai52blbk3nlc-source/nixos/modules/system/activation/top-level.nix':

       … while evaluating the option `containers.server.assertions':

       … while evaluating definitions from `/nix/store/9xlfs4fc7h82mkvvnifbhng24082gqin-source/modules/sops':

       … while evaluating the option `containers.server.sops.secrets':

       … while evaluating definitions from `/nix/store/m6r41z6xm7kxdy9dii1zzqr1x7czg2ss-source/nixosModules/clanCore/sops.nix':

       (stack trace truncated; use '--show-trace' to show the full, detailed trace)

       error: gRPC QueryValidPaths on 'nix-store.geninf.io:50051' failed: error: substituter 'https://cache-local.geninf.io' is disabled
failed eval checks.aarch64-linux.matrix-synapse —
error: … while evaluating the attribute 'drvPath' at «https://releases.nixos.org/nixpkgs/nixpkgs-26.11pre1097569.e513db7b0a65/nixexprs.tar.xz?na …
error:
       … while evaluating the attribute 'drvPath'
         at «https://releases.nixos.org/nixpkgs/nixpkgs-26.11pre1097569.e513db7b0a65/nixexprs.tar.xz?narHash=sha256-jWdazKTNUOJQ3KE%2B9BAvpBOo6THrD0Qyb3S8F2GduUI%3D»/lib/customisation.nix:416:11:
          415|         // {
          416|           drvPath =
             |           ^
          417|             assert condition;

       … while calling the 'derivationStrict' builtin
         at «nix-internal»/derivation-internal.nix:37:12:
           36|
           37|   strict = derivationStrict drvAttrs;
             |            ^
           38|

       … while evaluating the option `driverConfiguration.vlans':

       … while evaluating definitions from `/nix/store/zsrn88vjmb5hmshm6fimai52blbk3nlc-source/nixos/lib/testing/driver-configuration.nix':

       … while evaluating the option `containers.machine.networking.interfaces':

       … while evaluating definitions from `/nix/store/zsrn88vjmb5hmshm6fimai52blbk3nlc-source/nixos/modules/hardware/facter/networking':

       … while evaluating the option `containers.machine.hardware.facter.enable':

       … while evaluating the option `containers.machine.hardware.facter.report':

       … while evaluating the option `containers.machine.hardware.facter.reportPath':

       … while evaluating definitions from `/nix/store/m6r41z6xm7kxdy9dii1zzqr1x7czg2ss-source/nixosModules/clanCore/nixos-facter.nix':

       (stack trace truncated; use '--show-trace' to show the full, detailed trace)

       error: gRPC QueryValidPaths on 'nix-store.geninf.io:50051' failed: error: substituter 'https://cache-local.geninf.io' is disabled
failed eval checks.aarch64-linux.monitoring —
error: … while evaluating the attribute 'drvPath' at «https://releases.nixos.org/nixpkgs/nixpkgs-26.11pre1097569.e513db7b0a65/nixexprs.tar.xz?na …
error:
       … while evaluating the attribute 'drvPath'
         at «https://releases.nixos.org/nixpkgs/nixpkgs-26.11pre1097569.e513db7b0a65/nixexprs.tar.xz?narHash=sha256-jWdazKTNUOJQ3KE%2B9BAvpBOo6THrD0Qyb3S8F2GduUI%3D»/lib/customisation.nix:416:11:
          415|         // {
          416|           drvPath =
             |           ^
          417|             assert condition;

       … while calling the 'derivationStrict' builtin
         at «nix-internal»/derivation-internal.nix:37:12:
           36|
           37|   strict = derivationStrict drvAttrs;
             |            ^
           38|

       … while evaluating the option `driverConfiguration.vlans':

       … while evaluating definitions from `/nix/store/zsrn88vjmb5hmshm6fimai52blbk3nlc-source/nixos/lib/testing/driver-configuration.nix':

       … while evaluating the option `containers.machine3.networking.interfaces':

       … while evaluating definitions from `/nix/store/zsrn88vjmb5hmshm6fimai52blbk3nlc-source/nixos/modules/hardware/facter/networking':

       … while evaluating the option `containers.machine3.hardware.facter.enable':

       … while evaluating the option `containers.machine3.hardware.facter.report':

       … while evaluating the option `containers.machine3.hardware.facter.reportPath':

       … while evaluating definitions from `/nix/store/m6r41z6xm7kxdy9dii1zzqr1x7czg2ss-source/nixosModules/clanCore/nixos-facter.nix':

       (stack trace truncated; use '--show-trace' to show the full, detailed trace)

       error: gRPC QueryValidPaths on 'nix-store.geninf.io:50051' failed: error: substituter 'https://cache-local.geninf.io' is disabled
failed eval checks.aarch64-linux.mycelium —
error: … while evaluating the attribute 'drvPath' at «https://releases.nixos.org/nixpkgs/nixpkgs-26.11pre1097569.e513db7b0a65/nixexprs.tar.xz?na …
error:
       … while evaluating the attribute 'drvPath'
         at «https://releases.nixos.org/nixpkgs/nixpkgs-26.11pre1097569.e513db7b0a65/nixexprs.tar.xz?narHash=sha256-jWdazKTNUOJQ3KE%2B9BAvpBOo6THrD0Qyb3S8F2GduUI%3D»/lib/customisation.nix:416:11:
          415|         // {
          416|           drvPath =
             |           ^
          417|             assert condition;

       … while calling the 'derivationStrict' builtin
         at «nix-internal»/derivation-internal.nix:37:12:
           36|
           37|   strict = derivationStrict drvAttrs;
             |            ^
           38|

       … while evaluating the option `driverConfiguration.vlans':

       … while evaluating definitions from `/nix/store/zsrn88vjmb5hmshm6fimai52blbk3nlc-source/nixos/lib/testing/driver-configuration.nix':

       … while evaluating the option `nodes.server.networking.interfaces':

       … while evaluating definitions from `/nix/store/zsrn88vjmb5hmshm6fimai52blbk3nlc-source/nixos/modules/hardware/facter/networking':

       … while evaluating the option `nodes.server.hardware.facter.enable':

       … while evaluating the option `nodes.server.hardware.facter.report':

       … while evaluating the option `nodes.server.hardware.facter.reportPath':

       … while evaluating definitions from `/nix/store/m6r41z6xm7kxdy9dii1zzqr1x7czg2ss-source/nixosModules/clanCore/nixos-facter.nix':

       (stack trace truncated; use '--show-trace' to show the full, detailed trace)

       error: gRPC QueryValidPaths on 'nix-store.geninf.io:50051' failed: error: substituter 'https://cache-local.geninf.io' is disabled
failed eval checks.aarch64-linux.ncps —
error: … while evaluating the attribute 'drvPath' at «https://releases.nixos.org/nixpkgs/nixpkgs-26.11pre1097569.e513db7b0a65/nixexprs.tar.xz?na …
error:
       … while evaluating the attribute 'drvPath'
         at «https://releases.nixos.org/nixpkgs/nixpkgs-26.11pre1097569.e513db7b0a65/nixexprs.tar.xz?narHash=sha256-jWdazKTNUOJQ3KE%2B9BAvpBOo6THrD0Qyb3S8F2GduUI%3D»/lib/customisation.nix:416:11:
          415|         // {
          416|           drvPath =
             |           ^
          417|             assert condition;

       … while calling the 'derivationStrict' builtin
         at «nix-internal»/derivation-internal.nix:37:12:
           36|
           37|   strict = derivationStrict drvAttrs;
             |            ^
           38|

       … while evaluating the option `driverConfiguration.vlans':

       … while evaluating definitions from `/nix/store/zsrn88vjmb5hmshm6fimai52blbk3nlc-source/nixos/lib/testing/driver-configuration.nix':

       … while evaluating the option `nodes.alice.networking.interfaces':

       … while evaluating definitions from `/nix/store/zsrn88vjmb5hmshm6fimai52blbk3nlc-source/nixos/modules/hardware/facter/networking':

       … while evaluating the option `nodes.alice.hardware.facter.enable':

       … while evaluating the option `nodes.alice.hardware.facter.report':

       … while evaluating the option `nodes.alice.hardware.facter.reportPath':

       … while evaluating definitions from `/nix/store/m6r41z6xm7kxdy9dii1zzqr1x7czg2ss-source/nixosModules/clanCore/nixos-facter.nix':

       (stack trace truncated; use '--show-trace' to show the full, detailed trace)

       error: path '/nix/store/bzwkdagsr5hw8z61c384cpc406sh1kvs-merged-test-dir-ncps' is not valid
failed eval checks.aarch64-linux.nixos-test-password-store-mounts —
error: … while evaluating the attribute 'drvPath' at «https://releases.nixos.org/nixpkgs/nixpkgs-26.11pre1097569.e513db7b0a65/nixexprs.tar.xz?na …
error:
       … while evaluating the attribute 'drvPath'
         at «https://releases.nixos.org/nixpkgs/nixpkgs-26.11pre1097569.e513db7b0a65/nixexprs.tar.xz?narHash=sha256-jWdazKTNUOJQ3KE%2B9BAvpBOo6THrD0Qyb3S8F2GduUI%3D»/lib/customisation.nix:416:11:
          415|         // {
          416|           drvPath =
             |           ^
          417|             assert condition;

       … while calling the 'derivationStrict' builtin
         at «nix-internal»/derivation-internal.nix:37:12:
           36|
           37|   strict = derivationStrict drvAttrs;
             |            ^
           38|

       … while evaluating the option `driverConfiguration.vlans':

       … while evaluating definitions from `/nix/store/zsrn88vjmb5hmshm6fimai52blbk3nlc-source/nixos/lib/testing/driver-configuration.nix':

       … while evaluating the option `nodes.machine.networking.interfaces':

       … while evaluating definitions from `/nix/store/zsrn88vjmb5hmshm6fimai52blbk3nlc-source/nixos/modules/hardware/facter/networking':

       … while evaluating the option `nodes.machine.hardware.facter.enable':

       … while evaluating the option `nodes.machine.hardware.facter.report':

       … while evaluating the option `nodes.machine.hardware.facter.reportPath':

       … while evaluating definitions from `/nix/store/m6r41z6xm7kxdy9dii1zzqr1x7czg2ss-source/nixosModules/clanCore/nixos-facter.nix':

       (stack trace truncated; use '--show-trace' to show the full, detailed trace)

       error: gRPC QueryValidPaths on 'nix-store.geninf.io:50051' failed: error: substituter 'https://cache-local.geninf.io' is disabled
failed eval checks.aarch64-linux.p2p-ssh-iroh —
error: … while evaluating the attribute 'drvPath' at «https://releases.nixos.org/nixpkgs/nixpkgs-26.11pre1097569.e513db7b0a65/nixexprs.tar.xz?na …
error:
       … while evaluating the attribute 'drvPath'
         at «https://releases.nixos.org/nixpkgs/nixpkgs-26.11pre1097569.e513db7b0a65/nixexprs.tar.xz?narHash=sha256-jWdazKTNUOJQ3KE%2B9BAvpBOo6THrD0Qyb3S8F2GduUI%3D»/lib/customisation.nix:416:11:
          415|         // {
          416|           drvPath =
             |           ^
          417|             assert condition;

       … while calling the 'derivationStrict' builtin
         at «nix-internal»/derivation-internal.nix:37:12:
           36|
           37|   strict = derivationStrict drvAttrs;
             |            ^
           38|

       … while evaluating the option `driverConfiguration.vlans':

       … while evaluating definitions from `/nix/store/zsrn88vjmb5hmshm6fimai52blbk3nlc-source/nixos/lib/testing/driver-configuration.nix':

       … while evaluating the option `containers.client.networking.interfaces':

       … while evaluating definitions from `/nix/store/zsrn88vjmb5hmshm6fimai52blbk3nlc-source/nixos/modules/hardware/facter/networking':

       … while evaluating the option `containers.client.hardware.facter.enable':

       … while evaluating the option `containers.client.hardware.facter.report':

       … while evaluating the option `containers.client.hardware.facter.reportPath':

       … while evaluating definitions from `/nix/store/m6r41z6xm7kxdy9dii1zzqr1x7czg2ss-source/nixosModules/clanCore/nixos-facter.nix':

       (stack trace truncated; use '--show-trace' to show the full, detailed trace)

       error: gRPC QueryValidPaths on 'nix-store.geninf.io:50051' failed: error: substituter 'https://cache-local.geninf.io' is disabled
failed eval checks.aarch64-linux.pki —
error: … while evaluating the attribute 'drvPath' at «https://releases.nixos.org/nixpkgs/nixpkgs-26.11pre1097569.e513db7b0a65/nixexprs.tar.xz?na …
error:
       … while evaluating the attribute 'drvPath'
         at «https://releases.nixos.org/nixpkgs/nixpkgs-26.11pre1097569.e513db7b0a65/nixexprs.tar.xz?narHash=sha256-jWdazKTNUOJQ3KE%2B9BAvpBOo6THrD0Qyb3S8F2GduUI%3D»/lib/customisation.nix:416:11:
          415|         // {
          416|           drvPath =
             |           ^
          417|             assert condition;

       … while calling the 'derivationStrict' builtin
         at «nix-internal»/derivation-internal.nix:37:12:
           36|
           37|   strict = derivationStrict drvAttrs;
             |            ^
           38|

       … while evaluating the option `driverConfiguration.vlans':

       … while evaluating definitions from `/nix/store/zsrn88vjmb5hmshm6fimai52blbk3nlc-source/nixos/lib/testing/driver-configuration.nix':

       … while evaluating the option `nodes.client.networking.interfaces':

       … while evaluating definitions from `/nix/store/zsrn88vjmb5hmshm6fimai52blbk3nlc-source/nixos/modules/hardware/facter/networking':

       … while evaluating the option `nodes.client.hardware.facter.enable':

       … while evaluating the option `nodes.client.hardware.facter.report':

       … while evaluating the option `nodes.client.hardware.facter.reportPath':

       … while evaluating definitions from `/nix/store/m6r41z6xm7kxdy9dii1zzqr1x7czg2ss-source/nixosModules/clanCore/nixos-facter.nix':

       (stack trace truncated; use '--show-trace' to show the full, detailed trace)

       error: gRPC QueryValidPaths on 'nix-store.geninf.io:50051' failed: error: substituter 'https://cache-local.geninf.io' is disabled
failed eval checks.aarch64-linux.postgresql —
error: … while evaluating the attribute 'drvPath' at «https://releases.nixos.org/nixpkgs/nixpkgs-26.11pre1097569.e513db7b0a65/nixexprs.tar.xz?na …
error:
       … while evaluating the attribute 'drvPath'
         at «https://releases.nixos.org/nixpkgs/nixpkgs-26.11pre1097569.e513db7b0a65/nixexprs.tar.xz?narHash=sha256-jWdazKTNUOJQ3KE%2B9BAvpBOo6THrD0Qyb3S8F2GduUI%3D»/lib/customisation.nix:416:11:
          415|         // {
          416|           drvPath =
             |           ^
          417|             assert condition;

       … while calling the 'derivationStrict' builtin
         at «nix-internal»/derivation-internal.nix:37:12:
           36|
           37|   strict = derivationStrict drvAttrs;
             |            ^
           38|

       … while evaluating the option `driverConfiguration.containers.machine.start_script':

       … while evaluating definitions from `/nix/store/zsrn88vjmb5hmshm6fimai52blbk3nlc-source/nixos/lib/testing/driver-configuration.nix':

       … while evaluating definitions from `/nix/store/zsrn88vjmb5hmshm6fimai52blbk3nlc-source/nixos/modules/virtualisation/nspawn-container':

       … while evaluating the option `containers.machine.system.build.toplevel':

       … while evaluating definitions from `/nix/store/zsrn88vjmb5hmshm6fimai52blbk3nlc-source/nixos/modules/system/activation/top-level.nix':

       … while evaluating the option `containers.machine.assertions':

       … while evaluating definitions from `/nix/store/9xlfs4fc7h82mkvvnifbhng24082gqin-source/modules/sops':

       … while evaluating the option `containers.machine.sops.secrets':

       … while evaluating definitions from `/nix/store/m6r41z6xm7kxdy9dii1zzqr1x7czg2ss-source/nixosModules/clanCore/sops.nix':

       (stack trace truncated; use '--show-trace' to show the full, detailed trace)

       error: gRPC QueryValidPaths on 'nix-store.geninf.io:50051' failed: error: substituter 'https://cache-local.geninf.io' is disabled
failed eval checks.aarch64-linux.service-dummy-test —
error: … while evaluating the attribute 'drvPath' at «https://releases.nixos.org/nixpkgs/nixpkgs-26.11pre1097569.e513db7b0a65/nixexprs.tar.xz?na …
error:
       … while evaluating the attribute 'drvPath'
         at «https://releases.nixos.org/nixpkgs/nixpkgs-26.11pre1097569.e513db7b0a65/nixexprs.tar.xz?narHash=sha256-jWdazKTNUOJQ3KE%2B9BAvpBOo6THrD0Qyb3S8F2GduUI%3D»/lib/customisation.nix:416:11:
          415|         // {
          416|           drvPath =
             |           ^
          417|             assert condition;

       … while calling the 'derivationStrict' builtin
         at «nix-internal»/derivation-internal.nix:37:12:
           36|
           37|   strict = derivationStrict drvAttrs;
             |            ^
           38|

       … while evaluating the option `driverConfiguration.containers.admin1.start_script':

       … while evaluating definitions from `/nix/store/zsrn88vjmb5hmshm6fimai52blbk3nlc-source/nixos/lib/testing/driver-configuration.nix':

       … while evaluating definitions from `/nix/store/zsrn88vjmb5hmshm6fimai52blbk3nlc-source/nixos/modules/virtualisation/nspawn-container':

       … while evaluating the option `containers.admin1.system.build.toplevel':

       … while evaluating definitions from `/nix/store/zsrn88vjmb5hmshm6fimai52blbk3nlc-source/nixos/modules/system/activation/top-level.nix':

       … while evaluating the option `containers.admin1.assertions':

       … while evaluating definitions from `/nix/store/9xlfs4fc7h82mkvvnifbhng24082gqin-source/modules/sops':

       … while evaluating the option `containers.admin1.sops.secrets':

       … while evaluating definitions from `/nix/store/m6r41z6xm7kxdy9dii1zzqr1x7czg2ss-source/nixosModules/clanCore/sops.nix':

       (stack trace truncated; use '--show-trace' to show the full, detailed trace)

       error: gRPC QueryValidPaths on 'nix-store.geninf.io:50051' failed: error: substituter 'https://cache-local.geninf.io' is disabled
failed eval checks.aarch64-linux.service-dummy-test-from-flake —
error: … while evaluating the attribute 'drvPath' at «https://releases.nixos.org/nixpkgs/nixpkgs-26.11pre1097569.e513db7b0a65/nixexprs.tar.xz?na …
error:
       … while evaluating the attribute 'drvPath'
         at «https://releases.nixos.org/nixpkgs/nixpkgs-26.11pre1097569.e513db7b0a65/nixexprs.tar.xz?narHash=sha256-jWdazKTNUOJQ3KE%2B9BAvpBOo6THrD0Qyb3S8F2GduUI%3D»/lib/customisation.nix:416:11:
          415|         // {
          416|           drvPath =
             |           ^
          417|             assert condition;

       … while calling the 'derivationStrict' builtin
         at «nix-internal»/derivation-internal.nix:37:12:
           36|
           37|   strict = derivationStrict drvAttrs;
             |            ^
           38|

       … while evaluating the option `driverConfiguration.vlans':

       … while evaluating definitions from `/nix/store/zsrn88vjmb5hmshm6fimai52blbk3nlc-source/nixos/lib/testing/driver-configuration.nix':

       … while evaluating the option `containers.admin1.networking.interfaces':

       … while evaluating definitions from `/nix/store/zsrn88vjmb5hmshm6fimai52blbk3nlc-source/nixos/modules/hardware/facter/networking':

       … while evaluating the option `containers.admin1.hardware.facter.enable':

       … while evaluating the option `containers.admin1.hardware.facter.report':

       … while evaluating the option `containers.admin1.hardware.facter.reportPath':

       … while evaluating definitions from `/nix/store/m6r41z6xm7kxdy9dii1zzqr1x7czg2ss-source/nixosModules/clanCore/nixos-facter.nix':

       (stack trace truncated; use '--show-trace' to show the full, detailed trace)

       error: gRPC QueryValidPaths on 'nix-store.geninf.io:50051' failed: error: substituter 'https://cache-local.geninf.io' is disabled
failed eval checks.aarch64-linux.sshd —
error: … while evaluating the attribute 'drvPath' at «https://releases.nixos.org/nixpkgs/nixpkgs-26.11pre1097569.e513db7b0a65/nixexprs.tar.xz?na …
error:
       … while evaluating the attribute 'drvPath'
         at «https://releases.nixos.org/nixpkgs/nixpkgs-26.11pre1097569.e513db7b0a65/nixexprs.tar.xz?narHash=sha256-jWdazKTNUOJQ3KE%2B9BAvpBOo6THrD0Qyb3S8F2GduUI%3D»/lib/customisation.nix:416:11:
          415|         // {
          416|           drvPath =
             |           ^
          417|             assert condition;

       … while calling the 'derivationStrict' builtin
         at «nix-internal»/derivation-internal.nix:37:12:
           36|
           37|   strict = derivationStrict drvAttrs;
             |            ^
           38|

       … while evaluating the option `driverConfiguration.vlans':

       … while evaluating definitions from `/nix/store/zsrn88vjmb5hmshm6fimai52blbk3nlc-source/nixos/lib/testing/driver-configuration.nix':

       … while evaluating the option `containers.client.networking.interfaces':

       … while evaluating definitions from `/nix/store/zsrn88vjmb5hmshm6fimai52blbk3nlc-source/nixos/modules/hardware/facter/networking':

       … while evaluating the option `containers.client.hardware.facter.enable':

       … while evaluating the option `containers.client.hardware.facter.report':

       … while evaluating the option `containers.client.hardware.facter.reportPath':

       … while evaluating definitions from `/nix/store/m6r41z6xm7kxdy9dii1zzqr1x7czg2ss-source/nixosModules/clanCore/nixos-facter.nix':

       (stack trace truncated; use '--show-trace' to show the full, detailed trace)

       error: path '/nix/store/84y0zxll7ynqsabfc67dg63xgyl3gg4c-merged-test-dir-sshd' is not valid
failed eval checks.aarch64-linux.sshd-no-ca —
error: … while evaluating the attribute 'drvPath' at «https://releases.nixos.org/nixpkgs/nixpkgs-26.11pre1097569.e513db7b0a65/nixexprs.tar.xz?na …
error:
       … while evaluating the attribute 'drvPath'
         at «https://releases.nixos.org/nixpkgs/nixpkgs-26.11pre1097569.e513db7b0a65/nixexprs.tar.xz?narHash=sha256-jWdazKTNUOJQ3KE%2B9BAvpBOo6THrD0Qyb3S8F2GduUI%3D»/lib/customisation.nix:416:11:
          415|         // {
          416|           drvPath =
             |           ^
          417|             assert condition;

       … while calling the 'derivationStrict' builtin
         at «nix-internal»/derivation-internal.nix:37:12:
           36|
           37|   strict = derivationStrict drvAttrs;
             |            ^
           38|

       … while evaluating the option `driverConfiguration.containers.server.start_script':

       … while evaluating definitions from `/nix/store/zsrn88vjmb5hmshm6fimai52blbk3nlc-source/nixos/lib/testing/driver-configuration.nix':

       … while evaluating definitions from `/nix/store/zsrn88vjmb5hmshm6fimai52blbk3nlc-source/nixos/modules/virtualisation/nspawn-container':

       … while evaluating the option `containers.server.system.build.toplevel':

       … while evaluating definitions from `/nix/store/zsrn88vjmb5hmshm6fimai52blbk3nlc-source/nixos/modules/system/activation/top-level.nix':

       … while evaluating the option `containers.server.programs.ssh.knownHosts.clan-sshd-self-ed25519.publicKey':

       … while evaluating definitions from `/nix/store/m6r41z6xm7kxdy9dii1zzqr1x7czg2ss-source/clanServices/sshd/default.nix, via option clan._services.allServices."self-@clan/sshd".roles.server.perInstance, via option nixosModule':

       … while evaluating the option `containers.server.clan.core.vars.generators.openssh.files."ssh.id_ed25519.pub".value':

       … while evaluating definitions from `/nix/store/m6r41z6xm7kxdy9dii1zzqr1x7czg2ss-source/nixosModules/clanCore/vars/public/in_repo.nix, via option containers.server.clan.core.vars.settings.fileModule':

       (stack trace truncated; use '--show-trace' to show the full, detailed trace)

       error: gRPC QueryValidPaths on 'nix-store.geninf.io:50051' failed: error: substituter 'https://cache-local.geninf.io' is disabled
failed eval checks.aarch64-linux.syncthing-service —
error: … while evaluating the attribute 'drvPath' at «https://releases.nixos.org/nixpkgs/nixpkgs-26.11pre1097569.e513db7b0a65/nixexprs.tar.xz?na …
error:
       … while evaluating the attribute 'drvPath'
         at «https://releases.nixos.org/nixpkgs/nixpkgs-26.11pre1097569.e513db7b0a65/nixexprs.tar.xz?narHash=sha256-jWdazKTNUOJQ3KE%2B9BAvpBOo6THrD0Qyb3S8F2GduUI%3D»/lib/customisation.nix:416:11:
          415|         // {
          416|           drvPath =
             |           ^
          417|             assert condition;

       … while calling the 'derivationStrict' builtin
         at «nix-internal»/derivation-internal.nix:37:12:
           36|
           37|   strict = derivationStrict drvAttrs;
             |            ^
           38|

       … while evaluating the option `driverConfiguration.vlans':

       … while evaluating definitions from `/nix/store/zsrn88vjmb5hmshm6fimai52blbk3nlc-source/nixos/lib/testing/driver-configuration.nix':

       … while evaluating the option `containers.machine2.networking.interfaces':

       … while evaluating definitions from `/nix/store/zsrn88vjmb5hmshm6fimai52blbk3nlc-source/nixos/modules/hardware/facter/networking':

       … while evaluating the option `containers.machine2.hardware.facter.enable':

       … while evaluating the option `containers.machine2.hardware.facter.report':

       … while evaluating the option `containers.machine2.hardware.facter.reportPath':

       … while evaluating definitions from `/nix/store/m6r41z6xm7kxdy9dii1zzqr1x7czg2ss-source/nixosModules/clanCore/nixos-facter.nix':

       (stack trace truncated; use '--show-trace' to show the full, detailed trace)

       error: gRPC QueryValidPaths on 'nix-store.geninf.io:50051' failed: error: substituter 'https://cache-local.geninf.io' is disabled
failed eval checks.aarch64-linux.trusted-nix-caches —
error: … while evaluating the attribute 'drvPath' at «https://releases.nixos.org/nixpkgs/nixpkgs-26.11pre1097569.e513db7b0a65/nixexprs.tar.xz?na …
error:
       … while evaluating the attribute 'drvPath'
         at «https://releases.nixos.org/nixpkgs/nixpkgs-26.11pre1097569.e513db7b0a65/nixexprs.tar.xz?narHash=sha256-jWdazKTNUOJQ3KE%2B9BAvpBOo6THrD0Qyb3S8F2GduUI%3D»/lib/customisation.nix:416:11:
          415|         // {
          416|           drvPath =
             |           ^
          417|             assert condition;

       … while calling the 'derivationStrict' builtin
         at «nix-internal»/derivation-internal.nix:37:12:
           36|
           37|   strict = derivationStrict drvAttrs;
             |            ^
           38|

       … while evaluating the option `driverConfiguration.vlans':

       … while evaluating definitions from `/nix/store/zsrn88vjmb5hmshm6fimai52blbk3nlc-source/nixos/lib/testing/driver-configuration.nix':

       … while evaluating the option `containers.server.networking.interfaces':

       … while evaluating definitions from `/nix/store/zsrn88vjmb5hmshm6fimai52blbk3nlc-source/nixos/modules/hardware/facter/networking':

       … while evaluating the option `containers.server.hardware.facter.enable':

       … while evaluating the option `containers.server.hardware.facter.report':

       … while evaluating the option `containers.server.hardware.facter.reportPath':

       … while evaluating definitions from `/nix/store/m6r41z6xm7kxdy9dii1zzqr1x7czg2ss-source/nixosModules/clanCore/nixos-facter.nix':

       (stack trace truncated; use '--show-trace' to show the full, detailed trace)

       error: gRPC QueryValidPaths on 'nix-store.geninf.io:50051' failed: error: substituter 'https://cache-local.geninf.io' is disabled
failed eval checks.aarch64-linux.users —
error: … while evaluating the attribute 'drvPath' at «https://releases.nixos.org/nixpkgs/nixpkgs-26.11pre1097569.e513db7b0a65/nixexprs.tar.xz?na …
error:
       … while evaluating the attribute 'drvPath'
         at «https://releases.nixos.org/nixpkgs/nixpkgs-26.11pre1097569.e513db7b0a65/nixexprs.tar.xz?narHash=sha256-jWdazKTNUOJQ3KE%2B9BAvpBOo6THrD0Qyb3S8F2GduUI%3D»/lib/customisation.nix:416:11:
          415|         // {
          416|           drvPath =
             |           ^
          417|             assert condition;

       … while calling the 'derivationStrict' builtin
         at «nix-internal»/derivation-internal.nix:37:12:
           36|
           37|   strict = derivationStrict drvAttrs;
             |            ^
           38|

       … while evaluating the option `driverConfiguration.containers.server.start_script':

       … while evaluating definitions from `/nix/store/zsrn88vjmb5hmshm6fimai52blbk3nlc-source/nixos/lib/testing/driver-configuration.nix':

       … while evaluating definitions from `/nix/store/zsrn88vjmb5hmshm6fimai52blbk3nlc-source/nixos/modules/virtualisation/nspawn-container':

       … while evaluating the option `containers.server.system.systemBuilderCommands':

       … while evaluating definitions from `/nix/store/zsrn88vjmb5hmshm6fimai52blbk3nlc-source/nixos/modules/system/activation/activatable-system.nix':

       … while evaluating the option `containers.server.system.activatableSystemBuilderCommands':

       … while evaluating definitions from `/nix/store/zsrn88vjmb5hmshm6fimai52blbk3nlc-source/nixos/modules/system/activation/activatable-system.nix':

       … while evaluating the option `containers.server.system.activationScripts.setupSecrets.text':

       … while evaluating definitions from `/nix/store/m6r41z6xm7kxdy9dii1zzqr1x7czg2ss-source/nixosModules/clanCore/vars/secret/age.nix':

       (stack trace truncated; use '--show-trace' to show the full, detailed trace)

       error: gRPC QueryValidPaths on 'nix-store.geninf.io:50051' failed: error: substituter 'https://cache-local.geninf.io' is disabled
failed eval checks.aarch64-linux.wifi —
error: … while evaluating the attribute 'drvPath' at «https://releases.nixos.org/nixpkgs/nixpkgs-26.11pre1097569.e513db7b0a65/nixexprs.tar.xz?na …
error:
       … while evaluating the attribute 'drvPath'
         at «https://releases.nixos.org/nixpkgs/nixpkgs-26.11pre1097569.e513db7b0a65/nixexprs.tar.xz?narHash=sha256-jWdazKTNUOJQ3KE%2B9BAvpBOo6THrD0Qyb3S8F2GduUI%3D»/lib/customisation.nix:416:11:
          415|         // {
          416|           drvPath =
             |           ^
          417|             assert condition;

       … while calling the 'derivationStrict' builtin
         at «nix-internal»/derivation-internal.nix:37:12:
           36|
           37|   strict = derivationStrict drvAttrs;
             |            ^
           38|

       … while evaluating the option `driverConfiguration.vms.test.start_script':

       … while evaluating definitions from `/nix/store/zsrn88vjmb5hmshm6fimai52blbk3nlc-source/nixos/lib/testing/driver-configuration.nix':

       … while evaluating the option `nodes.test.system.build.toplevel':

       … while evaluating definitions from `/nix/store/zsrn88vjmb5hmshm6fimai52blbk3nlc-source/nixos/modules/system/activation/top-level.nix':

       … while evaluating the option `nodes.test.warnings':

       … while evaluating definitions from `/nix/store/m6r41z6xm7kxdy9dii1zzqr1x7czg2ss-source/nixosModules/clanCore/nixos-facter.nix':

       (stack trace truncated; use '--show-trace' to show the full, detailed trace)

       error: gRPC QueryValidPaths on 'nix-store.geninf.io:50051' failed: error: substituter 'https://cache-local.geninf.io' is disabled
failed eval checks.aarch64-linux.wireguard —
error: … while evaluating the attribute 'drvPath' at «https://releases.nixos.org/nixpkgs/nixpkgs-26.11pre1097569.e513db7b0a65/nixexprs.tar.xz?na …
error:
       … while evaluating the attribute 'drvPath'
         at «https://releases.nixos.org/nixpkgs/nixpkgs-26.11pre1097569.e513db7b0a65/nixexprs.tar.xz?narHash=sha256-jWdazKTNUOJQ3KE%2B9BAvpBOo6THrD0Qyb3S8F2GduUI%3D»/lib/customisation.nix:416:11:
          415|         // {
          416|           drvPath =
             |           ^
          417|             assert condition;

       … while calling the 'derivationStrict' builtin
         at «nix-internal»/derivation-internal.nix:37:12:
           36|
           37|   strict = derivationStrict drvAttrs;
             |            ^
           38|

       … while evaluating the option `driverConfiguration.vlans':

       … while evaluating definitions from `/nix/store/zsrn88vjmb5hmshm6fimai52blbk3nlc-source/nixos/lib/testing/driver-configuration.nix':

       … while evaluating the option `containers.ctrl1.networking.interfaces':

       … while evaluating definitions from `/nix/store/zsrn88vjmb5hmshm6fimai52blbk3nlc-source/nixos/modules/hardware/facter/networking':

       … while evaluating the option `containers.ctrl1.hardware.facter.enable':

       … while evaluating the option `containers.ctrl1.hardware.facter.report':

       … while evaluating the option `containers.ctrl1.hardware.facter.reportPath':

       … while evaluating definitions from `/nix/store/m6r41z6xm7kxdy9dii1zzqr1x7czg2ss-source/nixosModules/clanCore/nixos-facter.nix':

       (stack trace truncated; use '--show-trace' to show the full, detailed trace)

       error: gRPC QueryValidPaths on 'nix-store.geninf.io:50051' failed: error: substituter 'https://cache-local.geninf.io' is disabled
failed eval checks.aarch64-linux.yggdrasil —
error: … while evaluating the attribute 'drvPath' at «https://releases.nixos.org/nixpkgs/nixpkgs-26.11pre1097569.e513db7b0a65/nixexprs.tar.xz?na …
error:
       … while evaluating the attribute 'drvPath'
         at «https://releases.nixos.org/nixpkgs/nixpkgs-26.11pre1097569.e513db7b0a65/nixexprs.tar.xz?narHash=sha256-jWdazKTNUOJQ3KE%2B9BAvpBOo6THrD0Qyb3S8F2GduUI%3D»/lib/customisation.nix:416:11:
          415|         // {
          416|           drvPath =
             |           ^
          417|             assert condition;

       … while calling the 'derivationStrict' builtin
         at «nix-internal»/derivation-internal.nix:37:12:
           36|
           37|   strict = derivationStrict drvAttrs;
             |            ^
           38|

       … while evaluating the option `driverConfiguration.vlans':

       … while evaluating definitions from `/nix/store/zsrn88vjmb5hmshm6fimai52blbk3nlc-source/nixos/lib/testing/driver-configuration.nix':

       … while evaluating the option `nodes.outsider.networking.interfaces':

       … while evaluating definitions from `/nix/store/zsrn88vjmb5hmshm6fimai52blbk3nlc-source/nixos/modules/hardware/facter/networking':

       … while evaluating the option `nodes.outsider.hardware.facter.enable':

       … while evaluating the option `nodes.outsider.hardware.facter.report':

       … while evaluating the option `nodes.outsider.hardware.facter.reportPath':

       … while evaluating definitions from `/nix/store/m6r41z6xm7kxdy9dii1zzqr1x7czg2ss-source/nixosModules/clanCore/nixos-facter.nix':

       (stack trace truncated; use '--show-trace' to show the full, detailed trace)

       error: gRPC QueryValidPaths on 'nix-store.geninf.io:50051' failed: error: substituter 'https://cache-local.geninf.io' is disabled
failed eval checks.aarch64-linux.zerotier —
error: … while evaluating the attribute 'drvPath' at «https://releases.nixos.org/nixpkgs/nixpkgs-26.11pre1097569.e513db7b0a65/nixexprs.tar.xz?na …
error:
       … while evaluating the attribute 'drvPath'
         at «https://releases.nixos.org/nixpkgs/nixpkgs-26.11pre1097569.e513db7b0a65/nixexprs.tar.xz?narHash=sha256-jWdazKTNUOJQ3KE%2B9BAvpBOo6THrD0Qyb3S8F2GduUI%3D»/lib/customisation.nix:416:11:
          415|         // {
          416|           drvPath =
             |           ^
          417|             assert condition;

       … while calling the 'derivationStrict' builtin
         at «nix-internal»/derivation-internal.nix:37:12:
           36|
           37|   strict = derivationStrict drvAttrs;
             |            ^
           38|

       … while evaluating the option `driverConfiguration.vlans':

       … while evaluating definitions from `/nix/store/zsrn88vjmb5hmshm6fimai52blbk3nlc-source/nixos/lib/testing/driver-configuration.nix':

       … while evaluating the option `nodes.controller.networking.interfaces':

       … while evaluating definitions from `/nix/store/zsrn88vjmb5hmshm6fimai52blbk3nlc-source/nixos/modules/hardware/facter/networking':

       … while evaluating the option `nodes.controller.hardware.facter.enable':

       … while evaluating the option `nodes.controller.hardware.facter.report':

       … while evaluating the option `nodes.controller.hardware.facter.reportPath':

       … while evaluating definitions from `/nix/store/m6r41z6xm7kxdy9dii1zzqr1x7czg2ss-source/nixosModules/clanCore/nixos-facter.nix':

       (stack trace truncated; use '--show-trace' to show the full, detailed trace)

       error: gRPC QueryValidPaths on 'nix-store.geninf.io:50051' failed: error: substituter 'https://cache-local.geninf.io' is disabled
failed eval checks.aarch64-linux.zerotier-multi-instance —
error: … while evaluating the attribute 'drvPath' at «https://releases.nixos.org/nixpkgs/nixpkgs-26.11pre1097569.e513db7b0a65/nixexprs.tar.xz?na …
error:
       … while evaluating the attribute 'drvPath'
         at «https://releases.nixos.org/nixpkgs/nixpkgs-26.11pre1097569.e513db7b0a65/nixexprs.tar.xz?narHash=sha256-jWdazKTNUOJQ3KE%2B9BAvpBOo6THrD0Qyb3S8F2GduUI%3D»/lib/customisation.nix:416:11:
          415|         // {
          416|           drvPath =
             |           ^
          417|             assert condition;

       … while calling the 'derivationStrict' builtin
         at «nix-internal»/derivation-internal.nix:37:12:
           36|
           37|   strict = derivationStrict drvAttrs;
             |            ^
           38|

       … while evaluating the option `driverConfiguration.vlans':

       … while evaluating definitions from `/nix/store/zsrn88vjmb5hmshm6fimai52blbk3nlc-source/nixos/lib/testing/driver-configuration.nix':

       … while evaluating the option `nodes.alpha.networking.interfaces':

       … while evaluating definitions from `/nix/store/zsrn88vjmb5hmshm6fimai52blbk3nlc-source/nixos/modules/hardware/facter/networking':

       … while evaluating the option `nodes.alpha.hardware.facter.enable':

       … while evaluating the option `nodes.alpha.hardware.facter.report':

       … while evaluating the option `nodes.alpha.hardware.facter.reportPath':

       … while evaluating definitions from `/nix/store/m6r41z6xm7kxdy9dii1zzqr1x7czg2ss-source/nixosModules/clanCore/nixos-facter.nix':

       (stack trace truncated; use '--show-trace' to show the full, detailed trace)

       error: gRPC QueryValidPaths on 'nix-store.geninf.io:50051' failed: error: substituter 'https://cache-local.geninf.io' is disabled
failed eval checks.x86_64-linux.admin —
error: … while evaluating the attribute 'drvPath' at «https://releases.nixos.org/nixpkgs/nixpkgs-26.11pre1097569.e513db7b0a65/nixexprs.tar.xz?na …
error:
       … while evaluating the attribute 'drvPath'
         at «https://releases.nixos.org/nixpkgs/nixpkgs-26.11pre1097569.e513db7b0a65/nixexprs.tar.xz?narHash=sha256-jWdazKTNUOJQ3KE%2B9BAvpBOo6THrD0Qyb3S8F2GduUI%3D»/lib/customisation.nix:416:11:
          415|         // {
          416|           drvPath =
             |           ^
          417|             assert condition;

       … while calling the 'derivationStrict' builtin
         at «nix-internal»/derivation-internal.nix:37:12:
           36|
           37|   strict = derivationStrict drvAttrs;
             |            ^
           38|

       … while evaluating the option `driverConfiguration.containers.server.start_script':

       … while evaluating definitions from `/nix/store/zsrn88vjmb5hmshm6fimai52blbk3nlc-source/nixos/lib/testing/driver-configuration.nix':

       … while evaluating definitions from `/nix/store/zsrn88vjmb5hmshm6fimai52blbk3nlc-source/nixos/modules/virtualisation/nspawn-container':

       … while evaluating the option `containers.server.system.systemBuilderCommands':

       … while evaluating definitions from `/nix/store/zsrn88vjmb5hmshm6fimai52blbk3nlc-source/nixos/modules/system/activation/activatable-system.nix':

       … while evaluating the option `containers.server.system.activatableSystemBuilderCommands':

       … while evaluating definitions from `/nix/store/zsrn88vjmb5hmshm6fimai52blbk3nlc-source/nixos/modules/system/activation/activatable-system.nix':

       … while evaluating the option `containers.server.system.activationScripts.setupSecrets.text':

       … while evaluating definitions from `/nix/store/m6r41z6xm7kxdy9dii1zzqr1x7czg2ss-source/nixosModules/clanCore/vars/secret/age.nix':

       (stack trace truncated; use '--show-trace' to show the full, detailed trace)

       error: gRPC QueryValidPaths on 'nix-store.geninf.io:50051' failed: error: substituter 'https://cache-local.geninf.io' is disabled
failed eval checks.x86_64-linux.certificates —
error: … while evaluating the attribute 'drvPath' at «https://releases.nixos.org/nixpkgs/nixpkgs-26.11pre1097569.e513db7b0a65/nixexprs.tar.xz?na …
error:
       … while evaluating the attribute 'drvPath'
         at «https://releases.nixos.org/nixpkgs/nixpkgs-26.11pre1097569.e513db7b0a65/nixexprs.tar.xz?narHash=sha256-jWdazKTNUOJQ3KE%2B9BAvpBOo6THrD0Qyb3S8F2GduUI%3D»/lib/customisation.nix:416:11:
          415|         // {
          416|           drvPath =
             |           ^
          417|             assert condition;

       … while calling the 'derivationStrict' builtin
         at «nix-internal»/derivation-internal.nix:37:12:
           36|
           37|   strict = derivationStrict drvAttrs;
             |            ^
           38|

       … while evaluating the option `driverConfiguration.vlans':

       … while evaluating definitions from `/nix/store/zsrn88vjmb5hmshm6fimai52blbk3nlc-source/nixos/lib/testing/driver-configuration.nix':

       … while evaluating the option `containers.ca.networking.interfaces':

       … while evaluating definitions from `/nix/store/zsrn88vjmb5hmshm6fimai52blbk3nlc-source/nixos/modules/hardware/facter/networking':

       … while evaluating the option `containers.ca.hardware.facter.enable':

       … while evaluating the option `containers.ca.hardware.facter.report':

       … while evaluating the option `containers.ca.hardware.facter.reportPath':

       … while evaluating definitions from `/nix/store/m6r41z6xm7kxdy9dii1zzqr1x7czg2ss-source/nixosModules/clanCore/nixos-facter.nix':

       (stack trace truncated; use '--show-trace' to show the full, detailed trace)

       error: gRPC QueryValidPaths on 'nix-store.geninf.io:50051' failed: error: substituter 'https://cache-local.geninf.io' is disabled
failed eval checks.x86_64-linux.data-mesher —
error: … while evaluating the attribute 'drvPath' at «https://releases.nixos.org/nixpkgs/nixpkgs-26.11pre1097569.e513db7b0a65/nixexprs.tar.xz?na …
error:
       … while evaluating the attribute 'drvPath'
         at «https://releases.nixos.org/nixpkgs/nixpkgs-26.11pre1097569.e513db7b0a65/nixexprs.tar.xz?narHash=sha256-jWdazKTNUOJQ3KE%2B9BAvpBOo6THrD0Qyb3S8F2GduUI%3D»/lib/customisation.nix:416:11:
          415|         // {
          416|           drvPath =
             |           ^
          417|             assert condition;

       … while calling the 'derivationStrict' builtin
         at «nix-internal»/derivation-internal.nix:37:12:
           36|
           37|   strict = derivationStrict drvAttrs;
             |            ^
           38|

       … while evaluating the option `driverConfiguration.vlans':

       … while evaluating definitions from `/nix/store/zsrn88vjmb5hmshm6fimai52blbk3nlc-source/nixos/lib/testing/driver-configuration.nix':

       … while evaluating the option `containers.gamma.networking.interfaces':

       … while evaluating definitions from `/nix/store/zsrn88vjmb5hmshm6fimai52blbk3nlc-source/nixos/modules/hardware/facter/networking':

       … while evaluating the option `containers.gamma.hardware.facter.enable':

       … while evaluating the option `containers.gamma.hardware.facter.report':

       … while evaluating the option `containers.gamma.hardware.facter.reportPath':

       … while evaluating definitions from `/nix/store/m6r41z6xm7kxdy9dii1zzqr1x7czg2ss-source/nixosModules/clanCore/nixos-facter.nix':

       (stack trace truncated; use '--show-trace' to show the full, detailed trace)

       error: gRPC QueryValidPaths on 'nix-store.geninf.io:50051' failed: error: substituter 'https://cache-local.geninf.io' is disabled
failed eval checks.x86_64-linux.kde —
error: … while evaluating the attribute 'drvPath' at «https://releases.nixos.org/nixpkgs/nixpkgs-26.11pre1097569.e513db7b0a65/nixexprs.tar.xz?na …
error:
       … while evaluating the attribute 'drvPath'
         at «https://releases.nixos.org/nixpkgs/nixpkgs-26.11pre1097569.e513db7b0a65/nixexprs.tar.xz?narHash=sha256-jWdazKTNUOJQ3KE%2B9BAvpBOo6THrD0Qyb3S8F2GduUI%3D»/lib/customisation.nix:416:11:
          415|         // {
          416|           drvPath =
             |           ^
          417|             assert condition;

       … while calling the 'derivationStrict' builtin
         at «nix-internal»/derivation-internal.nix:37:12:
           36|
           37|   strict = derivationStrict drvAttrs;
             |            ^
           38|

       … while evaluating the option `driverConfiguration.containers.client.start_script':

       … while evaluating definitions from `/nix/store/zsrn88vjmb5hmshm6fimai52blbk3nlc-source/nixos/lib/testing/driver-configuration.nix':

       … while evaluating definitions from `/nix/store/zsrn88vjmb5hmshm6fimai52blbk3nlc-source/nixos/modules/virtualisation/nspawn-container':

       … while evaluating the option `containers.client.system.build.toplevel':

       … while evaluating definitions from `/nix/store/zsrn88vjmb5hmshm6fimai52blbk3nlc-source/nixos/modules/system/activation/top-level.nix':

       … while evaluating the option `containers.client.assertions':

       … while evaluating definitions from `/nix/store/9xlfs4fc7h82mkvvnifbhng24082gqin-source/modules/sops':

       … while evaluating the option `containers.client.sops.secrets':

       … while evaluating definitions from `/nix/store/m6r41z6xm7kxdy9dii1zzqr1x7czg2ss-source/nixosModules/clanCore/sops.nix':

       (stack trace truncated; use '--show-trace' to show the full, detailed trace)

       error: gRPC QueryValidPaths on 'nix-store.geninf.io:50051' failed: error: substituter 'https://cache-local.geninf.io' is disabled
failed eval checks.x86_64-linux.localbackup —
error: … while evaluating the attribute 'drvPath' at «https://releases.nixos.org/nixpkgs/nixpkgs-26.11pre1097569.e513db7b0a65/nixexprs.tar.xz?na …
error:
       … while evaluating the attribute 'drvPath'
         at «https://releases.nixos.org/nixpkgs/nixpkgs-26.11pre1097569.e513db7b0a65/nixexprs.tar.xz?narHash=sha256-jWdazKTNUOJQ3KE%2B9BAvpBOo6THrD0Qyb3S8F2GduUI%3D»/lib/customisation.nix:416:11:
          415|         // {
          416|           drvPath =
             |           ^
          417|             assert condition;

       … while calling the 'derivationStrict' builtin
         at «nix-internal»/derivation-internal.nix:37:12:
           36|
           37|   strict = derivationStrict drvAttrs;
             |            ^
           38|

       … while evaluating the option `driverConfiguration.vlans':

       … while evaluating definitions from `/nix/store/zsrn88vjmb5hmshm6fimai52blbk3nlc-source/nixos/lib/testing/driver-configuration.nix':

       … while evaluating the option `containers.machine.networking.interfaces':

       … while evaluating definitions from `/nix/store/zsrn88vjmb5hmshm6fimai52blbk3nlc-source/nixos/modules/hardware/facter/networking':

       … while evaluating the option `containers.machine.hardware.facter.enable':

       … while evaluating the option `containers.machine.hardware.facter.report':

       … while evaluating the option `containers.machine.hardware.facter.reportPath':

       … while evaluating definitions from `/nix/store/m6r41z6xm7kxdy9dii1zzqr1x7czg2ss-source/nixosModules/clanCore/nixos-facter.nix':

       (stack trace truncated; use '--show-trace' to show the full, detailed trace)

       error: gRPC QueryValidPaths on 'nix-store.geninf.io:50051' failed: error: substituter 'https://cache-local.geninf.io' is disabled
4 already built
skipped attributes
status attribute duration
loading…