nixbot

builds

clan/clan-core build #761 failed

branch main · PR #8136 · commit 5b603d5b3a · · took 3h 0m · eval 1m 26s

eval warnings 5 kinds · 22 occurrences
  • error unable to download 'https://cache.clan.lol/…': HTTP error 503 ×2
  • error unable to download 'https://cache.geninf.io/…': HTTP error 503 ×1
  • warn stdenv.isDarwin is deprecated, use stdenv.hostPlatform.isDarwin instead ×2
  • warn unable to download 'https://cache.clan.lol/…': HTTP error 503 ×12
  • warn unable to download 'https://cache.geninf.io/…': HTTP error 503 ×5

43 failed ⚠ 2
failed attributes
status attribute duration
failed checks.aarch64-linux.all-packages
  • stdenv.isDarwin is deprecated, use stdenv.hostPlatform.isDarwin instead
5m 13s
setup: /nix/store/dywyh5fwvwgrywrf5wh97yhk8ka570pd-zerotier-tools-0.1.0 /nix/store/13dj88d285807n8asni8iwv89nd8vj96-zimg-3.0.6 /nix/store/x1d0al0hilkmh802 …
setup:
  /nix/store/dywyh5fwvwgrywrf5wh97yhk8ka570pd-zerotier-tools-0.1.0
  /nix/store/13dj88d285807n8asni8iwv89nd8vj96-zimg-3.0.6
  /nix/store/x1d0al0hilkmh80215zszn8avng97fyz-zint-2.16.0-lib
  /nix/store/97zr0jgbzdl40mppxlj4hi1r7zy1z39k-zix-0.8.2
  /nix/store/8xhzici5fkh93w1y4wb348si0mk34fan-zvbi-0.2.45
  /nix/store/ykyh31gq07g1770qf71ybs1a71i2b3ff-zxing-cpp-3.1.1
warning: ignoring the client-specified setting 'store', because it is a restricted setting and you are not a trusted user
error: gRPC QueryValidPaths on 'nix-store.geninf.io:50051' failed: error: substituter 'https://cache.clan.lol' is disabled
failed checks.x86_64-linux.all-packages
  • stdenv.isDarwin is deprecated, use stdenv.hostPlatform.isDarwin instead
10m 54s
setup: don't know how to build these paths: /nix/store/pgvq7zy167jdn33hh8v9yv57p9f55pz1-all-packages.drv warning: ignoring the client-specified setting 'store …
setup:
don't know how to build these paths:
  /nix/store/pgvq7zy167jdn33hh8v9yv57p9f55pz1-all-packages.drv
warning: ignoring the client-specified setting 'store', because it is a restricted setting and you are not a trusted user
error: gRPC QueryValidPaths on 'nix-store.geninf.io:50051' failed: error: unable to download 'https://cache.clan.lol/9v8wgp7924y51mic5q0dmf83x5nid11x.narinfo': HTTP error 503

              response body:

              <?xml version="1.0" encoding="UTF-8" standalone="yes"?>
              <Error>
                  <Code>SlowDown</Code>
                  <Message>Your account has made too many requests; try again later.</Message>
              </Error>
failed checks.aarch64-darwin.all-packages 32s
setup: don't know how to build these paths: /nix/store/7kkqpqjxga3g20glhwjz0dxw74grwmlv-all-packages.drv warning: ignoring the client-specified setting 'store …
setup:
don't know how to build these paths:
  /nix/store/7kkqpqjxga3g20glhwjz0dxw74grwmlv-all-packages.drv
warning: ignoring the client-specified setting 'store', because it is a restricted setting and you are not a trusted user
error: gRPC QueryValidPaths on 'nix-store.geninf.io:50051' failed: error: unable to download 'https://cache.clan.lol/zhfj1vya8jj0jsk0sb6hq80k4zs746aq.narinfo': HTTP error 503

              response body:

              <?xml version="1.0" encoding="UTF-8" standalone="yes"?>
              <Error>
                  <Code>SlowDown</Code>
                  <Message>Your account has made too many requests; try again later.</Message>
              </Error>
failed checks.aarch64-darwin.clan-pytest-with-core 3h 0m
setup: don't know how to build these paths: /nix/store/yhq0hj67npmvsnqsl1fqgbymiwapss4g-clan-pytest-with-core.drv warning: ignoring the client-specified setti …
setup:
don't know how to build these paths:
  /nix/store/yhq0hj67npmvsnqsl1fqgbymiwapss4g-clan-pytest-with-core.drv
warning: ignoring the client-specified setting 'store', because it is a restricted setting and you are not a trusted user
3vvx84nsdn7d4rgg66gsadddm09zg2fz-clan-runtime.drv: error: gRPC QueryValidPaths on 'nix-store.geninf.io:50051' failed: error: substituter 'https://cache.clan.lol' is disabled
failed checks.aarch64-darwin.clan-pytest-without-core 3h 0m
setup: don't know how to build these paths: /nix/store/8xnib21qckmz1g14k537jnj2a55skbk4-clan-pytest-without-core.drv warning: ignoring the client-specified se …
setup:
don't know how to build these paths:
  /nix/store/8xnib21qckmz1g14k537jnj2a55skbk4-clan-pytest-without-core.drv
warning: ignoring the client-specified setting 'store', because it is a restricted setting and you are not a trusted user
failed checks.aarch64-darwin.darwin-test-darwin-machine 2m 8s
setup: don't know how to build these paths: /nix/store/jpr410iwwx7pllpfkdaj58651gs1n9qf-darwin-system-26.11.4cff07d.drv warning: ignoring the client-specified …
setup:
don't know how to build these paths:
  /nix/store/jpr410iwwx7pllpfkdaj58651gs1n9qf-darwin-system-26.11.4cff07d.drv
warning: ignoring the client-specified setting 'store', because it is a restricted setting and you are not a trusted user
error: gRPC QueryValidPaths on 'nix-store.geninf.io:50051' failed: error: substituter 'https://cache.clan.lol' is disabled
dependency failed checks.aarch64-darwin.devshell —
failed checks.aarch64-darwin.devShell-clan-cli 2m 15s
setup: don't know how to build these paths: /nix/store/3gb5mrps4159p9bvzvhba0g2wqdjrc6f-clan-cli.drv warning: ignoring the client-specified setting 'store', b …
setup:
don't know how to build these paths:
  /nix/store/3gb5mrps4159p9bvzvhba0g2wqdjrc6f-clan-cli.drv
warning: ignoring the client-specified setting 'store', because it is a restricted setting and you are not a trusted user
error: gRPC QueryValidPaths on 'nix-store.geninf.io:50051' failed: error: substituter 'https://cache.clan.lol' is disabled
failed checks.aarch64-darwin.devShell-clan-site 5m 26s
setup: /nix/store/wzyfyvf8y725031x5n6y7adpiik5kyrx-options.json /nix/store/yncr36b8a42wj0qbj67k45vnmvkm3a1q-options.json /nix/store/ynnb5bsbgp3ba5qz828p35 …
setup:
  /nix/store/wzyfyvf8y725031x5n6y7adpiik5kyrx-options.json
  /nix/store/yncr36b8a42wj0qbj67k45vnmvkm3a1q-options.json
  /nix/store/ynnb5bsbgp3ba5qz828p35lwz67pzhfz-options.json
  /nix/store/z41s7ffxiraimxlq2vg13g04yq28j45p-options.json
  /nix/store/zsh04h4ym29yz03w3zbpgi1v11011n30-options.json
warning: ignoring the client-specified setting 'store', because it is a restricted setting and you are not a trusted user
3vvx84nsdn7d4rgg66gsadddm09zg2fz-clan-runtime.drv: error: gRPC QueryValidPaths on 'nix-store.geninf.io:50051' failed: error: substituter 'https://cache.clan.lol' is disabled
error: dependency 'xq8svwhc3s50jhx5lmbk56j5b6gmzv13-generated-docs.drv' failed
failed checks.aarch64-darwin.devShell-default 3h 0m
setup: these 2 derivations will be built: /nix/store/3vvx84nsdn7d4rgg66gsadddm09zg2fz-clan-runtime.drv /nix/store/klngg6skb468ys4wi54ii50ahzi1yz8i-clan.drv …
setup:
these 2 derivations will be built:
  /nix/store/3vvx84nsdn7d4rgg66gsadddm09zg2fz-clan-runtime.drv
  /nix/store/klngg6skb468ys4wi54ii50ahzi1yz8i-clan.drv
warning: ignoring the client-specified setting 'store', because it is a restricted setting and you are not a trusted user
failed checks.aarch64-darwin.devShell-inventory-schema 3m 22s
setup: these 2 derivations will be built: /nix/store/3vvx84nsdn7d4rgg66gsadddm09zg2fz-clan-runtime.drv /nix/store/dajmvlvxwpc0crgwi0m93rw6zn6z18cr-clan-inve …
setup:
these 2 derivations will be built:
  /nix/store/3vvx84nsdn7d4rgg66gsadddm09zg2fz-clan-runtime.drv
  /nix/store/dajmvlvxwpc0crgwi0m93rw6zn6z18cr-clan-inventory-schema.drv
warning: ignoring the client-specified setting 'store', because it is a restricted setting and you are not a trusted user
error: gRPC QueryValidPaths on 'nix-store.geninf.io:50051' failed: error: substituter 'https://cache.clan.lol' is disabled
failed checks.aarch64-darwin.eval-tests 3h 0m
setup: don't know how to build these paths: /nix/store/prgbhzxfdw20717r16c1mj4sl2vj158p-eval-tests-aarch64-darwin.drv warning: ignoring the client-specified s …
setup:
don't know how to build these paths:
  /nix/store/prgbhzxfdw20717r16c1mj4sl2vj158p-eval-tests-aarch64-darwin.drv
warning: ignoring the client-specified setting 'store', because it is a restricted setting and you are not a trusted user
failed checks.aarch64-darwin.nixos-flash-installer 1m 13s
setup: don't know how to build these paths: /nix/store/gn4ik14yxxmk8m5x7ngd6h0ahjhzp07c-nixos-system-flash-installer-26.11.20260923.8825beb.drv warning: ignor …
setup:
don't know how to build these paths:
  /nix/store/gn4ik14yxxmk8m5x7ngd6h0ahjhzp07c-nixos-system-flash-installer-26.11.20260923.8825beb.drv
warning: ignoring the client-specified setting 'store', because it is a restricted setting and you are not a trusted user
error: gRPC QueryValidPaths on 'nix-store.geninf.io:50051' failed: error: unable to download 'https://cache.clan.lol/0fk6qf9dzrq59iby1i76i362f9dam57l.narinfo': HTTP error 503

              response body:

              <?xml version="1.0" encoding="UTF-8" standalone="yes"?>
              <Error>
                  <Code>SlowDown</Code>
                  <Message>Your account has made too many requests; try again later.</Message>
              </Error>
failed checks.aarch64-linux.borgbackup 6m 39s
setup: don't know how to build these paths: /nix/store/qwkcw7n7vw7z5izwjxa91zp78sczacg7-container-test-run-borgbackup.drv warning: ignoring the client-specifi …
setup:
don't know how to build these paths:
  /nix/store/qwkcw7n7vw7z5izwjxa91zp78sczacg7-container-test-run-borgbackup.drv
warning: ignoring the client-specified setting 'store', because it is a restricted setting and you are not a trusted user
error: gRPC QueryValidPaths on 'nix-store.geninf.io:50051' failed: error: substituter 'https://cache.clan.lol' is disabled
failed checks.aarch64-linux.certificates 57s
setup: don't know how to build these paths: /nix/store/d5y1j2r5j3isln4sm4v65w29z040smc1-container-test-run-certificates.drv warning: ignoring the client-speci …
setup:
don't know how to build these paths:
  /nix/store/d5y1j2r5j3isln4sm4v65w29z040smc1-container-test-run-certificates.drv
warning: ignoring the client-specified setting 'store', because it is a restricted setting and you are not a trusted user
error: gRPC QueryValidPaths on 'nix-store.geninf.io:50051' failed: error: unable to download 'https://cache.geninf.io/7lm2nqvds1g206kp3fd1rw0lh4y9vp18.narinfo': HTTP error 503

              response body:

              <?xml version="1.0" encoding="UTF-8" standalone="yes"?>
              <Error>
                  <Code>SlowDown</Code>
                  <Message>Your account has made too many requests; try again later.</Message>
              </Error>
failed checks.aarch64-linux.clan-test-iso 6m 57s
setup: 61iywkph5cni07panaq8wfxgmrisgfvr-etc-os-release.drv: build01: not scheduled here: 61iywkph5cni07panaq8wfxgmrisgfvr-etc-os-release.drv, asking the schedul …
setup:
61iywkph5cni07panaq8wfxgmrisgfvr-etc-os-release.drv: build01: not scheduled here: 61iywkph5cni07panaq8wfxgmrisgfvr-etc-os-release.drv, asking the scheduler again
7znnd0yf5cm4qmaxaf8c5vbriwxa3ssv-nixos-version.drv: build01: not scheduled here: 7znnd0yf5cm4qmaxaf8c5vbriwxa3ssv-nixos-version.drv, asking the scheduler again
mka3pgmbkrhwnn5dnb81c01s936a0n82-etc-nix-registry.json.drv: build01: not scheduled here: mka3pgmbkrhwnn5dnb81c01s936a0n82-etc-nix-registry.json.drv, asking the scheduler again
4amqqs023330gdmnj86878dw7s46yrz2-version.drv: build01: not scheduled here: 4amqqs023330gdmnj86878dw7s46yrz2-version.drv, asking the scheduler again
lqk5yzs4q34ki0pmyv045y1fkcra691l-clan-runtime.drv: build01: not scheduled here: lqk5yzs4q34ki0pmyv045y1fkcra691l-clan-runtime.drv, asking the scheduler again
c7zy772jsg3fd301z28x0r4l5m30kgm8-boot.json.drv: build01: not scheduled here: c7zy772jsg3fd301z28x0r4l5m30kgm8-boot.json.drv, asking the scheduler again
5h1996nghblcmm1agsd7741ga4sbmbsw-X-Restart-Triggers-dbus-broker.drv: error: gRPC QueryValidPaths on 'nix-store.geninf.io:50051' failed: error: unable to download 'https://cache.clan.lol/5h1996nghblcmm1agsd7741ga4sbmbsw.narinfo': HTTP error 503

              response body:

              <?xml version="1.0" encoding="UTF-8" standalone="yes"?>
              <Error>
                  <Code>SlowDown</Code>
                  <Message>Your account has made too many requests; try again later.</Message>
              </Error>
error: dependency 'nyaa1qmgbspq1qsi8mmdq9xnmcbdavd2-nixos-test-driver-clan-test-iso.drv' failed
failed checks.aarch64-linux.darwin-test-darwin-machine 3m 14s
setup: don't know how to build these paths: /nix/store/jpr410iwwx7pllpfkdaj58651gs1n9qf-darwin-system-26.11.4cff07d.drv warning: ignoring the client-specified …
setup:
don't know how to build these paths:
  /nix/store/jpr410iwwx7pllpfkdaj58651gs1n9qf-darwin-system-26.11.4cff07d.drv
warning: ignoring the client-specified setting 'store', because it is a restricted setting and you are not a trusted user
error: gRPC QueryValidPaths on 'nix-store.geninf.io:50051' failed: error: substituter 'https://cache.clan.lol' is disabled
failed checks.aarch64-linux.dyndns 10m 35s
setup: don't know how to build these paths: /nix/store/cg58l1ksh84vaiqn0i6q7n0qhg58bh7c-container-test-run-dyndns.drv warning: ignoring the client-specified s …
setup:
don't know how to build these paths:
  /nix/store/cg58l1ksh84vaiqn0i6q7n0qhg58bh7c-container-test-run-dyndns.drv
warning: ignoring the client-specified setting 'store', because it is a restricted setting and you are not a trusted user
v3i4ccqv8mjh5njn6hv35dylj3pw3nh2-system-units.drv: error: gRPC QueryValidPaths on 'nix-store.geninf.io:50051' failed: error: substituter 'https://cache.clan.lol' is disabled
error: dependency '11v0m1cvrn8jdvw1ccdwgy578hhijfl9-nixos-test-driver-dyndns.drv' failed
failed checks.aarch64-linux.kde 2m 25s
setup: don't know how to build these paths: /nix/store/kh1ny8jj8v5r0abwxs3m0mddds0yc4f0-container-test-run-kde.drv warning: ignoring the client-specified sett …
setup:
don't know how to build these paths:
  /nix/store/kh1ny8jj8v5r0abwxs3m0mddds0yc4f0-container-test-run-kde.drv
warning: ignoring the client-specified setting 'store', because it is a restricted setting and you are not a trusted user
error: gRPC QueryValidPaths on 'nix-store.geninf.io:50051' failed: error: unable to download 'https://cache.geninf.io/1m7sy7k8lhyh2za8h2n430zgn90c5z5q.narinfo': HTTP error 503

              response body:

              <?xml version="1.0" encoding="UTF-8" standalone="yes"?>
              <Error>
                  <Code>SlowDown</Code>
                  <Message>Your account has made too many requests; try again later.</Message>
              </Error>
failed checks.aarch64-linux.nixos-documentation 4m 34s
setup: don't know how to build these paths: /nix/store/6da732qh7v0g894c32a0d0nlwd8k5dkz-nixos-system-test-documentation-26.11.20260923.8825beb.drv warning: ig …
setup:
don't know how to build these paths:
  /nix/store/6da732qh7v0g894c32a0d0nlwd8k5dkz-nixos-system-test-documentation-26.11.20260923.8825beb.drv
warning: ignoring the client-specified setting 'store', because it is a restricted setting and you are not a trusted user
sd2xny4iw66f4hdrbb49m6b6bvjqcvc3-nixos-configuration-reference-manpage.drv: error: gRPC QueryValidPaths on 'nix-store.geninf.io:50051' failed: error: substituter 'https://cache.clan.lol' is disabled
62acabx103zff9n4rww35isc6ny12l30-etc-os-release.drv: error: gRPC QueryValidPaths on 'nix-store.geninf.io:50051' failed: error: substituter 'https://cache.clan.lol' is disabled
error: dependency 'k681431f8yg89hgmiz5v9hssjylg4nsf-system-path.drv' failed
failed checks.aarch64-linux.nixos-flash-installer 5m 6s
setup: a23l4892n9nclcmvhz70fsjiwwx48d40-nixos-26.11.20260923.8825beb.drv: error: gRPC QueryValidPaths on 'nix-store.geninf.io:50051' failed: error: substituter …
setup:
a23l4892n9nclcmvhz70fsjiwwx48d40-nixos-26.11.20260923.8825beb.drv: error: gRPC QueryValidPaths on 'nix-store.geninf.io:50051' failed: error: substituter 'https://cache.geninf.io' is disabled
lzy3swnfxmlwwn38n1hzv3x9qfrb1s4y-unit-systemd-fsck-.service.drv: error: gRPC QueryValidPaths on 'nix-store.geninf.io:50051' failed: error: substituter 'https://cache.geninf.io' is disabled
jnfpn4smxq0llk1w5kg7175m69z1fkj5-etc-os-release.drv: error: gRPC QueryValidPaths on 'nix-store.geninf.io:50051' failed: error: substituter 'https://cache.geninf.io' is disabled
0xxi4ckhx9s1awrvd8arp4qy54lx1l00-dry-activate.drv: error: gRPC QueryValidPaths on 'nix-store.geninf.io:50051' failed: error: substituter 'https://cache.clan.lol' is disabled
f2jxja30ks5kjrsfw2j0xrbf2kjmcj3q-unit-reload-systemd-vconsole-setup.service.drv: error: gRPC QueryValidPaths on 'nix-store.geninf.io:50051' failed: error: substituter 'https://cache.clan.lol' is disabled
6z6q2bx7pckan94h3w4r19f97jbrlv75-unit-systemd-sysctl.service.drv: error: gRPC QueryValidPaths on 'nix-store.geninf.io:50051' failed: error: substituter 'https://cache.clan.lol' is disabled
nv9i52xn5il1sxxlkypscxpfgr39l4g4-etc-profile.drv: error: gRPC QueryValidPaths on 'nix-store.geninf.io:50051' failed: error: substituter 'https://cache.clan.lol' is disabled
error: dependency '1n1fa6dwi5hjc8rwly8yg33v5wgi3dy4-system-path.drv' failed
failed checks.aarch64-linux.nixos-test-wayland-proxy-virtwl 7m 0s
setup: don't know how to build these paths: /nix/store/sfgbcycpan8cw74sqnilfv2004mxhi5h-vm-test-run-wayland-proxy-virtwl.drv warning: ignoring the client-spec …
setup:
don't know how to build these paths:
  /nix/store/sfgbcycpan8cw74sqnilfv2004mxhi5h-vm-test-run-wayland-proxy-virtwl.drv
warning: ignoring the client-specified setting 'store', because it is a restricted setting and you are not a trusted user
error: gRPC QueryValidPaths on 'nix-store.geninf.io:50051' failed: error: unable to download 'https://cache.geninf.io/wdz9nrmy3y3h81iqlbmc43lah3xrr5wz.narinfo': HTTP error 503

              response body:

              <?xml version="1.0" encoding="UTF-8" standalone="yes"?>
              <Error>
                  <Code>SlowDown</Code>
                  <Message>Your account has made too many requests; try again later.</Message>
              </Error>
failed checks.aarch64-linux.service-dummy-test-from-flake 2m 14s
setup: don't know how to build these paths: /nix/store/9iglbkqwknshjfbiyl4lsbhmfa3na5rm-container-test-run-service-dummy-test-from-flake.drv warning: ignoring …
setup:
don't know how to build these paths:
  /nix/store/9iglbkqwknshjfbiyl4lsbhmfa3na5rm-container-test-run-service-dummy-test-from-flake.drv
warning: ignoring the client-specified setting 'store', because it is a restricted setting and you are not a trusted user
error: gRPC QueryValidPaths on 'nix-store.geninf.io:50051' failed: error: substituter 'https://cache.clan.lol' is disabled
failed checks.aarch64-linux.treefmt 10s
setup: don't know how to build these paths: /nix/store/sg0fcjb9m2ifg0bkv3a26qdsd85x5gl0-treefmt-check.drv warning: ignoring the client-specified setting 'stor …
setup:
don't know how to build these paths:
  /nix/store/sg0fcjb9m2ifg0bkv3a26qdsd85x5gl0-treefmt-check.drv
warning: ignoring the client-specified setting 'store', because it is a restricted setting and you are not a trusted user
error: gRPC QueryValidPaths on 'nix-store.geninf.io:50051' failed: error: unable to download 'https://cache.clan.lol/pd0iq4dhgczm32770bhkkd852f5zgbdm.narinfo': HTTP error 503

              response body:

              <?xml version="1.0" encoding="UTF-8" standalone="yes"?>
              <Error>
                  <Code>SlowDown</Code>
                  <Message>Your account has made too many requests; try again later.</Message>
              </Error>
failed checks.x86_64-linux.borgbackup 5m 39s
setup: don't know how to build these paths: /nix/store/j0zx94qbiwil8li0y61rlcp04gvs6jgf-container-test-run-borgbackup.drv warning: ignoring the client-specifi …
setup:
don't know how to build these paths:
  /nix/store/j0zx94qbiwil8li0y61rlcp04gvs6jgf-container-test-run-borgbackup.drv
warning: ignoring the client-specified setting 'store', because it is a restricted setting and you are not a trusted user
error: gRPC QueryValidPaths on 'nix-store.geninf.io:50051' failed: error: substituter 'https://cache.clan.lol' is disabled
failed checks.x86_64-linux.clan-pytest-with-core 6m 29s
setup: /nix/store/96r2n039x32s0qmcgabx19l7m7c0aq6j-zlib-1.3.2 /nix/store/6vdilqj08xqi91w72bvhxpxpmck591mh-zlib-1.3.2-dev /nix/store/qn3f3m8xmnwnsnbkldlmic …
setup:
  /nix/store/96r2n039x32s0qmcgabx19l7m7c0aq6j-zlib-1.3.2
  /nix/store/6vdilqj08xqi91w72bvhxpxpmck591mh-zlib-1.3.2-dev
  /nix/store/qn3f3m8xmnwnsnbkldlmicgx6cmxls0y-zlib-1.3.2-static
  /nix/store/13vkic2v8zac4m6p38asdhasb3xylv07-zlib-1.3.2.tar.gz
  /nix/store/18agc3vzx1yqx1hz807wa4iflsy02ifw-zlib-1.3.2.tar.xz
warning: ignoring the client-specified setting 'store', because it is a restricted setting and you are not a trusted user
zqha699h9im1n1ia9m7llpml8v66azyc-clan-core-flake.drv: error: gRPC QueryValidPaths on 'nix-store.geninf.io:50051' failed: error: substituter 'https://cache.clan.lol' is disabled
error: dependency 'zqha699h9im1n1ia9m7llpml8v66azyc-clan-core-flake.drv' failed
failed checks.x86_64-linux.clan-pytest-without-core 2m 9s
setup: don't know how to build these paths: /nix/store/bmrca8h67i8raglm5xpbshchdrim8sfg-clan-pytest-without-core.drv warning: ignoring the client-specified se …
setup:
don't know how to build these paths:
  /nix/store/bmrca8h67i8raglm5xpbshchdrim8sfg-clan-pytest-without-core.drv
warning: ignoring the client-specified setting 'store', because it is a restricted setting and you are not a trusted user
error: gRPC QueryValidPaths on 'nix-store.geninf.io:50051' failed: error: substituter 'https://cache.clan.lol' is disabled
failed checks.x86_64-linux.clan-test-iso 5m 8s
setup: /nix/store/mg99nwsyx64nh2hglnx30qpwhrn0dgsx--test-run-clan-test-iso.drv warning: ignoring the client-specified setting 'store', because it is a restric …
setup:
  /nix/store/mg99nwsyx64nh2hglnx30qpwhrn0dgsx--test-run-clan-test-iso.drv
warning: ignoring the client-specified setting 'store', because it is a restricted setting and you are not a trusted user
n7kv70d1ka4s4swmh5lp7dj5s5w11a70-version.drv: error: gRPC QueryValidPaths on 'nix-store.geninf.io:50051' failed: error: substituter 'https://cache.clan.lol' is disabled
341x5bdgp5k5fh7s9g71dh18a7saiq3n-boot.json.drv: error: gRPC QueryValidPaths on 'nix-store.geninf.io:50051' failed: error: substituter 'https://cache.clan.lol' is disabled
62acabx103zff9n4rww35isc6ny12l30-etc-os-release.drv: error: gRPC QueryValidPaths on 'nix-store.geninf.io:50051' failed: error: substituter 'https://cache.clan.lol' is disabled
08ymr99abn74vwz3n8gry4y8xmy6jgxg-system-path.drv: error: gRPC QueryValidPaths on 'nix-store.geninf.io:50051' failed: error: substituter 'https://cache.clan.lol' is disabled
5a0kcrw6apc5c11f5pnk3rhiijiwmalz-clan-cli.drv: error: gRPC QueryValidPaths on 'nix-store.geninf.io:50051' failed: error: substituter 'https://cache.clan.lol' is disabled
error: dependency 'g4p2lly8lvblprlr68mr018q711b0djk-nixos-test-driver-clan-test-iso.drv' failed
failed checks.x86_64-linux.darwin-test-darwin-machine 7m 29s
setup: /nix/store/ryrp6a39pymxm8ycwabzkcbnnd5l2wlc-system-applications.drv these 4 paths will be fetched (12.6 KiB download, 1.5 MiB unpacked): /nix/store/b …
setup:
  /nix/store/ryrp6a39pymxm8ycwabzkcbnnd5l2wlc-system-applications.drv
these 4 paths will be fetched (12.6 KiB download, 1.5 MiB unpacked):
  /nix/store/b3qc7g87p05v8d84kisn6770y6788nyp-darwin-version.json
  /nix/store/6z83w67z72j57j6gajhxsw93lkv7spl7-documentation-highlighter
  /nix/store/0czk99ql8ahji44vcbvr8iwwzi2mkq1l-options.json
  /nix/store/igsyrbs06ym9nh3wnyqf8bngkqhgqnpb-options.json
warning: ignoring the client-specified setting 'store', because it is a restricted setting and you are not a trusted user
error: gRPC QueryValidPaths on 'nix-store.geninf.io:50051' failed: error: unable to download 'https://cache.geninf.io/0h8cvp0pdzyprjak6jg6vyymknssg7lg.narinfo': HTTP error 503

              response body:

              <?xml version="1.0" encoding="UTF-8" standalone="yes"?>
              <Error>
                  <Code>SlowDown</Code>
                  <Message>Your account has made too many requests; try again later.</Message>
              </Error>
dependency failed checks.x86_64-linux.devshell —
failed checks.x86_64-linux.devShell-clan-site 13m 19s
setup: don't know how to build these paths: /nix/store/pnbnkmk1z8x1v7j19ni8jx2qaivifqay-nix-shell.drv warning: ignoring the client-specified setting 'store', …
setup:
don't know how to build these paths:
  /nix/store/pnbnkmk1z8x1v7j19ni8jx2qaivifqay-nix-shell.drv
warning: ignoring the client-specified setting 'store', because it is a restricted setting and you are not a trusted user
error: gRPC QueryValidPaths on 'nix-store.geninf.io:50051' failed: error: substituter 'https://cache.clan.lol' is disabled
failed checks.x86_64-linux.devShell-default 5s
setup: don't know how to build these paths: /nix/store/gm4zw5f5gwyp6dk70w36vdcpiqa4j293-clan.drv warning: ignoring the client-specified setting 'store', becau …
setup:
don't know how to build these paths:
  /nix/store/gm4zw5f5gwyp6dk70w36vdcpiqa4j293-clan.drv
warning: ignoring the client-specified setting 'store', because it is a restricted setting and you are not a trusted user
error: gRPC QueryValidPaths on 'nix-store.geninf.io:50051' failed: error: substituter 'https://cache.geninf.io' is disabled
failed checks.x86_64-linux.dyndns 4m 4s
setup: don't know how to build these paths: /nix/store/0mh92k7jqimwhyxf511gkjm89i5kfb5l-container-test-run-dyndns.drv warning: ignoring the client-specified s …
setup:
don't know how to build these paths:
  /nix/store/0mh92k7jqimwhyxf511gkjm89i5kfb5l-container-test-run-dyndns.drv
warning: ignoring the client-specified setting 'store', because it is a restricted setting and you are not a trusted user
error: gRPC QueryValidPaths on 'nix-store.geninf.io:50051' failed: error: substituter 'https://cache.clan.lol' is disabled
failed checks.x86_64-linux.eval-tests 4m 6s
setup: /nix/store/xnx7cczg49l8i4i3r2hy5lnr3xy8s8kp-eval-tests-x86_64-linux.drv warning: ignoring the client-specified setting 'store', because it is a restric …
setup:
  /nix/store/xnx7cczg49l8i4i3r2hy5lnr3xy8s8kp-eval-tests-x86_64-linux.drv
warning: ignoring the client-specified setting 'store', because it is a restricted setting and you are not a trusted user
d4yd4z5hscrmfxvf69552as7a13zjb3q-evalCheck-eval-tests-hello-world.drv: error: gRPC QueryValidPaths on 'nix-store.geninf.io:50051' failed: error: substituter 'https://cache.geninf.io' is disabled
2slzzdj0nnnqc9wf462v5xabfn8qll51-evalCheck-eval-vars-backends.drv: error: gRPC QueryValidPaths on 'nix-store.geninf.io:50051' failed: error: substituter 'https://cache.geninf.io' is disabled
x9xskj5hxa7rx7ywx6h3pk1ama4cx3r7-evalCheck-eval-lib-resolve-module.drv: error: gRPC QueryValidPaths on 'nix-store.geninf.io:50051' failed: error: substituter 'https://cache.geninf.io' is disabled
dzm13k3dnkih25h5547c641ijihljpz3-evalCheck-eval-generators-to-sops.drv: error: gRPC QueryValidPaths on 'nix-store.geninf.io:50051' failed: error: substituter 'https://cache.geninf.io' is disabled
r7lh6rpxvjl40hmbvgbrnrz7s63jyyim-evalCheck-eval-tests-syncthing.drv: error: gRPC QueryValidPaths on 'nix-store.geninf.io:50051' failed: error: substituter 'https://cache.geninf.io' is disabled
error: dependency 'd4yd4z5hscrmfxvf69552as7a13zjb3q-evalCheck-eval-tests-hello-world.drv' failed
failed checks.x86_64-linux.kde 1m 1s
setup: don't know how to build these paths: /nix/store/2ms2563srysi3wfifsq5gbfxmdj1zf4b-container-test-run-kde.drv warning: ignoring the client-specified sett …
setup:
don't know how to build these paths:
  /nix/store/2ms2563srysi3wfifsq5gbfxmdj1zf4b-container-test-run-kde.drv
warning: ignoring the client-specified setting 'store', because it is a restricted setting and you are not a trusted user
error: gRPC QueryValidPaths on 'nix-store.geninf.io:50051' failed: error: substituter 'https://cache.clan.lol' is disabled
failed checks.x86_64-linux.nixos-documentation 4m 13s
setup: don't know how to build these paths: /nix/store/6da732qh7v0g894c32a0d0nlwd8k5dkz-nixos-system-test-documentation-26.11.20260923.8825beb.drv warning: ig …
setup:
don't know how to build these paths:
  /nix/store/6da732qh7v0g894c32a0d0nlwd8k5dkz-nixos-system-test-documentation-26.11.20260923.8825beb.drv
warning: ignoring the client-specified setting 'store', because it is a restricted setting and you are not a trusted user
error: gRPC QueryValidPaths on 'nix-store.geninf.io:50051' failed: error: unable to download 'https://cache.clan.lol/nas2p23aa1i2xdxb1ga4lhbbdswranfq.narinfo': HTTP error 503

              response body:

              <?xml version="1.0" encoding="UTF-8" standalone="yes"?>
              <Error>
                  <Code>SlowDown</Code>
                  <Message>Your account has made too many requests; try again later.</Message>
              </Error>
failed checks.x86_64-linux.nixos-test-flash 50s
setup: don't know how to build these paths: /nix/store/5r19f02m16j3dqy566gnhs212asbr6p3-vm-test-run-flash.drv warning: ignoring the client-specified setting ' …
setup:
don't know how to build these paths:
  /nix/store/5r19f02m16j3dqy566gnhs212asbr6p3-vm-test-run-flash.drv
warning: ignoring the client-specified setting 'store', because it is a restricted setting and you are not a trusted user
error: gRPC QueryValidPaths on 'nix-store.geninf.io:50051' failed: error: unable to download 'https://cache.clan.lol/vk22gmh4p4dm5bbn4gqkha7x7vmjh2zi.narinfo': HTTP error 503

              response body:

              <?xml version="1.0" encoding="UTF-8" standalone="yes"?>
              <Error>
                  <Code>SlowDown</Code>
                  <Message>Your account has made too many requests; try again later.</Message>
              </Error>
failed checks.x86_64-linux.nixos-test-installation 3m 0s
setup: /nix/store/55w1wmglzz40qrma8scg6dzn2f6gc2fj-zlib-1.3.2 /nix/store/96r2n039x32s0qmcgabx19l7m7c0aq6j-zlib-1.3.2 /nix/store/6vdilqj08xqi91w72bvhxpxpmc …
setup:
  /nix/store/55w1wmglzz40qrma8scg6dzn2f6gc2fj-zlib-1.3.2
  /nix/store/96r2n039x32s0qmcgabx19l7m7c0aq6j-zlib-1.3.2
  /nix/store/6vdilqj08xqi91w72bvhxpxpmck591mh-zlib-1.3.2-dev
  /nix/store/qn3f3m8xmnwnsnbkldlmicgx6cmxls0y-zlib-1.3.2-static
  /nix/store/13vkic2v8zac4m6p38asdhasb3xylv07-zlib-1.3.2.tar.gz
  /nix/store/18agc3vzx1yqx1hz807wa4iflsy02ifw-zlib-1.3.2.tar.xz
warning: ignoring the client-specified setting 'store', because it is a restricted setting and you are not a trusted user
error: gRPC QueryValidPaths on 'nix-store.geninf.io:50051' failed: error: unable to download 'https://cache.geninf.io/6bbc122lh1gqqk1pnfw3y6adm2xaigs5.narinfo': HTTP error 503

              response body:

              <?xml version="1.0" encoding="UTF-8" standalone="yes"?>
              <Error>
                  <Code>SlowDown</Code>
                  <Message>Your account has made too many requests; try again later.</Message>
              </Error>
failed checks.x86_64-linux.nixos-test-installation-age 5m 9s
setup: don't know how to build these paths: /nix/store/2a2zpl2cjja6vg2i1xar7mmqc5nmaw8c-vm-test-run-installation.drv warning: ignoring the client-specified se …
setup:
don't know how to build these paths:
  /nix/store/2a2zpl2cjja6vg2i1xar7mmqc5nmaw8c-vm-test-run-installation.drv
warning: ignoring the client-specified setting 'store', because it is a restricted setting and you are not a trusted user
9p64pl2s1lc3h5r4a5g3bxr91cs4lvws-closure-info.drv: error: gRPC QueryValidPaths on 'nix-store.geninf.io:50051' failed: error: substituter 'https://cache.clan.lol' is disabled
5a0kcrw6apc5c11f5pnk3rhiijiwmalz-clan-cli.drv: error: gRPC QueryValidPaths on 'nix-store.geninf.io:50051' failed: error: substituter 'https://cache.clan.lol' is disabled
error: dependency 'xs93g2zb2vki9ld2794r99wi836xy0kn-nixos-test-driver-installation.drv' failed
failed checks.x86_64-linux.nixos-test-installation-password-store 5m 9s
setup: don't know how to build these paths: /nix/store/vqyjkkysj7i6gl3wf5y83xnbv038kl0p-vm-test-run-installation.drv warning: ignoring the client-specified se …
setup:
don't know how to build these paths:
  /nix/store/vqyjkkysj7i6gl3wf5y83xnbv038kl0p-vm-test-run-installation.drv
warning: ignoring the client-specified setting 'store', because it is a restricted setting and you are not a trusted user
f4yxzp4yg73cascgjm9a17yll3r5sjdr-clan-runtime.drv: build-x86-01: not scheduled here: f4yxzp4yg73cascgjm9a17yll3r5sjdr-clan-runtime.drv, asking the scheduler again
d6rzwg7j03inz9avnrsasrnsi2y4vm0m-installation-test-flake-x86_64-linux.drv: gi-build-x86-01: not scheduled here: d6rzwg7j03inz9avnrsasrnsi2y4vm0m-installation-test-flake-x86_64-linux.drv, asking the scheduler again
9p64pl2s1lc3h5r4a5g3bxr91cs4lvws-closure-info.drv: error: gRPC QueryValidPaths on 'nix-store.geninf.io:50051' failed: error: substituter 'https://cache.clan.lol' is disabled
5a0kcrw6apc5c11f5pnk3rhiijiwmalz-clan-cli.drv: error: gRPC QueryValidPaths on 'nix-store.geninf.io:50051' failed: error: substituter 'https://cache.clan.lol' is disabled
error: dependency '83wxg26fm75p05cgmg95d8hrjrwx83al-nixos-test-driver-installation.drv' failed
failed checks.x86_64-linux.nixos-test-update-hardware-configuration 37s
setup: don't know how to build these paths: /nix/store/g6ykmf107hbyjyqlcy9wgb9p6g8zhv8n-vm-test-run-update-hardware-configuration.drv warning: ignoring the cl …
setup:
don't know how to build these paths:
  /nix/store/g6ykmf107hbyjyqlcy9wgb9p6g8zhv8n-vm-test-run-update-hardware-configuration.drv
warning: ignoring the client-specified setting 'store', because it is a restricted setting and you are not a trusted user
error: gRPC QueryValidPaths on 'nix-store.geninf.io:50051' failed: error: unable to download 'https://cache.geninf.io/82k3xr7cxv3imminfayzz5yhnxbchj55.narinfo': HTTP error 503

              response body:

              <?xml version="1.0" encoding="UTF-8" standalone="yes"?>
              <Error>
                  <Code>SlowDown</Code>
                  <Message>Your account has made too many requests; try again later.</Message>
              </Error>
failed checks.x86_64-linux.nixos-test-wayland-proxy-virtwl 22m 14s
setup: 1cv992g30hc3dqcqx5dw1s6prvlbdnpc-system-units.drv: build-x86-01: build-x86-01: input not substitutable: error: some references of path '/nix/store/4bx00p …
setup:
1cv992g30hc3dqcqx5dw1s6prvlbdnpc-system-units.drv: build-x86-01: build-x86-01: input not substitutable: error: some references of path '/nix/store/4bx00pqm8w8pgdzrh5az3n76jvpw9ny9-unit-nix-daemon.service' could not be realised, asking the scheduler again
1cv992g30hc3dqcqx5dw1s6prvlbdnpc-system-units.drv: build-x86-01: build-x86-01: input not substitutable: error: some references of path '/nix/store/4bx00pqm8w8pgdzrh5az3n76jvpw9ny9-unit-nix-daemon.service' could not be realised, asking the scheduler again
1cv992g30hc3dqcqx5dw1s6prvlbdnpc-system-units.drv: build-x86-01: build-x86-01: input not substitutable: error: some references of path '/nix/store/4bx00pqm8w8pgdzrh5az3n76jvpw9ny9-unit-nix-daemon.service' could not be realised, asking the scheduler again
1cv992g30hc3dqcqx5dw1s6prvlbdnpc-system-units.drv: build-x86-01: build-x86-01: input not substitutable: error: some references of path '/nix/store/4bx00pqm8w8pgdzrh5az3n76jvpw9ny9-unit-nix-daemon.service' could not be realised, asking the scheduler again
1cv992g30hc3dqcqx5dw1s6prvlbdnpc-system-units.drv: build-x86-01: build-x86-01: input not substitutable: error: some references of path '/nix/store/4bx00pqm8w8pgdzrh5az3n76jvpw9ny9-unit-nix-daemon.service' could not be realised, asking the scheduler again
1cv992g30hc3dqcqx5dw1s6prvlbdnpc-system-units.drv: build-x86-01: build-x86-01: input not substitutable: error: some references of path '/nix/store/4bx00pqm8w8pgdzrh5az3n76jvpw9ny9-unit-nix-daemon.service' could not be realised, asking the scheduler again
1cv992g30hc3dqcqx5dw1s6prvlbdnpc-system-units.drv: build-x86-01: build-x86-01: input not substitutable: error: some references of path '/nix/store/4bx00pqm8w8pgdzrh5az3n76jvpw9ny9-unit-nix-daemon.service' could not be realised, asking the scheduler again
error: dependency 'a7s0jcmsd0yq1mm2lj392jjzg23smnfw-nixos-test-driver-wayland-proxy-virtwl.drv' failed
failed checks.x86_64-linux.template-minimal 2m 8s
setup: don't know how to build these paths: /nix/store/7ddj1258a6d0sahzmvggr3lxmj692xwg-nixos-system-testmachine-26.11.20260923.8825beb.drv warning: ignoring …
setup:
don't know how to build these paths:
  /nix/store/7ddj1258a6d0sahzmvggr3lxmj692xwg-nixos-system-testmachine-26.11.20260923.8825beb.drv
warning: ignoring the client-specified setting 'store', because it is a restricted setting and you are not a trusted user
error: gRPC QueryValidPaths on 'nix-store.geninf.io:50051' failed: error: substituter 'https://cache.clan.lol' is disabled
21 succeeded
succeeded attributes
status attribute duration
loading…
86 already built
skipped attributes
status attribute duration
loading…