nixbot

builds

clan/clan-core build #762 failed

branch 26.05 · PR #8137 · commit 50959bd8c6 · · took 38m 38s · eval 6m 18s

eval warnings 4 kinds · 9397 occurrences
  • error unable to download 'https://cache.clan.lol/…': HTTP error 503 ×935
  • error unable to download 'https://cache.geninf.io/…': HTTP error 503 ×28
  • warn unable to download 'https://cache.clan.lol/…': HTTP error 503 ×7997
  • warn unable to download 'https://cache.geninf.io/…': HTTP error 503 ×437

116 failed
failed attributes
status attribute duration
failed checks.aarch64-darwin.all-packages 1m 29s
setup: don't know how to build these paths: /nix/store/yrzshs6rki6g1chsl7qj68n0gl8nml8d-all-packages.drv warning: ignoring the client-specified setting 'store …
setup:
don't know how to build these paths:
  /nix/store/yrzshs6rki6g1chsl7qj68n0gl8nml8d-all-packages.drv
warning: ignoring the client-specified setting 'store', because it is a restricted setting and you are not a trusted user
error: gRPC QueryValidPaths on 'nix-store.geninf.io:50051' failed: error: unable to download 'https://cache.clan.lol/2xy1j86dmhfi7fg21hf0ya0jz63bdsnh.narinfo': HTTP error 503

              response body:

              <?xml version="1.0" encoding="UTF-8" standalone="yes"?>
              <Error>
                  <Code>SlowDown</Code>
                  <Message>Your account has made too many requests; try again later.</Message>
              </Error>
failed checks.aarch64-darwin.clan-app-pytest 3m 0s
setup: these 5 derivations will be built: /nix/store/mybg5hnvmldysm9sa5rxz3jcbwxvlcpb-python3-3.13.15-env.drv /nix/store/67f66m9dcbgbvsds0m1w6d2c1i58qbjk-cl …
setup:
these 5 derivations will be built:
  /nix/store/mybg5hnvmldysm9sa5rxz3jcbwxvlcpb-python3-3.13.15-env.drv
  /nix/store/67f66m9dcbgbvsds0m1w6d2c1i58qbjk-clan-app-pytest.drv
  /nix/store/7kjxlrdvaqxg0d9scm3lgfn0lr67y55v-clan-runtime.drv
  /nix/store/cshw45ivwpa6c5kz3h521rmy49wmy4wq-clan-cli-source.drv
  /nix/store/inkrfwaqiwqds150pmni6fnnyqdbqr8y-clan-cli.drv
warning: ignoring the client-specified setting 'store', because it is a restricted setting and you are not a trusted user
error: gRPC QueryValidPaths on 'nix-store.geninf.io:50051' failed: error: unable to download 'https://cache.geninf.io/5z2388p6p3pyhdv1jnwcp1lj1z9bvhz8.narinfo': HTTP error 503

              response body:

              <?xml version="1.0" encoding="UTF-8" standalone="yes"?>
              <Error>
                  <Code>SlowDown</Code>
                  <Message>Your account has made too many requests; try again later.</Message>
              </Error>
failed checks.aarch64-darwin.clan-pytest-with-core 3m 20s
setup: don't know how to build these paths: /nix/store/x17jn16jjvsbq8cg1ljbwv1jrna0p2p1-clan-pytest-with-core.drv warning: ignoring the client-specified setti …
setup:
don't know how to build these paths:
  /nix/store/x17jn16jjvsbq8cg1ljbwv1jrna0p2p1-clan-pytest-with-core.drv
warning: ignoring the client-specified setting 'store', because it is a restricted setting and you are not a trusted user
error: gRPC QueryValidPaths on 'nix-store.geninf.io:50051' failed: error: unable to download 'https://cache.clan.lol/3v2sjxfw9rmk9i5nwsdswl1yf79m2xf2.narinfo': HTTP error 503

              response body:

              <?xml version="1.0" encoding="UTF-8" standalone="yes"?>
              <Error>
                  <Code>SlowDown</Code>
                  <Message>Your account has made too many requests; try again later.</Message>
              </Error>
failed checks.aarch64-darwin.clan-pytest-without-core 3m 0s
setup: don't know how to build these paths: /nix/store/y3ih2xd5kqsp2c58hynmdkdjy0b08f92-clan-pytest-without-core.drv warning: ignoring the client-specified se …
setup:
don't know how to build these paths:
  /nix/store/y3ih2xd5kqsp2c58hynmdkdjy0b08f92-clan-pytest-without-core.drv
warning: ignoring the client-specified setting 'store', because it is a restricted setting and you are not a trusted user
error: gRPC QueryValidPaths on 'nix-store.geninf.io:50051' failed: error: unable to download 'https://cache.geninf.io/9gqqi4y67z2h2mk805lm1vmvk97cffc7.narinfo': HTTP error 503

              response body:

              <?xml version="1.0" encoding="UTF-8" standalone="yes"?>
              <Error>
                  <Code>SlowDown</Code>
                  <Message>Your account has made too many requests; try again later.</Message>
              </Error>
failed checks.aarch64-darwin.darwin-test-darwin-machine 4m 9s
setup: don't know how to build these paths: /nix/store/708jqkv9zk420idq8b8f9dwvfaccknrf-darwin-system-26.05.c3e90c8.drv warning: ignoring the client-specified …
setup:
don't know how to build these paths:
  /nix/store/708jqkv9zk420idq8b8f9dwvfaccknrf-darwin-system-26.05.c3e90c8.drv
warning: ignoring the client-specified setting 'store', because it is a restricted setting and you are not a trusted user
error: gRPC QueryValidPaths on 'nix-store.geninf.io:50051' failed: error: unable to download 'https://cache.clan.lol/qngxklb1k12gbgrjw0yvfrd60jdd3g5w.narinfo': HTTP error 503

              response body:

              <?xml version="1.0" encoding="UTF-8" standalone="yes"?>
              <Error>
                  <Code>SlowDown</Code>
                  <Message>Your account has made too many requests; try again later.</Message>
              </Error>
dependency failed checks.aarch64-darwin.devshell —
failed checks.aarch64-darwin.devShell-clan-app 1m 20s
setup: don't know how to build these paths: /nix/store/0szqn3dv2l0kd1j39rm34hzpa0w819qs-ui.drv warning: ignoring the client-specified setting 'store', because …
setup:
don't know how to build these paths:
  /nix/store/0szqn3dv2l0kd1j39rm34hzpa0w819qs-ui.drv
warning: ignoring the client-specified setting 'store', because it is a restricted setting and you are not a trusted user
error: gRPC QueryValidPaths on 'nix-store.geninf.io:50051' failed: error: unable to download 'https://cache.geninf.io/1si6yw9zrx8h3dnn7ansr0b7bkxvi2yg.narinfo': HTTP error 503

              response body:

              <?xml version="1.0" encoding="UTF-8" standalone="yes"?>
              <Error>
                  <Code>SlowDown</Code>
                  <Message>Your account has made too many requests; try again later.</Message>
              </Error>
failed checks.aarch64-darwin.devShell-clan-cli 2m 39s
setup: don't know how to build these paths: /nix/store/0hr28sqi8is4jn7xpg6ks4rsfy2dxy85-clan-cli.drv warning: ignoring the client-specified setting 'store', b …
setup:
don't know how to build these paths:
  /nix/store/0hr28sqi8is4jn7xpg6ks4rsfy2dxy85-clan-cli.drv
warning: ignoring the client-specified setting 'store', because it is a restricted setting and you are not a trusted user
error: gRPC QueryValidPaths on 'nix-store.geninf.io:50051' failed: error: substituter 'https://cache.clan.lol' is disabled
failed checks.aarch64-darwin.devShell-clan-site 5m 4s
setup: warning: ignoring the client-specified setting 'store', because it is a restricted setting and you are not a trusted user 7kjxlrdvaqxg0d9scm3lgfn0lr67y55 …
setup:
warning: ignoring the client-specified setting 'store', because it is a restricted setting and you are not a trusted user
7kjxlrdvaqxg0d9scm3lgfn0lr67y55v-clan-runtime.drv: error: gRPC QueryValidPaths on 'nix-store.geninf.io:50051' failed: error: substituter 'https://cache.clan.lol' is disabled
5lrg9i52f66v0c2mqcpv56i4vq3m1q4h-options.json.drv: build02: not scheduled here: 5lrg9i52f66v0c2mqcpv56i4vq3m1q4h-options.json.drv, asking the scheduler again
0d6j4f3lxajhy9a1h1dg11g7ldscwd17-options.json.drv: build02: not scheduled here: 0d6j4f3lxajhy9a1h1dg11g7ldscwd17-options.json.drv, asking the scheduler again
4aq354gqvzz0pc5r5sdynvnzhdapqqdf-options.json.drv: build02: not scheduled here: 4aq354gqvzz0pc5r5sdynvnzhdapqqdf-options.json.drv, asking the scheduler again
05v6i9j1rac35kqwh3wzbg6k5xzw9i50-options.json.drv: build02: not scheduled here: 05v6i9j1rac35kqwh3wzbg6k5xzw9i50-options.json.drv, asking the scheduler again
vd9mywskvbczfazj42mp653vmrmzls66-python3-3.13.15-env.drv: build02: not scheduled here: vd9mywskvbczfazj42mp653vmrmzls66-python3-3.13.15-env.drv, asking the scheduler again
error: dependency 'nhha5wv362vzmc637rawpxs7jik7l2n9-generated-docs.drv' failed
failed checks.aarch64-darwin.devShell-default 42s
setup: don't know how to build these paths: /nix/store/bwp5rbzj688vri5ql3hx7r02kz369czl-clan.drv warning: ignoring the client-specified setting 'store', becau …
setup:
don't know how to build these paths:
  /nix/store/bwp5rbzj688vri5ql3hx7r02kz369czl-clan.drv
warning: ignoring the client-specified setting 'store', because it is a restricted setting and you are not a trusted user
error: gRPC QueryValidPaths on 'nix-store.geninf.io:50051' failed: error: unable to download 'https://cache.clan.lol/6xw0bkljf8fvyvrcapc20krzpf79a8af.narinfo': HTTP error 503

              response body:

              <?xml version="1.0" encoding="UTF-8" standalone="yes"?>
              <Error>
                  <Code>SlowDown</Code>
                  <Message>Your account has made too many requests; try again later.</Message>
              </Error>
failed checks.aarch64-darwin.devShell-inventory-schema 5m 22s
setup: don't know how to build these paths: /nix/store/qxmg9lrk1nwcfkzmy9gygpmwiy1m5jr2-clan-inventory-schema.drv warning: ignoring the client-specified setti …
setup:
don't know how to build these paths:
  /nix/store/qxmg9lrk1nwcfkzmy9gygpmwiy1m5jr2-clan-inventory-schema.drv
warning: ignoring the client-specified setting 'store', because it is a restricted setting and you are not a trusted user
error: gRPC QueryValidPaths on 'nix-store.geninf.io:50051' failed: error: unable to download 'https://cache.clan.lol/pv1cvv8kndljp5j29x09pnbhnknr3zs5.narinfo': HTTP error 503

              response body:

              <?xml version="1.0" encoding="UTF-8" standalone="yes"?>
              <Error>
                  <Code>SlowDown</Code>
                  <Message>Your account has made too many requests; try again later.</Message>
              </Error>
failed checks.aarch64-darwin.eval-tests 6m 22s
setup: zp6fk4kpr088r252qzv21yz5s6mcm51n-evalCheck-eval-tests-types.drv: build02: not scheduled here: zp6fk4kpr088r252qzv21yz5s6mcm51n-evalCheck-eval-tests-types …
setup:
zp6fk4kpr088r252qzv21yz5s6mcm51n-evalCheck-eval-tests-types.drv: build02: not scheduled here: zp6fk4kpr088r252qzv21yz5s6mcm51n-evalCheck-eval-tests-types.drv, asking the scheduler again
4lhxpf2s3s58jz0fi7b6cliw870qpa0l-evalCheck-lib-jsonschema-unit-tests.drv: build02: not scheduled here: 4lhxpf2s3s58jz0fi7b6cliw870qpa0l-evalCheck-lib-jsonschema-unit-tests.drv, asking the scheduler again
7c66ds1k8m1wxx7cw8ms7401bsil2pm7-evalCheck-eval-tests-syncthing.drv: build02: not scheduled here: 7c66ds1k8m1wxx7cw8ms7401bsil2pm7-evalCheck-eval-tests-syncthing.drv, asking the scheduler again
ddlnm30lv22bd3mrv2vap7m7gmy5c7sy-evalCheck-eval-tests-installer.drv: build02: not scheduled here: ddlnm30lv22bd3mrv2vap7m7gmy5c7sy-evalCheck-eval-tests-installer.drv, asking the scheduler again
zr00hm5ah166c7lkb4nc9jw3dna3rmlg-evalCheck-eval-vars-backends.drv: build02: not scheduled here: zr00hm5ah166c7lkb4nc9jw3dna3rmlg-evalCheck-eval-vars-backends.drv, asking the scheduler again
a9hw99yn99010dby38fzql55v3fpzsq5-evalCheck-eval-lib-relativeDir.drv: build02: not scheduled here: a9hw99yn99010dby38fzql55v3fpzsq5-evalCheck-eval-lib-relativeDir.drv, asking the scheduler again
8d5hwf6hzal75rnjvh2bwbv6mglyc300-evalCheck-eval-lib-distributedServices.drv: build02: not scheduled here: 8d5hwf6hzal75rnjvh2bwbv6mglyc300-evalCheck-eval-lib-distributedServices.drv, asking the scheduler again
error: dependency 'bcli15bvydhy68b5c79qgdr686w4ycd9-evalCheck-eval-lib-values.drv' failed
failed checks.aarch64-darwin.nixos-flash-installer 3m 53s
setup: don't know how to build these paths: /nix/store/1jbzw8dksy6gfi5cj9fg698jw8v0gydl-nixos-system-flash-installer-26.05.20260922.1bc55b9.drv warning: ignor …
setup:
don't know how to build these paths:
  /nix/store/1jbzw8dksy6gfi5cj9fg698jw8v0gydl-nixos-system-flash-installer-26.05.20260922.1bc55b9.drv
warning: ignoring the client-specified setting 'store', because it is a restricted setting and you are not a trusted user
error: gRPC QueryValidPaths on 'nix-store.geninf.io:50051' failed: error: unable to download 'https://cache.clan.lol/d94yn96jq23x38zs9ckz9fvy6v3k4rxs.narinfo': HTTP error 503

              response body:

              <?xml version="1.0" encoding="UTF-8" standalone="yes"?>
              <Error>
                  <Code>SlowDown</Code>
                  <Message>Your account has made too many requests; try again later.</Message>
              </Error>
failed checks.aarch64-darwin.treefmt 3m 8s
setup: this derivation will be built: /nix/store/j49yfinpbaphmd2nylm7ms7hz786gr31-treefmt-check.drv warning: ignoring the client-specified setting 'store', be …
setup:
this derivation will be built:
  /nix/store/j49yfinpbaphmd2nylm7ms7hz786gr31-treefmt-check.drv
warning: ignoring the client-specified setting 'store', because it is a restricted setting and you are not a trusted user
error: gRPC QueryValidPaths on 'nix-store.geninf.io:50051' failed: error: unable to download 'https://cache.clan.lol/v9cx9kqzqz2ap00whw709yiq4z9qlgmb.narinfo': HTTP error 503

              response body:

              <?xml version="1.0" encoding="UTF-8" standalone="yes"?>
              <Error>
                  <Code>SlowDown</Code>
                  <Message>Your account has made too many requests; try again later.</Message>
              </Error>
failed checks.aarch64-linux.admin 9m 14s
setup: /nix/store/rc6q0jhrsa8nj3jjgj871hi044fryhgf-closure-info.drv /nix/store/whrky3yg9m5wxzhfggskkzb7kcijfx1k-nixos-test-driver-admin.drv /nix/store/7bb …
setup:
  /nix/store/rc6q0jhrsa8nj3jjgj871hi044fryhgf-closure-info.drv
  /nix/store/whrky3yg9m5wxzhfggskkzb7kcijfx1k-nixos-test-driver-admin.drv
  /nix/store/7bbiphppzlimf77yq33k9qrqgwsyhv26-container-test-run-admin.drv
these 2 paths will be fetched (541.4 KiB download, 1.6 MiB unpacked):
  /nix/store/imyiapvv47yi767887wpxmrzl17rmyg1-55-nixos-aslr-entropy.conf
  /nix/store/nj56jxdhvbjc8vv5l1c6wvajb6wr35ka-nsncd-1.5.3
warning: ignoring the client-specified setting 'store', because it is a restricted setting and you are not a trusted user
error: gRPC QueryValidPaths on 'nix-store.geninf.io:50051' failed: error: substituter 'https://cache.clan.lol' is disabled
failed checks.aarch64-linux.borgbackup 4m 20s
setup: don't know how to build these paths: /nix/store/j7j05f2ryncj86ismxpfvylvakl2p01j-container-test-run-borgbackup.drv warning: ignoring the client-specifi …
setup:
don't know how to build these paths:
  /nix/store/j7j05f2ryncj86ismxpfvylvakl2p01j-container-test-run-borgbackup.drv
warning: ignoring the client-specified setting 'store', because it is a restricted setting and you are not a trusted user
error: gRPC QueryValidPaths on 'nix-store.geninf.io:50051' failed: error: unable to download 'https://cache.clan.lol/ywsnzhi3c2rg12w5ydb4k35ka96psiwd.narinfo': HTTP error 503

              response body:

              <?xml version="1.0" encoding="UTF-8" standalone="yes"?>
              <Error>
                  <Code>SlowDown</Code>
                  <Message>Your account has made too many requests; try again later.</Message>
              </Error>
failed checks.aarch64-linux.certificates 4m 48s
setup: /nix/store/vwxwqpaqmr4mj8yzn5bl1gkkzr8xm4p6-closure-info.drv /nix/store/p5f465byxp2zzl8rz0bg29h6dq5hdmiy-nixos-test-driver-certificates.drv /nix/st …
setup:
  /nix/store/vwxwqpaqmr4mj8yzn5bl1gkkzr8xm4p6-closure-info.drv
  /nix/store/p5f465byxp2zzl8rz0bg29h6dq5hdmiy-nixos-test-driver-certificates.drv
  /nix/store/z1cldkj0sk2dnvhkg32g6608lw47hhbb-container-test-run-certificates.drv
these 2 paths will be fetched (541.4 KiB download, 1.6 MiB unpacked):
  /nix/store/imyiapvv47yi767887wpxmrzl17rmyg1-55-nixos-aslr-entropy.conf
  /nix/store/nj56jxdhvbjc8vv5l1c6wvajb6wr35ka-nsncd-1.5.3
warning: ignoring the client-specified setting 'store', because it is a restricted setting and you are not a trusted user
error: gRPC QueryValidPaths on 'nix-store.geninf.io:50051' failed: error: substituter 'https://cache.clan.lol' is disabled
failed checks.aarch64-linux.clan-app-pytest 3m 31s
setup: these 5 derivations will be built: /nix/store/6dj694z1hd7f5aaqbncfxlg3h61q5l2n-clan-runtime.drv /nix/store/ikflrddz4rd9kxb975b2ga9y4lli7yvi-python3-3 …
setup:
these 5 derivations will be built:
  /nix/store/6dj694z1hd7f5aaqbncfxlg3h61q5l2n-clan-runtime.drv
  /nix/store/ikflrddz4rd9kxb975b2ga9y4lli7yvi-python3-3.13.15-env.drv
  /nix/store/k9qnqkj604clnvnx9qw4v3plp76yg8kx-clan-app-pytest.drv
  /nix/store/m94fr2rdzvga3ik0blh3rwhx7a5739q5-clan-cli-source.drv
  /nix/store/n80qs5cnc6dh4irsjd7iskaz5rn698hy-clan-cli.drv
warning: ignoring the client-specified setting 'store', because it is a restricted setting and you are not a trusted user
error: gRPC QueryValidPaths on 'nix-store.geninf.io:50051' failed: error: unable to download 'https://cache.clan.lol/9kq3pwgl2w2a6i5h4c6xkfy4kn3bjggw.narinfo': HTTP error 503

              response body:

              <?xml version="1.0" encoding="UTF-8" standalone="yes"?>
              <Error>
                  <Code>SlowDown</Code>
                  <Message>Your account has made too many requests; try again later.</Message>
              </Error>
failed checks.aarch64-linux.clan-pytest-with-core 24s
setup: don't know how to build these paths: /nix/store/78wlq7qssba91p0wf4fq8ilvkpwhrmph-clan-pytest-with-core.drv warning: ignoring the client-specified setti …
setup:
don't know how to build these paths:
  /nix/store/78wlq7qssba91p0wf4fq8ilvkpwhrmph-clan-pytest-with-core.drv
warning: ignoring the client-specified setting 'store', because it is a restricted setting and you are not a trusted user
error: gRPC QueryValidPaths on 'nix-store.geninf.io:50051' failed: error: unable to download 'https://cache.clan.lol/5rbmvbj3nwjhzn4z8nfqkvk722ni0zsq.narinfo': HTTP error 503

              response body:

              <?xml version="1.0" encoding="UTF-8" standalone="yes"?>
              <Error>
                  <Code>SlowDown</Code>
                  <Message>Your account has made too many requests; try again later.</Message>
              </Error>
failed checks.aarch64-linux.clan-pytest-without-core 36s
setup: don't know how to build these paths: /nix/store/bdqjda57ifjypk6krxpnmfwv2wshbjia-clan-pytest-without-core.drv warning: ignoring the client-specified se …
setup:
don't know how to build these paths:
  /nix/store/bdqjda57ifjypk6krxpnmfwv2wshbjia-clan-pytest-without-core.drv
warning: ignoring the client-specified setting 'store', because it is a restricted setting and you are not a trusted user
error: gRPC QueryValidPaths on 'nix-store.geninf.io:50051' failed: error: unable to download 'https://cache.clan.lol/vxjirs3a127gf7gfkj89qp69prvjr768.narinfo': HTTP error 503

              response body:

              <?xml version="1.0" encoding="UTF-8" standalone="yes"?>
              <Error>
                  <Code>SlowDown</Code>
                  <Message>Your account has made too many requests; try again later.</Message>
              </Error>
failed checks.aarch64-linux.clan-test-iso 12m 45s
setup: don't know how to build these paths: /nix/store/mhfgn6r411spwq0lmj4s9nld0hijd9c7-container-test-run-clan-test-iso.drv warning: ignoring the client-spec …
setup:
don't know how to build these paths:
  /nix/store/mhfgn6r411spwq0lmj4s9nld0hijd9c7-container-test-run-clan-test-iso.drv
warning: ignoring the client-specified setting 'store', because it is a restricted setting and you are not a trusted user
error: gRPC QueryValidPaths on 'nix-store.geninf.io:50051' failed: error: unable to download 'https://cache.geninf.io/9krhmi6kxjdn021jg3fkl3c7hpayn51f.narinfo': HTTP error 503

              response body:

              <?xml version="1.0" encoding="UTF-8" standalone="yes"?>
              <Error>
                  <Code>SlowDown</Code>
                  <Message>Your account has made too many requests; try again later.</Message>
              </Error>
dependency failed checks.aarch64-linux.devshell —
failed checks.aarch64-linux.devShell-clan-app 2m 10s
setup: don't know how to build these paths: /nix/store/l4kh11xgb87qmxd7j8i9hzyaiq3s8bmm-ui.drv warning: ignoring the client-specified setting 'store', because …
setup:
don't know how to build these paths:
  /nix/store/l4kh11xgb87qmxd7j8i9hzyaiq3s8bmm-ui.drv
warning: ignoring the client-specified setting 'store', because it is a restricted setting and you are not a trusted user
error: gRPC QueryValidPaths on 'nix-store.geninf.io:50051' failed: error: unable to download 'https://cache.geninf.io/wbg3a421raa56lj398zn63in8zwn64jc.narinfo': HTTP error 503

              response body:

              <?xml version="1.0" encoding="UTF-8" standalone="yes"?>
              <Error>
                  <Code>SlowDown</Code>
                  <Message>Your account has made too many requests; try again later.</Message>
              </Error>
failed checks.aarch64-linux.devShell-clan-cli 1m 8s
setup: don't know how to build these paths: /nix/store/bdqx6k5c4v3bwx0mrlh0jxis1cqbsgyc-clan-cli.drv warning: ignoring the client-specified setting 'store', b …
setup:
don't know how to build these paths:
  /nix/store/bdqx6k5c4v3bwx0mrlh0jxis1cqbsgyc-clan-cli.drv
warning: ignoring the client-specified setting 'store', because it is a restricted setting and you are not a trusted user
error: gRPC QueryValidPaths on 'nix-store.geninf.io:50051' failed: error: substituter 'https://cache.clan.lol' is disabled
failed checks.aarch64-linux.devShell-default 11s
setup: don't know how to build these paths: /nix/store/dnshai2xlhr8zadk132l3ycxl0ig7vvq-clan.drv warning: ignoring the client-specified setting 'store', becau …
setup:
don't know how to build these paths:
  /nix/store/dnshai2xlhr8zadk132l3ycxl0ig7vvq-clan.drv
warning: ignoring the client-specified setting 'store', because it is a restricted setting and you are not a trusted user
error: gRPC QueryValidPaths on 'nix-store.geninf.io:50051' failed: error: unable to download 'https://cache.geninf.io/1qjxgrwjlizywmcm9r8vd2jivbzgdvk6.narinfo': HTTP error 503

              response body:

              <?xml version="1.0" encoding="UTF-8" standalone="yes"?>
              <Error>
                  <Code>SlowDown</Code>
                  <Message>Your account has made too many requests; try again later.</Message>
              </Error>
failed checks.aarch64-linux.devShell-inventory-schema 23s
setup: don't know how to build these paths: /nix/store/wbm8jcvmksdf1vninqz79ynvx0nbiaiw-clan-inventory-schema.drv warning: ignoring the client-specified setti …
setup:
don't know how to build these paths:
  /nix/store/wbm8jcvmksdf1vninqz79ynvx0nbiaiw-clan-inventory-schema.drv
warning: ignoring the client-specified setting 'store', because it is a restricted setting and you are not a trusted user
error: gRPC QueryValidPaths on 'nix-store.geninf.io:50051' failed: error: unable to download 'https://cache.geninf.io/1afwsk58f9mfxm1mw3v9dlvw36z54iic.narinfo': HTTP error 503

              response body:

              <?xml version="1.0" encoding="UTF-8" standalone="yes"?>
              <Error>
                  <Code>SlowDown</Code>
                  <Message>Your account has made too many requests; try again later.</Message>
              </Error>
failed checks.aarch64-linux.dm-dns 41s
setup: don't know how to build these paths: /nix/store/zjf8b12jj5ss4gal586fw5fjg4x55rcc-container-test-run-dm-dns.drv warning: ignoring the client-specified s …
setup:
don't know how to build these paths:
  /nix/store/zjf8b12jj5ss4gal586fw5fjg4x55rcc-container-test-run-dm-dns.drv
warning: ignoring the client-specified setting 'store', because it is a restricted setting and you are not a trusted user
error: gRPC QueryValidPaths on 'nix-store.geninf.io:50051' failed: error: unable to download 'https://cache.geninf.io/6v7njhg0nxy4lhs892fmg94rmygvdk0h.narinfo': HTTP error 503

              response body:

              <?xml version="1.0" encoding="UTF-8" standalone="yes"?>
              <Error>
                  <Code>SlowDown</Code>
                  <Message>Your account has made too many requests; try again later.</Message>
              </Error>
failed checks.aarch64-linux.dyndns 1m 11s
setup: don't know how to build these paths: /nix/store/99hi7r0xprh7ygz32w2jvybamc0jynk3-container-test-run-dyndns.drv warning: ignoring the client-specified s …
setup:
don't know how to build these paths:
  /nix/store/99hi7r0xprh7ygz32w2jvybamc0jynk3-container-test-run-dyndns.drv
warning: ignoring the client-specified setting 'store', because it is a restricted setting and you are not a trusted user
error: gRPC QueryValidPaths on 'nix-store.geninf.io:50051' failed: error: unable to download 'https://cache.geninf.io/kz7kvhi1avsgy6bp883zrcwrkzbgq6hj.narinfo': HTTP error 503

              response body:

              <?xml version="1.0" encoding="UTF-8" standalone="yes"?>
              <Error>
                  <Code>SlowDown</Code>
                  <Message>Your account has made too many requests; try again later.</Message>
              </Error>
failed checks.aarch64-linux.eval-tests 27s
setup: don't know how to build these paths: /nix/store/bl225w2v2jsd4ca7jgyhcyr7251jnm2p-eval-tests-aarch64-linux.drv warning: ignoring the client-specified se …
setup:
don't know how to build these paths:
  /nix/store/bl225w2v2jsd4ca7jgyhcyr7251jnm2p-eval-tests-aarch64-linux.drv
warning: ignoring the client-specified setting 'store', because it is a restricted setting and you are not a trusted user
error: gRPC QueryValidPaths on 'nix-store.geninf.io:50051' failed: error: unable to download 'https://cache.clan.lol/8dcjhny2lia37jd71k55qczj407wnhb8.narinfo': HTTP error 503

              response body:

              <?xml version="1.0" encoding="UTF-8" standalone="yes"?>
              <Error>
                  <Code>SlowDown</Code>
                  <Message>Your account has made too many requests; try again later.</Message>
              </Error>
failed checks.aarch64-linux.garage 7m 19s
setup: don't know how to build these paths: /nix/store/1wmsqjrjz0akw840lmfhrgnaz9fzw5y6-container-test-run-garage.drv warning: ignoring the client-specified s …
setup:
don't know how to build these paths:
  /nix/store/1wmsqjrjz0akw840lmfhrgnaz9fzw5y6-container-test-run-garage.drv
warning: ignoring the client-specified setting 'store', because it is a restricted setting and you are not a trusted user
error: gRPC QueryValidPaths on 'nix-store.geninf.io:50051' failed: error: substituter 'https://cache.clan.lol' is disabled
failed checks.aarch64-linux.hello-service 35s
setup: don't know how to build these paths: /nix/store/krxwp7qq5sds1nssm1jlav70nx5nsnla-container-test-run-hello-service.drv warning: ignoring the client-spec …
setup:
don't know how to build these paths:
  /nix/store/krxwp7qq5sds1nssm1jlav70nx5nsnla-container-test-run-hello-service.drv
warning: ignoring the client-specified setting 'store', because it is a restricted setting and you are not a trusted user
error: gRPC QueryValidPaths on 'nix-store.geninf.io:50051' failed: error: unable to download 'https://cache.clan.lol/3mmxa6c3cgza2waj519p8c7dp540yk3q.narinfo': HTTP error 503

              response body:

              <?xml version="1.0" encoding="UTF-8" standalone="yes"?>
              <Error>
                  <Code>SlowDown</Code>
                  <Message>Your account has made too many requests; try again later.</Message>
              </Error>
failed checks.aarch64-linux.localbackup 2m 5s
setup: klrsq5i9wykaq7b0bwd2cywalvq649pm-localbackup-list.drv: error: gRPC QueryValidPaths on 'nix-store.geninf.io:50051' failed: error: substituter 'https://cac …
setup:
klrsq5i9wykaq7b0bwd2cywalvq649pm-localbackup-list.drv: error: gRPC QueryValidPaths on 'nix-store.geninf.io:50051' failed: error: substituter 'https://cache.clan.lol' is disabled
b66knd6yi5mwrprdcnnaw11fjc9fi5zp-testScript.drv: error: gRPC QueryValidPaths on 'nix-store.geninf.io:50051' failed: error: substituter 'https://cache.clan.lol' is disabled
a9ndy3lkmjlvi3d2q15h6vdnyj9p6qv0-localbackup-restore.drv: error: gRPC QueryValidPaths on 'nix-store.geninf.io:50051' failed: error: substituter 'https://cache.clan.lol' is disabled
8my2xg5rx5if5xrxfya4y18izq5g5g82-localbackup-mount-hdd.drv: error: gRPC QueryValidPaths on 'nix-store.geninf.io:50051' failed: error: substituter 'https://cache.clan.lol' is disabled
rp9p48pk2hpvyxdcln782in64dgdwbby-extra-hosts.drv: error: gRPC QueryValidPaths on 'nix-store.geninf.io:50051' failed: error: substituter 'https://cache.clan.lol' is disabled
1hdi2piabbm4dngz4kn31f3q6kjrixf8-vars-check-localbackup.drv: error: gRPC QueryValidPaths on 'nix-store.geninf.io:50051' failed: error: substituter 'https://cache.clan.lol' is disabled
lxyq3cf873qmc91n2jg6jyzq7ingbh4d-command-not-found.drv: error: gRPC QueryValidPaths on 'nix-store.geninf.io:50051' failed: error: substituter 'https://cache.clan.lol' is disabled
error: dependency 'w2ri10rd25mw87j0r43hr4w8r01n3i60-nixos-test-driver-localbackup.drv' failed
failed checks.aarch64-linux.machine-id 2m 10s
setup: don't know how to build these paths: /nix/store/wcqjij32sdazxl946vjxl9bimjqmk6dd-container-test-run-service-machine-id.drv warning: ignoring the client …
setup:
don't know how to build these paths:
  /nix/store/wcqjij32sdazxl946vjxl9bimjqmk6dd-container-test-run-service-machine-id.drv
warning: ignoring the client-specified setting 'store', because it is a restricted setting and you are not a trusted user
error: gRPC QueryValidPaths on 'nix-store.geninf.io:50051' failed: error: unable to download 'https://cache.geninf.io/6pin25b3x84gg4gclj1qr6ld44pw1n4r.narinfo': HTTP error 503

              response body:

              <?xml version="1.0" encoding="UTF-8" standalone="yes"?>
              <Error>
                  <Code>SlowDown</Code>
                  <Message>Your account has made too many requests; try again later.</Message>
              </Error>
failed checks.aarch64-linux.monitoring 1m 40s
setup: don't know how to build these paths: /nix/store/6jhips7hc2lmmm5rwm7j1kw2hy3hhm45-container-test-run-monitoring.drv warning: ignoring the client-specifi …
setup:
don't know how to build these paths:
  /nix/store/6jhips7hc2lmmm5rwm7j1kw2hy3hhm45-container-test-run-monitoring.drv
warning: ignoring the client-specified setting 'store', because it is a restricted setting and you are not a trusted user
error: gRPC QueryValidPaths on 'nix-store.geninf.io:50051' failed: error: unable to download 'https://cache.clan.lol/fiwld3y4lilm9wk79p87a87xk4ma3riy.narinfo': HTTP error 503

              response body:

              <?xml version="1.0" encoding="UTF-8" standalone="yes"?>
              <Error>
                  <Code>SlowDown</Code>
                  <Message>Your account has made too many requests; try again later.</Message>
              </Error>
failed checks.aarch64-linux.ncps 1m 27s
setup: don't know how to build these paths: /nix/store/8izm1akqj8rrgqgcnlfgcz6bm96nf76k-container-test-run-ncps.drv warning: ignoring the client-specified set …
setup:
don't know how to build these paths:
  /nix/store/8izm1akqj8rrgqgcnlfgcz6bm96nf76k-container-test-run-ncps.drv
warning: ignoring the client-specified setting 'store', because it is a restricted setting and you are not a trusted user
error: gRPC QueryValidPaths on 'nix-store.geninf.io:50051' failed: error: unable to download 'https://cache.clan.lol/vqhbayr9jh7q6g81v91d4jimqdb78cnc.narinfo': HTTP error 503

              response body:

              <?xml version="1.0" encoding="UTF-8" standalone="yes"?>
              <Error>
                  <Code>SlowDown</Code>
                  <Message>Your account has made too many requests; try again later.</Message>
              </Error>
failed checks.aarch64-linux.nixos-documentation 54s
setup: don't know how to build these paths: /nix/store/xv1i4pd74q1vf43w0h99jknf0bkw2db0-nixos-system-test-documentation-26.05.20260922.1bc55b9.drv warning: ig …
setup:
don't know how to build these paths:
  /nix/store/xv1i4pd74q1vf43w0h99jknf0bkw2db0-nixos-system-test-documentation-26.05.20260922.1bc55b9.drv
warning: ignoring the client-specified setting 'store', because it is a restricted setting and you are not a trusted user
error: gRPC QueryValidPaths on 'nix-store.geninf.io:50051' failed: error: unable to download 'https://cache.clan.lol/ic7gm2phggqw486j5f6pfnayb44wjw5p.narinfo': HTTP error 503

              response body:

              <?xml version="1.0" encoding="UTF-8" standalone="yes"?>
              <Error>
                  <Code>SlowDown</Code>
                  <Message>Your account has made too many requests; try again later.</Message>
              </Error>
failed checks.aarch64-linux.nixos-flash-installer 19m 44s
setup: 5yq9i61nnjqykx52sbkvhha1p3gav3ai-initrd-bin-env.drv: gi-build-x86-02: not scheduled here: 5yq9i61nnjqykx52sbkvhha1p3gav3ai-initrd-bin-env.drv, asking the …
setup:
5yq9i61nnjqykx52sbkvhha1p3gav3ai-initrd-bin-env.drv: gi-build-x86-02: not scheduled here: 5yq9i61nnjqykx52sbkvhha1p3gav3ai-initrd-bin-env.drv, asking the scheduler again
6zj098yz1cgki9bdj1kq7cv1dpcvd2vh-system-shutdown.drv: gi-build-x86-02: not scheduled here: 6zj098yz1cgki9bdj1kq7cv1dpcvd2vh-system-shutdown.drv, asking the scheduler again
i14xvjx1fbrf8h3y10h4y3ismh5jaw34-system-generators.drv: gi-build-x86-02: not scheduled here: i14xvjx1fbrf8h3y10h4y3ismh5jaw34-system-generators.drv, asking the scheduler again
kqnny6wqkrr6fhrkw79q0qyvdnd1p33c-nix.conf.drv: gi-build-x86-02: not scheduled here: kqnny6wqkrr6fhrkw79q0qyvdnd1p33c-nix.conf.drv, asking the scheduler again
pbiblwk7wh43hn484xds28yc4sykh5qd-unit-systemd-fsck-.service.drv: gi-build-x86-02: not scheduled here: pbiblwk7wh43hn484xds28yc4sykh5qd-unit-systemd-fsck-.service.drv, asking the scheduler again
g1k6ac92903zfmz5jar7pzs6w7mnycc9-unit-zfs-snapshot-monthly.service.drv: gi-build-x86-02: not scheduled here: g1k6ac92903zfmz5jar7pzs6w7mnycc9-unit-zfs-snapshot-monthly.service.drv, asking the scheduler again
8067gpa2hjlvmj7xgshdy5khf0ciq6wk-X-Restart-Triggers-NetworkManager.drv: gi-build-x86-01: not scheduled here: 8067gpa2hjlvmj7xgshdy5khf0ciq6wk-X-Restart-Triggers-NetworkManager.drv, asking the scheduler again
error: dependency 'ffz3xq88znc2f0k3abs412zdh06ln40z-initrd-linux-7.2.7.drv' failed
failed checks.aarch64-linux.nixos-systemd-abstraction 1m 14s
setup: don't know how to build these paths: /nix/store/8k3x41zkzcnlriyh17pmcclf9g3f01rd-container-test-run-systemd-abstraction.drv warning: ignoring the clien …
setup:
don't know how to build these paths:
  /nix/store/8k3x41zkzcnlriyh17pmcclf9g3f01rd-container-test-run-systemd-abstraction.drv
warning: ignoring the client-specified setting 'store', because it is a restricted setting and you are not a trusted user
error: gRPC QueryValidPaths on 'nix-store.geninf.io:50051' failed: error: unable to download 'https://cache.clan.lol/5l71l9rbabjw79i1r69lfzgnksvn8kv7.narinfo': HTTP error 503

              response body:

              <?xml version="1.0" encoding="UTF-8" standalone="yes"?>
              <Error>
                  <Code>SlowDown</Code>
                  <Message>Your account has made too many requests; try again later.</Message>
              </Error>
failed checks.aarch64-linux.nixos-test-age-backend 2m 20s
setup: don't know how to build these paths: /nix/store/xdhg21zmilq206x7fva2a7i237lwznbz-vm-test-run-nixos-test-age-backend.drv warning: ignoring the client-sp …
setup:
don't know how to build these paths:
  /nix/store/xdhg21zmilq206x7fva2a7i237lwznbz-vm-test-run-nixos-test-age-backend.drv
warning: ignoring the client-specified setting 'store', because it is a restricted setting and you are not a trusted user
error: gRPC QueryValidPaths on 'nix-store.geninf.io:50051' failed: error: unable to download 'https://cache.clan.lol/30j6cghcnyn25ayhhcjdhianb848i6q2.narinfo': HTTP error 503

              response body:

              <?xml version="1.0" encoding="UTF-8" standalone="yes"?>
              <Error>
                  <Code>SlowDown</Code>
                  <Message>Your account has made too many requests; try again later.</Message>
              </Error>
failed checks.aarch64-linux.nixos-test-extra-python-packages 3m 47s
setup: don't know how to build these paths: /nix/store/1nymbqgsnva9n044xcscbhayln0dczcw-container-test-run-test-extra-python-packages.drv warning: ignoring th …
setup:
don't know how to build these paths:
  /nix/store/1nymbqgsnva9n044xcscbhayln0dczcw-container-test-run-test-extra-python-packages.drv
warning: ignoring the client-specified setting 'store', because it is a restricted setting and you are not a trusted user
error: gRPC QueryValidPaths on 'nix-store.geninf.io:50051' failed: error: unable to download 'https://cache.clan.lol/yzj6vdvkw69gcd9ilgig8bwvlp0wr8fp.narinfo': HTTP error 503

              response body:

              <?xml version="1.0" encoding="UTF-8" standalone="yes"?>
              <Error>
                  <Code>SlowDown</Code>
                  <Message>Your account has made too many requests; try again later.</Message>
              </Error>
failed checks.aarch64-linux.nixos-test-password-store-mounts 3m 18s
setup: don't know how to build these paths: /nix/store/0g27xldxw8gijczkc5dkvpis6j6cq38l-vm-test-run-nixos-test-password-store-mounts.drv warning: ignoring the …
setup:
don't know how to build these paths:
  /nix/store/0g27xldxw8gijczkc5dkvpis6j6cq38l-vm-test-run-nixos-test-password-store-mounts.drv
warning: ignoring the client-specified setting 'store', because it is a restricted setting and you are not a trusted user
error: gRPC QueryValidPaths on 'nix-store.geninf.io:50051' failed: error: substituter 'https://cache.clan.lol' is disabled
failed checks.aarch64-linux.nixos-test-secrets 9m 41s
setup: 5gg3avkwj4my96rxsdsar4mpicqs637z-sops-install-secrets-0.0.1.drv: build01: build01: input not substitutable: error: path '/nix/store/hn9wcixixbixw05zyvc9i …
setup:
5gg3avkwj4my96rxsdsar4mpicqs637z-sops-install-secrets-0.0.1.drv: build01: build01: input not substitutable: error: path '/nix/store/hn9wcixixbixw05zyvc9iaqr0lnq9bpv-sops-install-secrets-0.0.1-go-modules' is required, but there is no substituter that can build it, asking the scheduler again
5gg3avkwj4my96rxsdsar4mpicqs637z-sops-install-secrets-0.0.1.drv: build01: build01: input not substitutable: error: path '/nix/store/hn9wcixixbixw05zyvc9iaqr0lnq9bpv-sops-install-secrets-0.0.1-go-modules' is required, but there is no substituter that can build it, asking the scheduler again
5gg3avkwj4my96rxsdsar4mpicqs637z-sops-install-secrets-0.0.1.drv: build01: build01: input not substitutable: error: path '/nix/store/hn9wcixixbixw05zyvc9iaqr0lnq9bpv-sops-install-secrets-0.0.1-go-modules' is required, but there is no substituter that can build it, asking the scheduler again
5gg3avkwj4my96rxsdsar4mpicqs637z-sops-install-secrets-0.0.1.drv: build01: build01: input not substitutable: error: path '/nix/store/hn9wcixixbixw05zyvc9iaqr0lnq9bpv-sops-install-secrets-0.0.1-go-modules' is required, but there is no substituter that can build it, asking the scheduler again
5gg3avkwj4my96rxsdsar4mpicqs637z-sops-install-secrets-0.0.1.drv: build01: build01: input not substitutable: error: path '/nix/store/hn9wcixixbixw05zyvc9iaqr0lnq9bpv-sops-install-secrets-0.0.1-go-modules' is required, but there is no substituter that can build it, asking the scheduler again
zqxfypx37li1xjbwqiqdgnp9iz91v577-dbus-1.drv: error: gRPC QueryValidPaths on 'nix-store.geninf.io:50051' failed: error: unable to download 'https://cache.clan.lol/zqxfypx37li1xjbwqiqdgnp9iz91v577.narinfo': HTTP error 503

              response body:

              <?xml version="1.0" encoding="UTF-8" standalone="yes"?>
              <Error>
                  <Code>SlowDown</Code>
                  <Message>Your account has made too many requests; try again later.</Message>
              </Error>
gx0791pr6y45g7j9xz3s827qxlhyfsgl-boot.json.drv: error: gRPC QueryValidPaths on 'nix-store.geninf.io:50051' failed: error: substituter 'https://cache.clan.lol' is disabled
error: dependency 'zkj2ylfakfi3hp7g386yxgqadf2x1zz1-nixos-test-driver-secrets.drv' failed
failed checks.aarch64-linux.nixos-test-user-firewall-iptables 4m 7s
setup: don't know how to build these paths: /nix/store/fva80x23q4wmjsbz2cppavxwqgr3l5w2-container-test-run-user-firewall-iptables.drv warning: ignoring the cl …
setup:
don't know how to build these paths:
  /nix/store/fva80x23q4wmjsbz2cppavxwqgr3l5w2-container-test-run-user-firewall-iptables.drv
warning: ignoring the client-specified setting 'store', because it is a restricted setting and you are not a trusted user
error: gRPC QueryValidPaths on 'nix-store.geninf.io:50051' failed: error: substituter 'https://cache.clan.lol' is disabled
failed checks.aarch64-linux.nixos-test-user-firewall-nftables 2m 38s
setup: don't know how to build these paths: /nix/store/sj8par0qkyzi39lasr0wv7cxqfb53dnq-container-test-run-user-firewall-nftables.drv warning: ignoring the cl …
setup:
don't know how to build these paths:
  /nix/store/sj8par0qkyzi39lasr0wv7cxqfb53dnq-container-test-run-user-firewall-nftables.drv
warning: ignoring the client-specified setting 'store', because it is a restricted setting and you are not a trusted user
error: gRPC QueryValidPaths on 'nix-store.geninf.io:50051' failed: error: unable to download 'https://cache.clan.lol/gsqpngd0abmz8i0bsi3799r6fp977ny6.narinfo': HTTP error 503

              response body:

              <?xml version="1.0" encoding="UTF-8" standalone="yes"?>
              <Error>
                  <Code>SlowDown</Code>
                  <Message>Your account has made too many requests; try again later.</Message>
              </Error>
failed checks.aarch64-linux.nixos-test-wayland-proxy-virtwl 2m 29s
setup: don't know how to build these paths: /nix/store/7gfbwy051wg4njrjji7yiq2yywpni31h-vm-test-run-wayland-proxy-virtwl.drv warning: ignoring the client-spec …
setup:
don't know how to build these paths:
  /nix/store/7gfbwy051wg4njrjji7yiq2yywpni31h-vm-test-run-wayland-proxy-virtwl.drv
warning: ignoring the client-specified setting 'store', because it is a restricted setting and you are not a trusted user
error: gRPC QueryValidPaths on 'nix-store.geninf.io:50051' failed: error: unable to download 'https://cache.clan.lol/6g5smjvvsf6h05jmb3p3prxvn359r7zz.narinfo': HTTP error 503

              response body:

              <?xml version="1.0" encoding="UTF-8" standalone="yes"?>
              <Error>
                  <Code>SlowDown</Code>
                  <Message>Your account has made too many requests; try again later.</Message>
              </Error>
failed checks.aarch64-linux.p2p-ssh-iroh 1m 38s
setup: don't know how to build these paths: /nix/store/2x499r6k329l7bf7wn3s0k3g1n4c6hy7-container-test-run-clan-test-p2p-ssh-iroh.drv warning: ignoring the cl …
setup:
don't know how to build these paths:
  /nix/store/2x499r6k329l7bf7wn3s0k3g1n4c6hy7-container-test-run-clan-test-p2p-ssh-iroh.drv
warning: ignoring the client-specified setting 'store', because it is a restricted setting and you are not a trusted user
error: gRPC QueryValidPaths on 'nix-store.geninf.io:50051' failed: error: unable to download 'https://cache.clan.lol/pwbc722mkw8nnayk8lqmpvfad0y0bjy7.narinfo': HTTP error 503

              response body:

              <?xml version="1.0" encoding="UTF-8" standalone="yes"?>
              <Error>
                  <Code>SlowDown</Code>
                  <Message>Your account has made too many requests; try again later.</Message>
              </Error>
failed checks.aarch64-linux.packages 7m 42s
setup: don't know how to build these paths: /nix/store/7idvnkdm2mby1m506m24v1hrlm7cydlq-container-test-run-packages.drv warning: ignoring the client-specified …
setup:
don't know how to build these paths:
  /nix/store/7idvnkdm2mby1m506m24v1hrlm7cydlq-container-test-run-packages.drv
warning: ignoring the client-specified setting 'store', because it is a restricted setting and you are not a trusted user
error: gRPC QueryValidPaths on 'nix-store.geninf.io:50051' failed: error: substituter 'https://cache.geninf.io' is disabled
failed checks.aarch64-linux.pki 3m 28s
setup: don't know how to build these paths: /nix/store/26g4yrk4lr3ifancbigrjbnsan7mpf5a-vm-test-run-pki.drv warning: ignoring the client-specified setting 'st …
setup:
don't know how to build these paths:
  /nix/store/26g4yrk4lr3ifancbigrjbnsan7mpf5a-vm-test-run-pki.drv
warning: ignoring the client-specified setting 'store', because it is a restricted setting and you are not a trusted user
error: gRPC QueryValidPaths on 'nix-store.geninf.io:50051' failed: error: unable to download 'https://cache.clan.lol/hjmli56frdrjkls9v98na54pvw4mfns7.narinfo': HTTP error 503

              response body:

              <?xml version="1.0" encoding="UTF-8" standalone="yes"?>
              <Error>
                  <Code>SlowDown</Code>
                  <Message>Your account has made too many requests; try again later.</Message>
              </Error>
failed checks.aarch64-linux.sshd 1m 46s
setup: don't know how to build these paths: /nix/store/3bc4rcg2b3jpm9cxabcqkmj2zf0dagba-container-test-run-sshd.drv warning: ignoring the client-specified set …
setup:
don't know how to build these paths:
  /nix/store/3bc4rcg2b3jpm9cxabcqkmj2zf0dagba-container-test-run-sshd.drv
warning: ignoring the client-specified setting 'store', because it is a restricted setting and you are not a trusted user
error: gRPC QueryValidPaths on 'nix-store.geninf.io:50051' failed: error: substituter 'https://cache.clan.lol' is disabled
failed checks.aarch64-linux.sshd-no-ca 3m 14s
setup: don't know how to build these paths: /nix/store/ilcgzbf964g0rj3sbhrb6grscki9fnzf-container-test-run-sshd.drv warning: ignoring the client-specified set …
setup:
don't know how to build these paths:
  /nix/store/ilcgzbf964g0rj3sbhrb6grscki9fnzf-container-test-run-sshd.drv
warning: ignoring the client-specified setting 'store', because it is a restricted setting and you are not a trusted user
error: gRPC QueryValidPaths on 'nix-store.geninf.io:50051' failed: error: unable to download 'https://cache.clan.lol/5ncva6ahzvdjy0l9ysb8wn7kd9hrvjvs.narinfo': HTTP error 503

              response body:

              <?xml version="1.0" encoding="UTF-8" standalone="yes"?>
              <Error>
                  <Code>SlowDown</Code>
                  <Message>Your account has made too many requests; try again later.</Message>
              </Error>
failed checks.aarch64-linux.syncthing-service 10m 23s
setup: don't know how to build these paths: /nix/store/xfq2n7aav0mk2v0zsy23qd3147r4jmx5-container-test-run-syncthing-service.drv warning: ignoring the client- …
setup:
don't know how to build these paths:
  /nix/store/xfq2n7aav0mk2v0zsy23qd3147r4jmx5-container-test-run-syncthing-service.drv
warning: ignoring the client-specified setting 'store', because it is a restricted setting and you are not a trusted user
jxkx1vqvvkarza7lmvj2av6bfcnsj30w-dbus-1.drv: error: gRPC QueryValidPaths on 'nix-store.geninf.io:50051' failed: error: substituter 'https://cache.clan.lol' is disabled
error: dependency '2niyjplz0p7cjb1g9lmkirxrc2n0iyzj-nixos-test-driver-syncthing-service.drv' failed
failed checks.aarch64-linux.treefmt 3m 56s
setup: don't know how to build these paths: /nix/store/7ad141zjisn63jv2xxzpcda1hx315zsk-treefmt-check.drv warning: ignoring the client-specified setting 'stor …
setup:
don't know how to build these paths:
  /nix/store/7ad141zjisn63jv2xxzpcda1hx315zsk-treefmt-check.drv
warning: ignoring the client-specified setting 'store', because it is a restricted setting and you are not a trusted user
error: gRPC QueryValidPaths on 'nix-store.geninf.io:50051' failed: error: unable to download 'https://cache.geninf.io/85afv8b83gxn78vw5ynkj1i8cn1lfwxw.narinfo': HTTP error 503

              response body:

              <?xml version="1.0" encoding="UTF-8" standalone="yes"?>
              <Error>
                  <Code>SlowDown</Code>
                  <Message>Your account has made too many requests; try again later.</Message>
              </Error>
failed checks.aarch64-linux.users 1m 46s
setup: don't know how to build these paths: /nix/store/rwihy1mym85dwi64bcyqvwan31ixg3fi-container-test-run-users.drv warning: ignoring the client-specified se …
setup:
don't know how to build these paths:
  /nix/store/rwihy1mym85dwi64bcyqvwan31ixg3fi-container-test-run-users.drv
warning: ignoring the client-specified setting 'store', because it is a restricted setting and you are not a trusted user
error: gRPC QueryValidPaths on 'nix-store.geninf.io:50051' failed: error: substituter 'https://cache.clan.lol' is disabled
failed checks.aarch64-linux.yggdrasil 3m 52s
setup: don't know how to build these paths: /nix/store/a06kfslqikkyzrnvcxkcq5x4pbpl1raa-vm-test-run-yggdrasil.drv warning: ignoring the client-specified setti …
setup:
don't know how to build these paths:
  /nix/store/a06kfslqikkyzrnvcxkcq5x4pbpl1raa-vm-test-run-yggdrasil.drv
warning: ignoring the client-specified setting 'store', because it is a restricted setting and you are not a trusted user
error: gRPC QueryValidPaths on 'nix-store.geninf.io:50051' failed: error: unable to download 'https://cache.geninf.io/v4jdzj3nhkvp9ba46bk606xlrndh60wm.narinfo': HTTP error 503

              response body:

              <?xml version="1.0" encoding="UTF-8" standalone="yes"?>
              <Error>
                  <Code>SlowDown</Code>
                  <Message>Your account has made too many requests; try again later.</Message>
              </Error>
failed checks.aarch64-linux.zerotier 2m 28s
setup: don't know how to build these paths: /nix/store/g21145s0b2iarkcahhv2k26n7gbqqy2n-vm-test-run-zerotier.drv warning: ignoring the client-specified settin …
setup:
don't know how to build these paths:
  /nix/store/g21145s0b2iarkcahhv2k26n7gbqqy2n-vm-test-run-zerotier.drv
warning: ignoring the client-specified setting 'store', because it is a restricted setting and you are not a trusted user
error: gRPC QueryValidPaths on 'nix-store.geninf.io:50051' failed: error: unable to download 'https://cache.clan.lol/3c976xqflf7kxvnnwl112wm0k76dvg70.narinfo': HTTP error 503

              response body:

              <?xml version="1.0" encoding="UTF-8" standalone="yes"?>
              <Error>
                  <Code>SlowDown</Code>
                  <Message>Your account has made too many requests; try again later.</Message>
              </Error>
failed checks.aarch64-linux.zerotier-multi-instance 2m 14s
setup: don't know how to build these paths: /nix/store/bw2rb0d1g2g8d536j1im6fw2mkcypm9l-vm-test-run-zerotier-multi-instance.drv warning: ignoring the client-s …
setup:
don't know how to build these paths:
  /nix/store/bw2rb0d1g2g8d536j1im6fw2mkcypm9l-vm-test-run-zerotier-multi-instance.drv
warning: ignoring the client-specified setting 'store', because it is a restricted setting and you are not a trusted user
error: gRPC QueryValidPaths on 'nix-store.geninf.io:50051' failed: error: unable to download 'https://cache.clan.lol/avxkn59ljklmgfkdx02j4r08c91hmnf5.narinfo': HTTP error 503

              response body:

              <?xml version="1.0" encoding="UTF-8" standalone="yes"?>
              <Error>
                  <Code>SlowDown</Code>
                  <Message>Your account has made too many requests; try again later.</Message>
              </Error>
failed checks.x86_64-linux.admin 52s
setup: don't know how to build these paths: /nix/store/lmyw6vwvi5j4d0ms46w4zjgvzjrx8wga-container-test-run-admin.drv warning: ignoring the client-specified se …
setup:
don't know how to build these paths:
  /nix/store/lmyw6vwvi5j4d0ms46w4zjgvzjrx8wga-container-test-run-admin.drv
warning: ignoring the client-specified setting 'store', because it is a restricted setting and you are not a trusted user
error: gRPC QueryValidPaths on 'nix-store.geninf.io:50051' failed: error: unable to download 'https://cache.clan.lol/687hqnb8lx06g9z5a5qb8ml1pkh02jj1.narinfo': HTTP error 503

              response body:

              <?xml version="1.0" encoding="UTF-8" standalone="yes"?>
              <Error>
                  <Code>SlowDown</Code>
                  <Message>Your account has made too many requests; try again later.</Message>
              </Error>
failed checks.x86_64-linux.all-packages 21m 46s
setup: /nix/store/nvdbrczc1plpdbmfr1vj5pz9vyq134bc-clan-cli-source.drv warning: ignoring the client-specified setting 'store', because it is a restricted sett …
setup:
  /nix/store/nvdbrczc1plpdbmfr1vj5pz9vyq134bc-clan-cli-source.drv
warning: ignoring the client-specified setting 'store', because it is a restricted setting and you are not a trusted user
ccd3b1bbh6z37p2cig3mj8bvfq4f95sh-clan-core-flake.drv: build-x86-01: not scheduled here: ccd3b1bbh6z37p2cig3mj8bvfq4f95sh-clan-core-flake.drv, asking the scheduler again
nb64slrp872jsg22244cwssam498b5lj-source.drv: gi-build-x86-02: not scheduled here: nb64slrp872jsg22244cwssam498b5lj-source.drv, asking the scheduler again
1x96zc72i24hq0g2ixhq3f5m94g5c5fm-clan-cli.drv: error: gRPC QueryValidPaths on 'nix-store.geninf.io:50051' failed: error: substituter 'https://cache.clan.lol' is disabled
chn9nxcb4qi6i9349k657xcfp6pb47kj-clan-runtime.drv: gi-build-x86-02: not scheduled here: chn9nxcb4qi6i9349k657xcfp6pb47kj-clan-runtime.drv, asking the scheduler again
ig77q34kilg1g7s66f1y244r0hb87pvj-python3-3.13.15-env.drv: gi-build-x86-01: not scheduled here: ig77q34kilg1g7s66f1y244r0hb87pvj-python3-3.13.15-env.drv, asking the scheduler again
error: dependency '1x96zc72i24hq0g2ixhq3f5m94g5c5fm-clan-cli.drv' failed
failed checks.x86_64-linux.borgbackup 1m 45s
setup: don't know how to build these paths: /nix/store/lyv132dp1v670ysgv4qnip5ris5wbb1w-container-test-run-borgbackup.drv warning: ignoring the client-specifi …
setup:
don't know how to build these paths:
  /nix/store/lyv132dp1v670ysgv4qnip5ris5wbb1w-container-test-run-borgbackup.drv
warning: ignoring the client-specified setting 'store', because it is a restricted setting and you are not a trusted user
error: gRPC QueryValidPaths on 'nix-store.geninf.io:50051' failed: error: substituter 'https://cache.clan.lol' is disabled
failed checks.x86_64-linux.certificates 1m 40s
setup: don't know how to build these paths: /nix/store/x6w4pcxy7v0mxagw907ipyvmvhfwfl4m-container-test-run-certificates.drv warning: ignoring the client-speci …
setup:
don't know how to build these paths:
  /nix/store/x6w4pcxy7v0mxagw907ipyvmvhfwfl4m-container-test-run-certificates.drv
warning: ignoring the client-specified setting 'store', because it is a restricted setting and you are not a trusted user
error: gRPC QueryValidPaths on 'nix-store.geninf.io:50051' failed: error: unable to download 'https://cache.clan.lol/9082lp5h0qdp5114s49k28snvncyjaxq.narinfo': HTTP error 503

              response body:

              <?xml version="1.0" encoding="UTF-8" standalone="yes"?>
              <Error>
                  <Code>SlowDown</Code>
                  <Message>Your account has made too many requests; try again later.</Message>
              </Error>
failed checks.x86_64-linux.clan-app-pytest 31s
setup: don't know how to build these paths: /nix/store/i4y48javazp664cw1l1fd1rh6866s3fx-clan-app-pytest.drv warning: ignoring the client-specified setting 'st …
setup:
don't know how to build these paths:
  /nix/store/i4y48javazp664cw1l1fd1rh6866s3fx-clan-app-pytest.drv
warning: ignoring the client-specified setting 'store', because it is a restricted setting and you are not a trusted user
error: gRPC QueryValidPaths on 'nix-store.geninf.io:50051' failed: error: unable to download 'https://cache.clan.lol/06fps5kbcfaqavrbcm6w5msd42kngaq3.narinfo': HTTP error 503

              response body:

              <?xml version="1.0" encoding="UTF-8" standalone="yes"?>
              <Error>
                  <Code>SlowDown</Code>
                  <Message>Your account has made too many requests; try again later.</Message>
              </Error>
failed checks.x86_64-linux.clan-pytest-with-core 4m 54s
setup: don't know how to build these paths: /nix/store/q67rp0wrnfkivwvs28f1j3z6dczwgg2q-clan-pytest-with-core.drv warning: ignoring the client-specified setti …
setup:
don't know how to build these paths:
  /nix/store/q67rp0wrnfkivwvs28f1j3z6dczwgg2q-clan-pytest-with-core.drv
warning: ignoring the client-specified setting 'store', because it is a restricted setting and you are not a trusted user
error: gRPC QueryValidPaths on 'nix-store.geninf.io:50051' failed: error: unable to download 'https://cache.clan.lol/w8311c5h51sxgzs6v2yvx84ybwphynak.narinfo': HTTP error 503

              response body:

              <?xml version="1.0" encoding="UTF-8" standalone="yes"?>
              <Error>
                  <Code>SlowDown</Code>
                  <Message>Your account has made too many requests; try again later.</Message>
              </Error>
failed checks.x86_64-linux.clan-pytest-without-core 12m 50s
setup: /nix/store/787sk3mfqgl0qfnmc8f0aicqzpmjbjr7-python3-3.13.15-env.drv /nix/store/chn9nxcb4qi6i9349k657xcfp6pb47kj-clan-runtime.drv /nix/store/vwwqzah …
setup:
  /nix/store/787sk3mfqgl0qfnmc8f0aicqzpmjbjr7-python3-3.13.15-env.drv
  /nix/store/chn9nxcb4qi6i9349k657xcfp6pb47kj-clan-runtime.drv
  /nix/store/vwwqzahdbc12xj6dsdawpkdi9hl1a7zf-clan-cli-source.drv
  /nix/store/x4iq038gcyriqyzzz4y3qq0psj5mjy4c-closure-info.drv
  /nix/store/x5j898pxlzhhzfr0qvc99pznsgz0jfmi-closure-info.drv
  /nix/store/zcl2lmqq4qdjygzbz4sws3lpvjsnljrg-clan-pytest-without-core.drv
warning: ignoring the client-specified setting 'store', because it is a restricted setting and you are not a trusted user
error: gRPC QueryValidPaths on 'nix-store.geninf.io:50051' failed: error: substituter 'https://cache.clan.lol' is disabled
failed checks.x86_64-linux.clan-site-lint 19m 51s
setup: don't know how to build these paths: /nix/store/ika32hwadaiix7igjxfx97r185xkcqkz-clan-site-lint.drv warning: ignoring the client-specified setting 'sto …
setup:
don't know how to build these paths:
  /nix/store/ika32hwadaiix7igjxfx97r185xkcqkz-clan-site-lint.drv
warning: ignoring the client-specified setting 'store', because it is a restricted setting and you are not a trusted user
error: gRPC QueryValidPaths on 'nix-store.geninf.io:50051' failed: error: substituter 'https://cache.clan.lol' is disabled
failed checks.x86_64-linux.clan-test-iso 2m 52s
setup: don't know how to build these paths: /nix/store/wa6929iij5py5yf4nymkxc90w7xny3as-container-test-run-clan-test-iso.drv warning: ignoring the client-spec …
setup:
don't know how to build these paths:
  /nix/store/wa6929iij5py5yf4nymkxc90w7xny3as-container-test-run-clan-test-iso.drv
warning: ignoring the client-specified setting 'store', because it is a restricted setting and you are not a trusted user
error: gRPC QueryValidPaths on 'nix-store.geninf.io:50051' failed: error: unable to download 'https://cache.clan.lol/cc57mj04cgz6vlahchy9mwl617284ypi.narinfo': HTTP error 503

              response body:

              <?xml version="1.0" encoding="UTF-8" standalone="yes"?>
              <Error>
                  <Code>SlowDown</Code>
                  <Message>Your account has made too many requests; try again later.</Message>
              </Error>
failed checks.x86_64-linux.clan-test-update 2m 25s
setup: don't know how to build these paths: /nix/store/rmxlagrjh4zg6fqmsdas0dq1n3ci5xp9-container-test-run-clan-test-update.drv warning: ignoring the client-s …
setup:
don't know how to build these paths:
  /nix/store/rmxlagrjh4zg6fqmsdas0dq1n3ci5xp9-container-test-run-clan-test-update.drv
warning: ignoring the client-specified setting 'store', because it is a restricted setting and you are not a trusted user
error: gRPC QueryValidPaths on 'nix-store.geninf.io:50051' failed: error: substituter 'https://cache.clan.lol' is disabled
failed checks.x86_64-linux.darwin-test-darwin-machine 2m 22s
setup: don't know how to build these paths: /nix/store/708jqkv9zk420idq8b8f9dwvfaccknrf-darwin-system-26.05.c3e90c8.drv warning: ignoring the client-specified …
setup:
don't know how to build these paths:
  /nix/store/708jqkv9zk420idq8b8f9dwvfaccknrf-darwin-system-26.05.c3e90c8.drv
warning: ignoring the client-specified setting 'store', because it is a restricted setting and you are not a trusted user
error: gRPC QueryValidPaths on 'nix-store.geninf.io:50051' failed: error: unable to download 'https://cache.clan.lol/m1vddvsasrd7q984m8230x0xiy6wg4cg.narinfo': HTTP error 503

              response body:

              <?xml version="1.0" encoding="UTF-8" standalone="yes"?>
              <Error>
                  <Code>SlowDown</Code>
                  <Message>Your account has made too many requests; try again later.</Message>
              </Error>
failed checks.x86_64-linux.data-mesher 1m 13s
setup: don't know how to build these paths: /nix/store/fcwk827mq9bcpfvv6v5vsjba82l9s404-container-test-run-data-mesher.drv warning: ignoring the client-specif …
setup:
don't know how to build these paths:
  /nix/store/fcwk827mq9bcpfvv6v5vsjba82l9s404-container-test-run-data-mesher.drv
warning: ignoring the client-specified setting 'store', because it is a restricted setting and you are not a trusted user
error: gRPC QueryValidPaths on 'nix-store.geninf.io:50051' failed: error: unable to download 'https://cache.clan.lol/7z8xwwa53rfaqlzflzkf218m1z9i8c8z.narinfo': HTTP error 503

              response body:

              <?xml version="1.0" encoding="UTF-8" standalone="yes"?>
              <Error>
                  <Code>SlowDown</Code>
                  <Message>Your account has made too many requests; try again later.</Message>
              </Error>
dependency failed checks.x86_64-linux.devshell —
failed checks.x86_64-linux.devShell-clan-app 1m 28s
setup: these 5 derivations will be built: /nix/store/chn9nxcb4qi6i9349k657xcfp6pb47kj-clan-runtime.drv /nix/store/nvdbrczc1plpdbmfr1vj5pz9vyq134bc-clan-cli- …
setup:
these 5 derivations will be built:
  /nix/store/chn9nxcb4qi6i9349k657xcfp6pb47kj-clan-runtime.drv
  /nix/store/nvdbrczc1plpdbmfr1vj5pz9vyq134bc-clan-cli-source.drv
  /nix/store/hf4mdsgaf912qjvqbhzkia5bw4spy7fx-clan-cli.drv
  /nix/store/ig77q34kilg1g7s66f1y244r0hb87pvj-python3-3.13.15-env.drv
  /nix/store/j1z7wx1jf0ycks1rmnw5zzkr5vbr3ixr-ui.drv
warning: ignoring the client-specified setting 'store', because it is a restricted setting and you are not a trusted user
error: gRPC QueryValidPaths on 'nix-store.geninf.io:50051' failed: error: unable to download 'https://cache.clan.lol/744yf43bf3irhcr7yhazc1linsipr0a1.narinfo': HTTP error 503

              response body:

              <?xml version="1.0" encoding="UTF-8" standalone="yes"?>
              <Error>
                  <Code>SlowDown</Code>
                  <Message>Your account has made too many requests; try again later.</Message>
              </Error>
failed checks.x86_64-linux.devShell-clan-cli 3m 38s
setup: don't know how to build these paths: /nix/store/wbpm0qxfzh0kyjk7g6b17wijjpn0q93q-clan-cli.drv warning: ignoring the client-specified setting 'store', b …
setup:
don't know how to build these paths:
  /nix/store/wbpm0qxfzh0kyjk7g6b17wijjpn0q93q-clan-cli.drv
warning: ignoring the client-specified setting 'store', because it is a restricted setting and you are not a trusted user
error: gRPC QueryValidPaths on 'nix-store.geninf.io:50051' failed: error: unable to download 'https://cache.clan.lol/7n4rinw2ix7m3sw9g1c7cwbla2gcqyz1.narinfo': HTTP error 503

              response body:

              <?xml version="1.0" encoding="UTF-8" standalone="yes"?>
              <Error>
                  <Code>SlowDown</Code>
                  <Message>Your account has made too many requests; try again later.</Message>
              </Error>
failed checks.x86_64-linux.devShell-clan-site 15m 16s
setup: /nix/store/v3fq69hw2b9b5vj10sq9zmli4j2zlh17-generated-docs.drv /nix/store/6ai31l4ycbwisp7298qp6hqf9l6grfmr-nix-shell.drv /nix/store/chn9nxcb4qi6i93 …
setup:
  /nix/store/v3fq69hw2b9b5vj10sq9zmli4j2zlh17-generated-docs.drv
  /nix/store/6ai31l4ycbwisp7298qp6hqf9l6grfmr-nix-shell.drv
  /nix/store/chn9nxcb4qi6i9349k657xcfp6pb47kj-clan-runtime.drv
  /nix/store/hf4mdsgaf912qjvqbhzkia5bw4spy7fx-clan-cli.drv
  /nix/store/m95flp0r7wijcdxyd68jpbvkbnsbxwp1-render-options.drv
  /nix/store/nvdbrczc1plpdbmfr1vj5pz9vyq134bc-clan-cli-source.drv
warning: ignoring the client-specified setting 'store', because it is a restricted setting and you are not a trusted user
error: gRPC QueryValidPaths on 'nix-store.geninf.io:50051' failed: error: unable to download 'https://cache.clan.lol/hmkdvjhmr57c0q4886gj047l1ci8fncb.narinfo': HTTP error 503

              response body:

              <?xml version="1.0" encoding="UTF-8" standalone="yes"?>
              <Error>
                  <Code>SlowDown</Code>
                  <Message>Your account has made too many requests; try again later.</Message>
              </Error>
failed checks.x86_64-linux.devShell-default 11m 6s
setup: don't know how to build these paths: /nix/store/jg8jnsasahmq8n8zx3n0alg2ly6fans7-clan.drv warning: ignoring the client-specified setting 'store', becau …
setup:
don't know how to build these paths:
  /nix/store/jg8jnsasahmq8n8zx3n0alg2ly6fans7-clan.drv
warning: ignoring the client-specified setting 'store', because it is a restricted setting and you are not a trusted user
error: gRPC QueryValidPaths on 'nix-store.geninf.io:50051' failed: error: substituter 'https://cache.geninf.io' is disabled
failed checks.x86_64-linux.devShell-docs 1m 53s
setup: don't know how to build these paths: /nix/store/4r3nwzx9sbjqfm7c95zz070cqjq2ay9x-nix-shell.drv warning: ignoring the client-specified setting 'store', …
setup:
don't know how to build these paths:
  /nix/store/4r3nwzx9sbjqfm7c95zz070cqjq2ay9x-nix-shell.drv
warning: ignoring the client-specified setting 'store', because it is a restricted setting and you are not a trusted user
error: gRPC QueryValidPaths on 'nix-store.geninf.io:50051' failed: error: unable to download 'https://cache.geninf.io/cll7x512bf4v8wlr3b6z7c6p3kjiz8bx.narinfo': HTTP error 503

              response body:

              <?xml version="1.0" encoding="UTF-8" standalone="yes"?>
              <Error>
                  <Code>SlowDown</Code>
                  <Message>Your account has made too many requests; try again later.</Message>
              </Error>
failed checks.x86_64-linux.devShell-inventory-schema 1m 1s
setup: these 2 derivations will be built: /nix/store/chn9nxcb4qi6i9349k657xcfp6pb47kj-clan-runtime.drv /nix/store/8fkgk9l7qiyncm6pzcqa9l9jfl2k3mhx-clan-inve …
setup:
these 2 derivations will be built:
  /nix/store/chn9nxcb4qi6i9349k657xcfp6pb47kj-clan-runtime.drv
  /nix/store/8fkgk9l7qiyncm6pzcqa9l9jfl2k3mhx-clan-inventory-schema.drv
warning: ignoring the client-specified setting 'store', because it is a restricted setting and you are not a trusted user
error: gRPC QueryValidPaths on 'nix-store.geninf.io:50051' failed: error: unable to download 'https://cache.clan.lol/2wvd42ia6ava8y7j6a680q1qzgvw2vq5.narinfo': HTTP error 503

              response body:

              <?xml version="1.0" encoding="UTF-8" standalone="yes"?>
              <Error>
                  <Code>SlowDown</Code>
                  <Message>Your account has made too many requests; try again later.</Message>
              </Error>
failed checks.x86_64-linux.dm-dns 4m 17s
setup: /nix/store/pkp4ly631gnsawn5vbclyylkd1jh7wbh-closure-info.drv /nix/store/zgm1hnr5qypw58xsp0cg77pijdkxsdg1-nixos-test-driver-dm-dns.drv /nix/store/sa …
setup:
  /nix/store/pkp4ly631gnsawn5vbclyylkd1jh7wbh-closure-info.drv
  /nix/store/zgm1hnr5qypw58xsp0cg77pijdkxsdg1-nixos-test-driver-dm-dns.drv
  /nix/store/samaijmk0ddqyib0vcp8499bmf41n5cd-container-test-run-dm-dns.drv
these 2 paths will be fetched (540.7 KiB download, 1.5 MiB unpacked):
  /nix/store/gy140r43h1wjj2aw5pkyyncfsg3iw17d-55-nixos-aslr-entropy.conf
  /nix/store/w7jlvv66p03qbkklg4ha0gzdsnxpmral-nsncd-1.5.3
warning: ignoring the client-specified setting 'store', because it is a restricted setting and you are not a trusted user
error: gRPC QueryValidPaths on 'nix-store.geninf.io:50051' failed: error: substituter 'https://cache.clan.lol' is disabled
failed checks.x86_64-linux.dyndns 5m 1s
setup: don't know how to build these paths: /nix/store/ay53pwaaqw4hb4mk29a0f0x8bnnml0wy-container-test-run-dyndns.drv warning: ignoring the client-specified s …
setup:
don't know how to build these paths:
  /nix/store/ay53pwaaqw4hb4mk29a0f0x8bnnml0wy-container-test-run-dyndns.drv
warning: ignoring the client-specified setting 'store', because it is a restricted setting and you are not a trusted user
error: gRPC QueryValidPaths on 'nix-store.geninf.io:50051' failed: error: unable to download 'https://cache.geninf.io/2chzq6xk9wnssbbpyi9h6vhmpmdlnikk.narinfo': HTTP error 503

              response body:

              <?xml version="1.0" encoding="UTF-8" standalone="yes"?>
              <Error>
                  <Code>SlowDown</Code>
                  <Message>Your account has made too many requests; try again later.</Message>
              </Error>
failed checks.x86_64-linux.eval-tests 7m 33s
setup: /nix/store/nirdywddpjpyfs5w15ipyq6hm0a8nqfx-evalCheck-eval-lib-values.drv /nix/store/p57z2py1zi5k47f7av5wvapmn3w4y5pa-evalCheck-eval-lib-build-clan.d …
setup:
  /nix/store/nirdywddpjpyfs5w15ipyq6hm0a8nqfx-evalCheck-eval-lib-values.drv
  /nix/store/p57z2py1zi5k47f7av5wvapmn3w4y5pa-evalCheck-eval-lib-build-clan.drv
  /nix/store/q0jrq9s8gn0y8z22g13q7knadx0c0lwv-evalCheck-eval-lib-exports.drv
  /nix/store/xnsxdp4lmyn7yn7fx3g7gaqp5qmvxmfj-evalCheck-eval-lib-relativeDir.drv
  /nix/store/zmh9m62j7is9g1wz30gbnsb70fy6vhj6-evalCheck-eval-tests-installer.drv
  /nix/store/8fp1ay7yhz8w15s09qgp0vw4vk2mh5zk-eval-tests-x86_64-linux.drv
warning: ignoring the client-specified setting 'store', because it is a restricted setting and you are not a trusted user
error: gRPC QueryValidPaths on 'nix-store.geninf.io:50051' failed: error: substituter 'https://cache.clan.lol' is disabled
failed checks.x86_64-linux.garage 1m 26s
setup: don't know how to build these paths: /nix/store/zxnsv1lncplyh9b67z71zlza86qbdna5-container-test-run-garage.drv warning: ignoring the client-specified s …
setup:
don't know how to build these paths:
  /nix/store/zxnsv1lncplyh9b67z71zlza86qbdna5-container-test-run-garage.drv
warning: ignoring the client-specified setting 'store', because it is a restricted setting and you are not a trusted user
error: gRPC QueryValidPaths on 'nix-store.geninf.io:50051' failed: error: unable to download 'https://cache.clan.lol/3zsnvifw688sdnhrmsgyk74d26z8lwa8.narinfo': HTTP error 503

              response body:

              <?xml version="1.0" encoding="UTF-8" standalone="yes"?>
              <Error>
                  <Code>SlowDown</Code>
                  <Message>Your account has made too many requests; try again later.</Message>
              </Error>
failed checks.x86_64-linux.hello-service 2m 11s
setup: don't know how to build these paths: /nix/store/7l8h8xd3jym12zsrn26qn5zmhvsjjk7d-container-test-run-hello-service.drv warning: ignoring the client-spec …
setup:
don't know how to build these paths:
  /nix/store/7l8h8xd3jym12zsrn26qn5zmhvsjjk7d-container-test-run-hello-service.drv
warning: ignoring the client-specified setting 'store', because it is a restricted setting and you are not a trusted user
error: gRPC QueryValidPaths on 'nix-store.geninf.io:50051' failed: error: unable to download 'https://cache.clan.lol/wxl168m4l6gk1injw3980w67m6cbdw7g.narinfo': HTTP error 503

              response body:

              <?xml version="1.0" encoding="UTF-8" standalone="yes"?>
              <Error>
                  <Code>SlowDown</Code>
                  <Message>Your account has made too many requests; try again later.</Message>
              </Error>
failed checks.x86_64-linux.kde 43s
setup: don't know how to build these paths: /nix/store/ff2bn00jzhk574sbzc1c4y4ff8hv9n7q-container-test-run-kde.drv warning: ignoring the client-specified sett …
setup:
don't know how to build these paths:
  /nix/store/ff2bn00jzhk574sbzc1c4y4ff8hv9n7q-container-test-run-kde.drv
warning: ignoring the client-specified setting 'store', because it is a restricted setting and you are not a trusted user
error: gRPC QueryValidPaths on 'nix-store.geninf.io:50051' failed: error: unable to download 'https://cache.clan.lol/4q7vwzsal4vay49s6gr158xl2lw1xwqw.narinfo': HTTP error 503

              response body:

              <?xml version="1.0" encoding="UTF-8" standalone="yes"?>
              <Error>
                  <Code>SlowDown</Code>
                  <Message>Your account has made too many requests; try again later.</Message>
              </Error>
failed checks.x86_64-linux.localbackup 1m 52s
setup: don't know how to build these paths: /nix/store/rmm06jq0wradhkmq293vp516qcy7512l-container-test-run-localbackup.drv warning: ignoring the client-specif …
setup:
don't know how to build these paths:
  /nix/store/rmm06jq0wradhkmq293vp516qcy7512l-container-test-run-localbackup.drv
warning: ignoring the client-specified setting 'store', because it is a restricted setting and you are not a trusted user
error: gRPC QueryValidPaths on 'nix-store.geninf.io:50051' failed: error: unable to download 'https://cache.clan.lol/kgzsch7nn24bmwzj93kbdhqxacf41d1r.narinfo': HTTP error 503

              response body:

              <?xml version="1.0" encoding="UTF-8" standalone="yes"?>
              <Error>
                  <Code>SlowDown</Code>
                  <Message>Your account has made too many requests; try again later.</Message>
              </Error>
failed checks.x86_64-linux.matrix-synapse 14m 33s
setup: /nix/store/fvyq7l7123dv6nvnpimkmsrwaljb50jm-python3.13-unpaddedbase64-2.1.0 /nix/store/6d25a6jabdkhy7j7yf56xssp2lcn787q-python3.13-urllib3-2.7.0 /n …
setup:
  /nix/store/fvyq7l7123dv6nvnpimkmsrwaljb50jm-python3.13-unpaddedbase64-2.1.0
  /nix/store/6d25a6jabdkhy7j7yf56xssp2lcn787q-python3.13-urllib3-2.7.0
  /nix/store/lp7q65b49hdx3m493y2i7p1myzrpr77q-python3.13-webencodings-0.5.1
  /nix/store/q88ggz0qj2xdqdp7awm6xi167gd6zi9h-python3.13-zope-interface-8.2
  /nix/store/mmhllck4iq32j31fjnhkf71rqwjb2lcc-remarshal-0.17.1
  /nix/store/bh88znx4jydpfmpbcxg6iplmapiai4cj-synapse-log-synapse.yaml
warning: ignoring the client-specified setting 'store', because it is a restricted setting and you are not a trusted user
error: gRPC QueryValidPaths on 'nix-store.geninf.io:50051' failed: error: substituter 'https://cache.clan.lol' is disabled
failed checks.x86_64-linux.monitoring 18m 10s
setup: 18rw66bx68p5kgc109vziwa5jgxxxsjb-python3.13-nixos-test-lib-1.0.0.drv: gi-build-x86-02: not scheduled here: 18rw66bx68p5kgc109vziwa5jgxxxsjb-python3.13-ni …
setup:
18rw66bx68p5kgc109vziwa5jgxxxsjb-python3.13-nixos-test-lib-1.0.0.drv: gi-build-x86-02: not scheduled here: 18rw66bx68p5kgc109vziwa5jgxxxsjb-python3.13-nixos-test-lib-1.0.0.drv, asking the scheduler again
c49wi1ldwak38fvbmvi5kagc79jbghzg-system-path.drv: error: gRPC QueryValidPaths on 'nix-store.geninf.io:50051' failed: error: unable to download 'https://cache.clan.lol/rlkqgq75y3mmymlmjx41yn7phngwcmkv.narinfo': HTTP error 503

              response body:

              <?xml version="1.0" encoding="UTF-8" standalone="yes"?>
              <Error>
                  <Code>SlowDown</Code>
                  <Message>Your account has made too many requests; try again later.</Message>
              </Error>
f1p1mm4x4sgzkxygbnixwamyvcsjg62l-mount-secret-fs.drv: gi-build-x86-02: not scheduled here: f1p1mm4x4sgzkxygbnixwamyvcsjg62l-mount-secret-fs.drv, asking the scheduler again
3174wfv6ljl9rdf2sd1qh6zc5j0m5fwc-datasource.yaml.drv: gi-build-x86-02: not scheduled here: 3174wfv6ljl9rdf2sd1qh6zc5j0m5fwc-datasource.yaml.drv, asking the scheduler again
yyjjjgbqf11z51l64jh65d8w1w737sgz-system-path.drv: gi-build-x86-02: not scheduled here: yyjjjgbqf11z51l64jh65d8w1w737sgz-system-path.drv, asking the scheduler again
6qnf625r0cpnlycpw9phcign6mvy72d8-unit-dbus-broker.service.drv: gi-build-x86-02: not scheduled here: 6qnf625r0cpnlycpw9phcign6mvy72d8-unit-dbus-broker.service.drv, asking the scheduler again
d7g1qwmq50djybb2s3mff0db0r990l5f-unit-dbus-broker.service.drv: gi-build-x86-02: not scheduled here: d7g1qwmq50djybb2s3mff0db0r990l5f-unit-dbus-broker.service.drv, asking the scheduler again
error: dependency '7ky5rg9jp7pwn24m7mqp7cnh3f0r3hqn-nixos-test-driver-monitoring.drv' failed
failed checks.x86_64-linux.mycelium 19m 23s
setup: /nix/store/g9sa0jgh9nb9l6xj1d7b58j86c91x98z-linux-6.18.53-modules-shrunk /nix/store/w7jlvv66p03qbkklg4ha0gzdsnxpmral-nsncd-1.5.3 warning: ignoring th …
setup:
  /nix/store/g9sa0jgh9nb9l6xj1d7b58j86c91x98z-linux-6.18.53-modules-shrunk
  /nix/store/w7jlvv66p03qbkklg4ha0gzdsnxpmral-nsncd-1.5.3
warning: ignoring the client-specified setting 'store', because it is a restricted setting and you are not a trusted user
qvkl804xql3p68mvgws7yl3wr200s9hq-dry-activate.drv: error: gRPC QueryValidPaths on 'nix-store.geninf.io:50051' failed: error: substituter 'https://cache.clan.lol' is disabled
15zy12vq1q76mvrd39xbkzssxdc6lakh-system-path.drv: gi-build-x86-02: not scheduled here: 15zy12vq1q76mvrd39xbkzssxdc6lakh-system-path.drv, asking the scheduler again
dlihbyna5x4f5flr4axv6asx0d0mfal8-initrd-linux-6.18.53.drv: gi-build-x86-02: not scheduled here: dlihbyna5x4f5flr4axv6asx0d0mfal8-initrd-linux-6.18.53.drv, asking the scheduler again
pg5n27ladi6mvbhn6ix9fi28016zl2f0-firewall-reload.drv: gi-build-x86-02: not scheduled here: pg5n27ladi6mvbhn6ix9fi28016zl2f0-firewall-reload.drv, asking the scheduler again
error: dependency 'qwqy1m7lypjmdzp2zqb0krhcw1mfpr98-nixos-test-driver-mycelium.drv' failed
failed checks.x86_64-linux.ncps 1m 3s
setup: don't know how to build these paths: /nix/store/1saa9xhsw1yl36xkiaw16klnkcqmh92q-container-test-run-ncps.drv warning: ignoring the client-specified set …
setup:
don't know how to build these paths:
  /nix/store/1saa9xhsw1yl36xkiaw16klnkcqmh92q-container-test-run-ncps.drv
warning: ignoring the client-specified setting 'store', because it is a restricted setting and you are not a trusted user
error: gRPC QueryValidPaths on 'nix-store.geninf.io:50051' failed: error: unable to download 'https://cache.clan.lol/jc96yd98ir5ing0mj8k6k58g7w9bnqv0.narinfo': HTTP error 503

              response body:

              <?xml version="1.0" encoding="UTF-8" standalone="yes"?>
              <Error>
                  <Code>SlowDown</Code>
                  <Message>Your account has made too many requests; try again later.</Message>
              </Error>
failed checks.x86_64-linux.nixos-documentation 1m 14s
setup: these 5 paths will be fetched (152.5 MiB download, 168.9 MiB unpacked): /nix/store/gy140r43h1wjj2aw5pkyyncfsg3iw17d-55-nixos-aslr-entropy.conf /nix/s …
setup:
these 5 paths will be fetched (152.5 MiB download, 168.9 MiB unpacked):
  /nix/store/gy140r43h1wjj2aw5pkyyncfsg3iw17d-55-nixos-aslr-entropy.conf
  /nix/store/yb2l9ixaj5m3klhq2zq0h13jgrgv206h-linux-6.18.53
  /nix/store/8b5sir42willllzw162k7yqypqi53hyy-linux-6.18.53-modules
  /nix/store/cl7dcv59bzaykr8h51jpi8srhd83pmdi-linux-6.18.53-modules-shrunk
  /nix/store/w7jlvv66p03qbkklg4ha0gzdsnxpmral-nsncd-1.5.3
warning: ignoring the client-specified setting 'store', because it is a restricted setting and you are not a trusted user
error: gRPC QueryValidPaths on 'nix-store.geninf.io:50051' failed: error: unable to download 'https://cache.clan.lol/aan8f41qpjrblfnk06gwfa9i9yc1pbjx.narinfo': HTTP error 503

              response body:

              <?xml version="1.0" encoding="UTF-8" standalone="yes"?>
              <Error>
                  <Code>SlowDown</Code>
                  <Message>Your account has made too many requests; try again later.</Message>
              </Error>
failed checks.x86_64-linux.nixos-flash-installer 10m 20s
setup: don't know how to build these paths: /nix/store/1jbzw8dksy6gfi5cj9fg698jw8v0gydl-nixos-system-flash-installer-26.05.20260922.1bc55b9.drv warning: ignor …
setup:
don't know how to build these paths:
  /nix/store/1jbzw8dksy6gfi5cj9fg698jw8v0gydl-nixos-system-flash-installer-26.05.20260922.1bc55b9.drv
warning: ignoring the client-specified setting 'store', because it is a restricted setting and you are not a trusted user
error: gRPC QueryValidPaths on 'nix-store.geninf.io:50051' failed: error: unable to download 'https://cache.geninf.io/2zs2kqahv3krm8sf4ka82m72h0kpqsfr.narinfo': HTTP error 503

              response body:

              <?xml version="1.0" encoding="UTF-8" standalone="yes"?>
              <Error>
                  <Code>SlowDown</Code>
                  <Message>Your account has made too many requests; try again later.</Message>
              </Error>
failed checks.x86_64-linux.nixos-systemd-abstraction 1m 46s
setup: don't know how to build these paths: /nix/store/cqca5jvkivfwlrmjprslrdky885c72n3-container-test-run-systemd-abstraction.drv warning: ignoring the clien …
setup:
don't know how to build these paths:
  /nix/store/cqca5jvkivfwlrmjprslrdky885c72n3-container-test-run-systemd-abstraction.drv
warning: ignoring the client-specified setting 'store', because it is a restricted setting and you are not a trusted user
error: gRPC QueryValidPaths on 'nix-store.geninf.io:50051' failed: error: substituter 'https://cache.clan.lol' is disabled
failed checks.x86_64-linux.nixos-test-age-backend 17m 34s
setup: don't know how to build these paths: /nix/store/gyivi7n6hvzddcm39mifkndhmy4phwwk-vm-test-run-nixos-test-age-backend.drv warning: ignoring the client-sp …
setup:
don't know how to build these paths:
  /nix/store/gyivi7n6hvzddcm39mifkndhmy4phwwk-vm-test-run-nixos-test-age-backend.drv
warning: ignoring the client-specified setting 'store', because it is a restricted setting and you are not a trusted user
wj06p5v65hahvpibfmdvkld0q0aca9d5-command-not-found.drv: gi-build-x86-02: not scheduled here: wj06p5v65hahvpibfmdvkld0q0aca9d5-command-not-found.drv, asking the scheduler again
8cpnsc14mhxl82hx4baxd73s6x5y7scx-system-path.drv: gi-build-x86-02: not scheduled here: 8cpnsc14mhxl82hx4baxd73s6x5y7scx-system-path.drv, asking the scheduler again
wbl9w4ddcpi4icw2razf4x3d2fb05h80-activate.drv: error: gRPC AddMultipleToStore on 'nix-store.geninf.io:50051' failed: error: path '/nix/store/d3jn0bl0d1hf9ka9b5g6wmc24hxfry2r-activation-secret.age' is required, but there is no substituter that can build it
error: dependency 'cicpdqxyqmgbd3igd9xyk2pfrjh9j9kf-nixos-test-driver-nixos-test-age-backend.drv' failed
failed checks.x86_64-linux.nixos-test-container 3m 7s
setup: don't know how to build these paths: /nix/store/hjapcwpar0j7sfkrnwjfgycjbjjbbxv2-container-test-run-container.drv warning: ignoring the client-specifie …
setup:
don't know how to build these paths:
  /nix/store/hjapcwpar0j7sfkrnwjfgycjbjjbbxv2-container-test-run-container.drv
warning: ignoring the client-specified setting 'store', because it is a restricted setting and you are not a trusted user
error: gRPC QueryValidPaths on 'nix-store.geninf.io:50051' failed: error: unable to download 'https://cache.clan.lol/vk626ps6ffx513dznymvpn7na4w1qi5w.narinfo': HTTP error 503

              response body:

              <?xml version="1.0" encoding="UTF-8" standalone="yes"?>
              <Error>
                  <Code>SlowDown</Code>
                  <Message>Your account has made too many requests; try again later.</Message>
              </Error>
failed checks.x86_64-linux.nixos-test-extra-python-packages 4m 4s
setup: don't know how to build these paths: /nix/store/rqdz2m4h2wabqdgjr3d98s7v9haywl2g-container-test-run-test-extra-python-packages.drv warning: ignoring th …
setup:
don't know how to build these paths:
  /nix/store/rqdz2m4h2wabqdgjr3d98s7v9haywl2g-container-test-run-test-extra-python-packages.drv
warning: ignoring the client-specified setting 'store', because it is a restricted setting and you are not a trusted user
error: gRPC QueryValidPaths on 'nix-store.geninf.io:50051' failed: error: unable to download 'https://cache.clan.lol/1n2la0lpny995qmkfvdj74gsfwi1950k.narinfo': HTTP error 503

              response body:

              <?xml version="1.0" encoding="UTF-8" standalone="yes"?>
              <Error>
                  <Code>SlowDown</Code>
                  <Message>Your account has made too many requests; try again later.</Message>
              </Error>
failed checks.x86_64-linux.nixos-test-flash 5m 38s
setup: don't know how to build these paths: /nix/store/p2kgmp70b5wflx9kqggwjzi9yf575wyk-vm-test-run-flash.drv warning: ignoring the client-specified setting ' …
setup:
don't know how to build these paths:
  /nix/store/p2kgmp70b5wflx9kqggwjzi9yf575wyk-vm-test-run-flash.drv
warning: ignoring the client-specified setting 'store', because it is a restricted setting and you are not a trusted user
error: gRPC QueryValidPaths on 'nix-store.geninf.io:50051' failed: error: substituter 'https://cache.clan.lol' is disabled
failed checks.x86_64-linux.nixos-test-flash-installer-boot 2m 28s
setup: don't know how to build these paths: /nix/store/j0k45jsy5cpbzlrsy6vr6gpdhz67fkr1-vm-test-run-flash-installer-boot.drv warning: ignoring the client-spec …
setup:
don't know how to build these paths:
  /nix/store/j0k45jsy5cpbzlrsy6vr6gpdhz67fkr1-vm-test-run-flash-installer-boot.drv
warning: ignoring the client-specified setting 'store', because it is a restricted setting and you are not a trusted user
error: gRPC QueryValidPaths on 'nix-store.geninf.io:50051' failed: error: unable to download 'https://cache.geninf.io/2rzilm5kksq0ysmng9hdrgnc25i3avdr.narinfo': HTTP error 503

              response body:

              <?xml version="1.0" encoding="UTF-8" standalone="yes"?>
              <Error>
                  <Code>SlowDown</Code>
                  <Message>Your account has made too many requests; try again later.</Message>
              </Error>
failed checks.x86_64-linux.nixos-test-installation 5m 32s
setup: don't know how to build these paths: /nix/store/q0yw1warx94l5jk39fh0ahwd6v3qvhb8-vm-test-run-installation.drv warning: ignoring the client-specified se …
setup:
don't know how to build these paths:
  /nix/store/q0yw1warx94l5jk39fh0ahwd6v3qvhb8-vm-test-run-installation.drv
warning: ignoring the client-specified setting 'store', because it is a restricted setting and you are not a trusted user
error: gRPC QueryValidPaths on 'nix-store.geninf.io:50051' failed: error: substituter 'https://cache.geninf.io' is disabled
failed checks.x86_64-linux.nixos-test-installation-age 4m 0s
setup: don't know how to build these paths: /nix/store/vyr3cgxcv2iqz4xw38369hin7cpb1klf-vm-test-run-installation.drv warning: ignoring the client-specified se …
setup:
don't know how to build these paths:
  /nix/store/vyr3cgxcv2iqz4xw38369hin7cpb1klf-vm-test-run-installation.drv
warning: ignoring the client-specified setting 'store', because it is a restricted setting and you are not a trusted user
error: gRPC QueryValidPaths on 'nix-store.geninf.io:50051' failed: error: unable to download 'https://cache.clan.lol/6d2qiz3ylsya70wdg0ygll7rpc9fyz30.narinfo': HTTP error 503

              response body:

              <?xml version="1.0" encoding="UTF-8" standalone="yes"?>
              <Error>
                  <Code>SlowDown</Code>
                  <Message>Your account has made too many requests; try again later.</Message>
              </Error>
failed checks.x86_64-linux.nixos-test-secrets 2m 35s
setup: don't know how to build these paths: /nix/store/r068sn1vv3dhxkp82g2g7pr6xajr6wh3-vm-test-run-secrets.drv warning: ignoring the client-specified setting …
setup:
don't know how to build these paths:
  /nix/store/r068sn1vv3dhxkp82g2g7pr6xajr6wh3-vm-test-run-secrets.drv
warning: ignoring the client-specified setting 'store', because it is a restricted setting and you are not a trusted user
error: gRPC QueryValidPaths on 'nix-store.geninf.io:50051' failed: error: unable to download 'https://cache.clan.lol/9jdzzvvisly9ylpv4hzhm4l3kjvv1773.narinfo': HTTP error 503

              response body:

              <?xml version="1.0" encoding="UTF-8" standalone="yes"?>
              <Error>
                  <Code>SlowDown</Code>
                  <Message>Your account has made too many requests; try again later.</Message>
              </Error>
failed checks.x86_64-linux.nixos-test-update-hardware-configuration 25m 31s
setup: gxdqay35spkl0y8sj7v5jyb4ywk9mz00-dbus-1.drv: error: gRPC QueryValidPaths on 'nix-store.geninf.io:50051' failed: error: substituter 'https://cache.clan.lo …
setup:
gxdqay35spkl0y8sj7v5jyb4ywk9mz00-dbus-1.drv: error: gRPC QueryValidPaths on 'nix-store.geninf.io:50051' failed: error: substituter 'https://cache.clan.lol' is disabled
8zgrjk8xn16akf6zm4yhiraxbvd1zx6c-system-path.drv: gi-build-x86-02: not scheduled here: 8zgrjk8xn16akf6zm4yhiraxbvd1zx6c-system-path.drv, asking the scheduler again
1x96zc72i24hq0g2ixhq3f5m94g5c5fm-clan-cli.drv: error: gRPC QueryValidPaths on 'nix-store.geninf.io:50051' failed: error: substituter 'https://cache.clan.lol' is disabled
rfm4n51kyciyspbhwlkndgxy6y6r66bd-boot.json.drv: gi-build-x86-02: not scheduled here: rfm4n51kyciyspbhwlkndgxy6y6r66bd-boot.json.drv, asking the scheduler again
jjf42zb09f6zhhvqg8jkanx0iwjxx39w-X-Restart-Triggers-nix-daemon.drv: gi-build-x86-02: not scheduled here: jjf42zb09f6zhhvqg8jkanx0iwjxx39w-X-Restart-Triggers-nix-daemon.drv, asking the scheduler again
ab56h407xa3xbzpxfkfq89p29lx2vz73-unit-systemd-modules-load.service.drv: gi-build-x86-02: not scheduled here: ab56h407xa3xbzpxfkfq89p29lx2vz73-unit-systemd-modules-load.service.drv, asking the scheduler again
vx3ns63ikksc7r2q7w43si9nyv7q8qzw-etc.drv: gi-build-x86-02: not scheduled here: vx3ns63ikksc7r2q7w43si9nyv7q8qzw-etc.drv, asking the scheduler again
error: dependency 'xpbmgp19ya67sx4zzdjc3fnlr7282zx0-nixos-test-driver-update-hardware-configuration.drv' failed
failed checks.x86_64-linux.nixos-test-user-firewall-nftables 5m 39s
setup: don't know how to build these paths: /nix/store/wssx8l8n7gb58d29x7ykaviqsw2mw1da-container-test-run-user-firewall-nftables.drv warning: ignoring the cl …
setup:
don't know how to build these paths:
  /nix/store/wssx8l8n7gb58d29x7ykaviqsw2mw1da-container-test-run-user-firewall-nftables.drv
warning: ignoring the client-specified setting 'store', because it is a restricted setting and you are not a trusted user
error: gRPC QueryValidPaths on 'nix-store.geninf.io:50051' failed: error: substituter 'https://cache.clan.lol' is disabled
failed checks.x86_64-linux.nixos-test-wayland-proxy-virtwl 13m 43s
setup: /nix/store/w7jlvv66p03qbkklg4ha0gzdsnxpmral-nsncd-1.5.3 /nix/store/sascv1zk11nfcil4rwcfrpl9z4n2an6r-ocaml5.4.1-wayland-proxy-virtwl-0-unstable-2026-0 …
setup:
  /nix/store/w7jlvv66p03qbkklg4ha0gzdsnxpmral-nsncd-1.5.3
  /nix/store/sascv1zk11nfcil4rwcfrpl9z4n2an6r-ocaml5.4.1-wayland-proxy-virtwl-0-unstable-2026-04-16
  /nix/store/nbx16xqar4k00m1yhv7vjdz2sb91m64x-qemu-host-cpu-only-10.2.4
  /nix/store/kf573fh2za8hxmgwmkgi6zk46sklxack-qemu-host-cpu-only-10.2.4-ga
  /nix/store/ffq5p7fm68xz4bpvdha8q3ml1q7gm1lz-xkbcomp-1.5.0
  /nix/store/vf2zbvmym90lbs1p0r5pq8igb47lqjz0-xwayland-24.1.13
warning: ignoring the client-specified setting 'store', because it is a restricted setting and you are not a trusted user
error: gRPC QueryValidPaths on 'nix-store.geninf.io:50051' failed: error: substituter 'https://cache.clan.lol' is disabled
failed checks.x86_64-linux.p2p-ssh-iroh 4m 31s
setup: don't know how to build these paths: /nix/store/zrfd6a0fj5yk2ph51w04awfyahy5bg3h-container-test-run-clan-test-p2p-ssh-iroh.drv warning: ignoring the cl …
setup:
don't know how to build these paths:
  /nix/store/zrfd6a0fj5yk2ph51w04awfyahy5bg3h-container-test-run-clan-test-p2p-ssh-iroh.drv
warning: ignoring the client-specified setting 'store', because it is a restricted setting and you are not a trusted user
error: gRPC QueryValidPaths on 'nix-store.geninf.io:50051' failed: error: unable to download 'https://cache.clan.lol/6njgkhjqy90fxgx68akzf3vhk569l963.narinfo': HTTP error 503

              response body:

              <?xml version="1.0" encoding="UTF-8" standalone="yes"?>
              <Error>
                  <Code>SlowDown</Code>
                  <Message>Your account has made too many requests; try again later.</Message>
              </Error>
failed checks.x86_64-linux.packages 5m 46s
setup: don't know how to build these paths: /nix/store/ydra98cw1j4bf60r4x34nww539lnzrjz-container-test-run-packages.drv warning: ignoring the client-specified …
setup:
don't know how to build these paths:
  /nix/store/ydra98cw1j4bf60r4x34nww539lnzrjz-container-test-run-packages.drv
warning: ignoring the client-specified setting 'store', because it is a restricted setting and you are not a trusted user
error: gRPC QueryValidPaths on 'nix-store.geninf.io:50051' failed: error: substituter 'https://cache.clan.lol' is disabled
failed checks.x86_64-linux.postgresql 17m 13s
setup: don't know how to build these paths: /nix/store/dm2y74z1z1njqx9vr2s68x7s81249ig4-container-test-run-service-postgresql.drv warning: ignoring the client …
setup:
don't know how to build these paths:
  /nix/store/dm2y74z1z1njqx9vr2s68x7s81249ig4-container-test-run-service-postgresql.drv
warning: ignoring the client-specified setting 'store', because it is a restricted setting and you are not a trusted user
wykjhlxn89ixqkv7qb3cf2qfqw4i0ml5-testScript.drv: error: gRPC QueryValidPaths on 'nix-store.geninf.io:50051' failed: error: substituter 'https://cache.clan.lol' is disabled
lpbdbwsczfs82wh9kf6yjap1igpw71ih-postgres-db-restore-command-test.drv: error: gRPC QueryValidPaths on 'nix-store.geninf.io:50051' failed: error: substituter 'https://cache.clan.lol' is disabled
error: dependency 'czsna9cd8kzw7gfiacq8chkpahlqybhp-nixos-test-driver-service-postgresql.drv' failed
failed checks.x86_64-linux.service-dummy-test 2m 9s
setup: don't know how to build these paths: /nix/store/khnslaid93jxsjmmw75wn5dmrcfa8s8m-container-test-run-service-dummy-test.drv warning: ignoring the client …
setup:
don't know how to build these paths:
  /nix/store/khnslaid93jxsjmmw75wn5dmrcfa8s8m-container-test-run-service-dummy-test.drv
warning: ignoring the client-specified setting 'store', because it is a restricted setting and you are not a trusted user
error: gRPC QueryValidPaths on 'nix-store.geninf.io:50051' failed: error: unable to download 'https://cache.geninf.io/n7h0rc7n5i38k8j8gxyzlx9acl571bpa.narinfo': HTTP error 503

              response body:

              <?xml version="1.0" encoding="UTF-8" standalone="yes"?>
              <Error>
                  <Code>SlowDown</Code>
                  <Message>Your account has made too many requests; try again later.</Message>
              </Error>
failed checks.x86_64-linux.service-dummy-test-from-flake 20m 27s
setup: jsrv02j9wbzp9pz1pqqx28ci4sird8rx-nixos-version.drv: gi-build-x86-02: not scheduled here: jsrv02j9wbzp9pz1pqqx28ci4sird8rx-nixos-version.drv, asking the s …
setup:
jsrv02j9wbzp9pz1pqqx28ci4sird8rx-nixos-version.drv: gi-build-x86-02: not scheduled here: jsrv02j9wbzp9pz1pqqx28ci4sird8rx-nixos-version.drv, asking the scheduler again
z9nfdwvql5ybf645cx63xhb8plkw7mcy-hosts.drv: error: gRPC QueryValidPaths on 'nix-store.geninf.io:50051' failed: error: substituter 'https://cache.clan.lol' is disabled
gy2awxdnwjqqkn9gks8089gjc1j15ycz-decrypt-age-secrets.drv: error: gRPC QueryValidPaths on 'nix-store.geninf.io:50051' failed: error: substituter 'https://cache.clan.lol' is disabled
bz9czwsg4brhgpriii4hxrqj876qs3ag-python3-3.13.15-env.drv: gi-build-x86-02: not scheduled here: bz9czwsg4brhgpriii4hxrqj876qs3ag-python3-3.13.15-env.drv, asking the scheduler again
503w0n8m2blggcgza6yp6q64zcbla23w-stage-2-init.sh.drv: gi-build-x86-02: not scheduled here: 503w0n8m2blggcgza6yp6q64zcbla23w-stage-2-init.sh.drv, asking the scheduler again
yyjjjgbqf11z51l64jh65d8w1w737sgz-system-path.drv: gi-build-x86-02: not scheduled here: yyjjjgbqf11z51l64jh65d8w1w737sgz-system-path.drv, asking the scheduler again
6qnf625r0cpnlycpw9phcign6mvy72d8-unit-dbus-broker.service.drv: gi-build-x86-02: not scheduled here: 6qnf625r0cpnlycpw9phcign6mvy72d8-unit-dbus-broker.service.drv, asking the scheduler again
error: dependency 'rbyfqxljrjz8kg1374mwrq6m5057ldj9-nixos-test-driver-service-dummy-test-from-flake.drv' failed
failed checks.x86_64-linux.sshd 3m 31s
setup: don't know how to build these paths: /nix/store/mvz1fqvkby4imh9zwf4kp6rarcqx41sl-container-test-run-sshd.drv warning: ignoring the client-specified set …
setup:
don't know how to build these paths:
  /nix/store/mvz1fqvkby4imh9zwf4kp6rarcqx41sl-container-test-run-sshd.drv
warning: ignoring the client-specified setting 'store', because it is a restricted setting and you are not a trusted user
error: gRPC QueryValidPaths on 'nix-store.geninf.io:50051' failed: error: unable to download 'https://cache.clan.lol/6cg64qixba4dc5slyiyapzfh8ml094r6.narinfo': HTTP error 503

              response body:

              <?xml version="1.0" encoding="UTF-8" standalone="yes"?>
              <Error>
                  <Code>SlowDown</Code>
                  <Message>Your account has made too many requests; try again later.</Message>
              </Error>
failed checks.x86_64-linux.sshd-no-ca 4m 42s
setup: don't know how to build these paths: /nix/store/k1x7yfs500lj7n8h3ypf1rp4amnj27b1-container-test-run-sshd.drv warning: ignoring the client-specified set …
setup:
don't know how to build these paths:
  /nix/store/k1x7yfs500lj7n8h3ypf1rp4amnj27b1-container-test-run-sshd.drv
warning: ignoring the client-specified setting 'store', because it is a restricted setting and you are not a trusted user
error: gRPC QueryValidPaths on 'nix-store.geninf.io:50051' failed: error: unable to download 'https://cache.clan.lol/li7r22rcyhjxyr82bhl4mld9h697l6xb.narinfo': HTTP error 503

              response body:

              <?xml version="1.0" encoding="UTF-8" standalone="yes"?>
              <Error>
                  <Code>SlowDown</Code>
                  <Message>Your account has made too many requests; try again later.</Message>
              </Error>
failed checks.x86_64-linux.state-version 35s
setup: don't know how to build these paths: /nix/store/53wi5k1vxrdjx9ijqxcalga2xh2r64y0-container-test-run-service-state-version.drv warning: ignoring the cli …
setup:
don't know how to build these paths:
  /nix/store/53wi5k1vxrdjx9ijqxcalga2xh2r64y0-container-test-run-service-state-version.drv
warning: ignoring the client-specified setting 'store', because it is a restricted setting and you are not a trusted user
error: gRPC QueryValidPaths on 'nix-store.geninf.io:50051' failed: error: unable to download 'https://cache.clan.lol/m97lzx6f2mqr9by39p2k4jsbqsc7gi2l.narinfo': HTTP error 503

              response body:

              <?xml version="1.0" encoding="UTF-8" standalone="yes"?>
              <Error>
                  <Code>SlowDown</Code>
                  <Message>Your account has made too many requests; try again later.</Message>
              </Error>
failed checks.x86_64-linux.syncthing-service 42s
setup: don't know how to build these paths: /nix/store/kkrv4plwc4h8ia1gbkbq4m2ky77gnla2-container-test-run-syncthing-service.drv warning: ignoring the client- …
setup:
don't know how to build these paths:
  /nix/store/kkrv4plwc4h8ia1gbkbq4m2ky77gnla2-container-test-run-syncthing-service.drv
warning: ignoring the client-specified setting 'store', because it is a restricted setting and you are not a trusted user
error: gRPC QueryValidPaths on 'nix-store.geninf.io:50051' failed: error: unable to download 'https://cache.clan.lol/088p1bsyjryahsfq6rac8cbgpfxn202j.narinfo': HTTP error 503

              response body:

              <?xml version="1.0" encoding="UTF-8" standalone="yes"?>
              <Error>
                  <Code>SlowDown</Code>
                  <Message>Your account has made too many requests; try again later.</Message>
              </Error>
failed checks.x86_64-linux.template-minimal 22m 0s
setup: rscymrcnw2qak327na81acm7s73maxgq-system-units.drv: build-x86-01: build-x86-01: input not substitutable: error: path '/nix/store/xngqcjgi3prjvvzli81bwdd08 …
setup:
rscymrcnw2qak327na81acm7s73maxgq-system-units.drv: build-x86-01: build-x86-01: input not substitutable: error: path '/nix/store/xngqcjgi3prjvvzli81bwdd08ans8wpm-unit-systemd-networkd.service' is required, but there is no substituter that can build it, asking the scheduler again
rscymrcnw2qak327na81acm7s73maxgq-system-units.drv: build-x86-01: build-x86-01: input not substitutable: error: path '/nix/store/xngqcjgi3prjvvzli81bwdd08ans8wpm-unit-systemd-networkd.service' is required, but there is no substituter that can build it, asking the scheduler again
rscymrcnw2qak327na81acm7s73maxgq-system-units.drv: build-x86-01: build-x86-01: input not substitutable: error: path '/nix/store/xngqcjgi3prjvvzli81bwdd08ans8wpm-unit-systemd-networkd.service' is required, but there is no substituter that can build it, asking the scheduler again
rscymrcnw2qak327na81acm7s73maxgq-system-units.drv: build-x86-01: build-x86-01: input not substitutable: error: path '/nix/store/xngqcjgi3prjvvzli81bwdd08ans8wpm-unit-systemd-networkd.service' is required, but there is no substituter that can build it, asking the scheduler again
rscymrcnw2qak327na81acm7s73maxgq-system-units.drv: build-x86-01: build-x86-01: input not substitutable: error: path '/nix/store/xngqcjgi3prjvvzli81bwdd08ans8wpm-unit-systemd-networkd.service' is required, but there is no substituter that can build it, asking the scheduler again
rscymrcnw2qak327na81acm7s73maxgq-system-units.drv: build-x86-01: build-x86-01: input not substitutable: error: path '/nix/store/xngqcjgi3prjvvzli81bwdd08ans8wpm-unit-systemd-networkd.service' is required, but there is no substituter that can build it, asking the scheduler again
rscymrcnw2qak327na81acm7s73maxgq-system-units.drv: build-x86-01: build-x86-01: input not substitutable: error: path '/nix/store/xngqcjgi3prjvvzli81bwdd08ans8wpm-unit-systemd-networkd.service' is required, but there is no substituter that can build it, asking the scheduler again
error: dependency 'qb2l7y5v34923wzddb8531dgb53ikr2f-etc.drv' failed
failed checks.x86_64-linux.treefmt 2m 24s
setup: don't know how to build these paths: /nix/store/pvyn9fq41a0cr054gg5f4d9f6z0ikbaa-treefmt-check.drv warning: ignoring the client-specified setting 'stor …
setup:
don't know how to build these paths:
  /nix/store/pvyn9fq41a0cr054gg5f4d9f6z0ikbaa-treefmt-check.drv
warning: ignoring the client-specified setting 'store', because it is a restricted setting and you are not a trusted user
error: gRPC QueryValidPaths on 'nix-store.geninf.io:50051' failed: error: substituter 'https://cache.geninf.io' is disabled
failed checks.x86_64-linux.users 18m 6s
setup: these 2 paths will be fetched (540.7 KiB download, 1.5 MiB unpacked): /nix/store/gy140r43h1wjj2aw5pkyyncfsg3iw17d-55-nixos-aslr-entropy.conf /nix/sto …
setup:
these 2 paths will be fetched (540.7 KiB download, 1.5 MiB unpacked):
  /nix/store/gy140r43h1wjj2aw5pkyyncfsg3iw17d-55-nixos-aslr-entropy.conf
  /nix/store/w7jlvv66p03qbkklg4ha0gzdsnxpmral-nsncd-1.5.3
warning: ignoring the client-specified setting 'store', because it is a restricted setting and you are not a trusted user
n0wykvml27sibx79ssxcpcfr6n1dj1ir-dbus-1.drv: error: gRPC QueryValidPaths on 'nix-store.geninf.io:50051' failed: error: substituter 'https://cache.clan.lol' is disabled
d3pf9r59n1xwplnrpn9z15rkimhrsrnf-generator-user-password-testuser.drv: gi-build-x86-02: not scheduled here: d3pf9r59n1xwplnrpn9z15rkimhrsrnf-generator-user-password-testuser.drv, asking the scheduler again
v2w4yffkk44y18j5nf3l748xhxz7lcbp-testScript.drv: gi-build-x86-02: not scheduled here: v2w4yffkk44y18j5nf3l748xhxz7lcbp-testScript.drv, asking the scheduler again
error: dependency 'qs77d24il4m8h7w9jbjciqcg6xmsiszq-nixos-test-driver-users.drv' failed
failed checks.x86_64-linux.wifi 7m 15s
setup: don't know how to build these paths: /nix/store/znjm346gxwrf2xkx4rjbmzdi7cbiwdsl-vm-test-run-wifi.drv warning: ignoring the client-specified setting 's …
setup:
don't know how to build these paths:
  /nix/store/znjm346gxwrf2xkx4rjbmzdi7cbiwdsl-vm-test-run-wifi.drv
warning: ignoring the client-specified setting 'store', because it is a restricted setting and you are not a trusted user
error: gRPC QueryValidPaths on 'nix-store.geninf.io:50051' failed: error: unable to download 'https://cache.clan.lol/4giz6wbjgbwcn2z87plpznwmxv03a2dc.narinfo': HTTP error 503

              response body:

              <?xml version="1.0" encoding="UTF-8" standalone="yes"?>
              <Error>
                  <Code>SlowDown</Code>
                  <Message>Your account has made too many requests; try again later.</Message>
              </Error>
failed checks.x86_64-linux.wireguard 4m 0s
setup: don't know how to build these paths: /nix/store/samlcwny8p30x1fbnmsaz5hc1bna2gyn-container-test-run-wireguard.drv warning: ignoring the client-specifie …
setup:
don't know how to build these paths:
  /nix/store/samlcwny8p30x1fbnmsaz5hc1bna2gyn-container-test-run-wireguard.drv
warning: ignoring the client-specified setting 'store', because it is a restricted setting and you are not a trusted user
error: gRPC QueryValidPaths on 'nix-store.geninf.io:50051' failed: error: unable to download 'https://cache.geninf.io/23gvl1kn24gi7pb1n65mzlijbw3bx3hk.narinfo': HTTP error 503

              response body:

              <?xml version="1.0" encoding="UTF-8" standalone="yes"?>
              <Error>
                  <Code>SlowDown</Code>
                  <Message>Your account has made too many requests; try again later.</Message>
              </Error>
failed checks.x86_64-linux.yggdrasil 17m 18s
setup: 1csalcyzrpik8hajsq30pd89ncgy6yhf-system-path.drv: error: gRPC QueryValidPaths on 'nix-store.geninf.io:50051' failed: error: substituter 'https://cache.cl …
setup:
1csalcyzrpik8hajsq30pd89ncgy6yhf-system-path.drv: error: gRPC QueryValidPaths on 'nix-store.geninf.io:50051' failed: error: substituter 'https://cache.clan.lol' is disabled
la4q989ic8kc2rwb7526dkds5yqibbnf-unit-dbus-broker.service.drv: error: gRPC QueryValidPaths on 'nix-store.geninf.io:50051' failed: error: substituter 'https://cache.clan.lol' is disabled
3apkm0zzd0r486mzv8q9l8sx72p4kvxm-unit-script-test-http-server-start.drv: gi-build-x86-02: not scheduled here: 3apkm0zzd0r486mzv8q9l8sx72p4kvxm-unit-script-test-http-server-start.drv, asking the scheduler again
7rx1a39p53j9gi1vvsb0cj3mgysf2737-X-Reload-Triggers-systemd-networkd.drv: gi-build-x86-02: not scheduled here: 7rx1a39p53j9gi1vvsb0cj3mgysf2737-X-Reload-Triggers-systemd-networkd.drv, asking the scheduler again
90hn2740w6zjbixf1z5pzfngzkl4zrjs-X-Restart-Triggers-systemd-networkd.drv: gi-build-x86-02: not scheduled here: 90hn2740w6zjbixf1z5pzfngzkl4zrjs-X-Restart-Triggers-systemd-networkd.drv, asking the scheduler again
3fpw2bg4fd54bcfjg5klkvcxc7ffh63m-system-path.drv: gi-build-x86-02: not scheduled here: 3fpw2bg4fd54bcfjg5klkvcxc7ffh63m-system-path.drv, asking the scheduler again
vlxmfds8wcrqhcxz3biffpd5khsjr25x-unit-zerotierone.service.drv: gi-build-x86-02: not scheduled here: vlxmfds8wcrqhcxz3biffpd5khsjr25x-unit-zerotierone.service.drv, asking the scheduler again
error: dependency 'vz7dxxhw58fjf8dj1h8h8nk2rd8fxhql-nixos-test-driver-yggdrasil.drv' failed
failed checks.x86_64-linux.zerotier-multi-instance 13m 32s
setup: don't know how to build these paths: /nix/store/hrdyvc5vfzisqi1cf6c1pdq9r635sdf5-vm-test-run-zerotier-multi-instance.drv warning: ignoring the client-s …
setup:
don't know how to build these paths:
  /nix/store/hrdyvc5vfzisqi1cf6c1pdq9r635sdf5-vm-test-run-zerotier-multi-instance.drv
warning: ignoring the client-specified setting 'store', because it is a restricted setting and you are not a trusted user
j5ifgkm98h1ix92mw25syy8d5vij4kgf-dry-activate.drv: gi-build-x86-02: not scheduled here: j5ifgkm98h1ix92mw25syy8d5vij4kgf-dry-activate.drv, asking the scheduler again
gz64vvxiwgrapjjsh1a0dpn59zkm9fpx-system-path.drv: gi-build-x86-02: not scheduled here: gz64vvxiwgrapjjsh1a0dpn59zkm9fpx-system-path.drv, asking the scheduler again
i7mfr8rlv8jj0bviy0pzjhxr750dii3n-dbus-1.drv: error: gRPC QueryValidPaths on 'nix-store.geninf.io:50051' failed: error: substituter 'https://cache.clan.lol' is disabled
error: dependency 'w5g5pmhx5625lphq3g5r7gcvnrnpcx11-nixos-test-driver-zerotier-multi-instance.drv' failed
24 succeeded
succeeded attributes
status attribute duration
loading…
25 already built
skipped attributes
status attribute duration
loading…