nixbot

builds

clan/clan-core build #768 failed

branch main · PR #8139 · commit 4bfd579bc4 · · took 3h 2m · eval 1m 33s

eval warnings 21 kinds · 79 occurrences
  • error Cannot build '/nix/store/…-generator-machine-id.drv'. ×1
  • error Cannot build '/nix/store/…-test-vars-generated.drv'. ×11
  • error ×11
  • error Cannot build '/nix/store/…-merged-test-dir-service-machine-id.drv'. ×1
  • error Cannot build '/nix/store/…-generator-state-version.drv'. ×9
  • error Cannot build '/nix/store/…-merged-test-dir-hello-service.drv'. ×1
  • error Cannot build '/nix/store/…-generator-grafana-admin.drv'. ×1
  • error Cannot build '/nix/store/…-merged-test-dir-monitoring.drv'. ×1
  • error Cannot build '/nix/store/…-merged-test-dir-nixos-test-password-store-mounts.drv'. ×1
  • error Cannot build '/nix/store/…-merged-test-dir-kde.drv'. ×1
  • error Cannot build '/nix/store/…-merged-test-dir-localbackup.drv'. ×1
  • error Cannot build '/nix/store/…-merged-test-dir-trusted-nix-caches.drv'. ×1
  • error Cannot build '/nix/store/…-merged-test-dir-service-state-version.drv'. ×1
  • error Cannot build '/nix/store/…-merged-test-dir-zerotier-multi-instance.drv'. ×1
  • error Cannot build '/nix/store/…-merged-test-dir-service-postgresql.drv'. ×1
  • error Cannot build '/nix/store/…-merged-test-dir-packages.drv'. ×1
  • error unable to download 'https://cache.clan.lol/…': HTTP error 503 ×1
  • warn unable to download 'https://cache.clan.lol/…': HTTP error 503 ×29
  • warn stdenv.isDarwin is deprecated, use stdenv.hostPlatform.isDarwin instead ×2
  • warn file 'nar/0j4bang2lixa9a7ydxls6ikk2pk1lk191idqafyya1q2z8xqf6lv.nar.zst' does not exist in binary cache 'https://cache.clan.lol/…' ×1
  • warn unable to download 'https://cache.geninf.io/…': HTTP error 503 ×2

44 failed ⚠ 1
failed attributes
status attribute duration
failed checks.x86_64-linux.all-packages
  • stdenv.isDarwin is deprecated, use stdenv.hostPlatform.isDarwin instead
3h 0m
setup: br6ivjh8x6k5524bdpjf5zf5a0rbfgi3-network-status-0.1.0.drv: build-x86-01: build-x86-01: input not substitutable: error: path '/nix/store/dbmzgjrksikz67mzr …
setup:
br6ivjh8x6k5524bdpjf5zf5a0rbfgi3-network-status-0.1.0.drv: build-x86-01: build-x86-01: input not substitutable: error: path '/nix/store/dbmzgjrksikz67mzr9c0pj5fm5wv88a3-python-imports-check-hook.sh' is required, but there is no substituter that can build it, asking the scheduler again
br6ivjh8x6k5524bdpjf5zf5a0rbfgi3-network-status-0.1.0.drv: build-x86-01: build-x86-01: input not substitutable: error: path '/nix/store/dbmzgjrksikz67mzr9c0pj5fm5wv88a3-python-imports-check-hook.sh' is required, but there is no substituter that can build it, asking the scheduler again
br6ivjh8x6k5524bdpjf5zf5a0rbfgi3-network-status-0.1.0.drv: build-x86-01: build-x86-01: input not substitutable: error: path '/nix/store/dbmzgjrksikz67mzr9c0pj5fm5wv88a3-python-imports-check-hook.sh' is required, but there is no substituter that can build it, asking the scheduler again
br6ivjh8x6k5524bdpjf5zf5a0rbfgi3-network-status-0.1.0.drv: build-x86-01: build-x86-01: input not substitutable: error: path '/nix/store/dbmzgjrksikz67mzr9c0pj5fm5wv88a3-python-imports-check-hook.sh' is required, but there is no substituter that can build it, asking the scheduler again
br6ivjh8x6k5524bdpjf5zf5a0rbfgi3-network-status-0.1.0.drv: build-x86-01: build-x86-01: input not substitutable: error: path '/nix/store/dbmzgjrksikz67mzr9c0pj5fm5wv88a3-python-imports-check-hook.sh' is required, but there is no substituter that can build it, asking the scheduler again
br6ivjh8x6k5524bdpjf5zf5a0rbfgi3-network-status-0.1.0.drv: build-x86-01: build-x86-01: input not substitutable: error: path '/nix/store/dbmzgjrksikz67mzr9c0pj5fm5wv88a3-python-imports-check-hook.sh' is required, but there is no substituter that can build it, asking the scheduler again
br6ivjh8x6k5524bdpjf5zf5a0rbfgi3-network-status-0.1.0.drv: build-x86-01: build-x86-01: input not substitutable: error: path '/nix/store/dbmzgjrksikz67mzr9c0pj5fm5wv88a3-python-imports-check-hook.sh' is required, but there is no substituter that can build it, asking the scheduler again
br6ivjh8x6k5524bdpjf5zf5a0rbfgi3-network-status-0.1.0.drv: build-x86-01: build-x86-01: input not substitutable: error: path '/nix/store/dbmzgjrksikz67mzr9c0pj5fm5wv88a3-python-imports-check-hook.sh' is required, but there is no substituter that can build it, asking the scheduler again
failed checks.aarch64-darwin.all-packages 3h 0m
setup: don't know how to build these paths: /nix/store/xsq1wksjz7fp42xd9k1cf8whw9virmn6-all-packages.drv warning: ignoring the client-specified setting 'store …
setup:
don't know how to build these paths:
  /nix/store/xsq1wksjz7fp42xd9k1cf8whw9virmn6-all-packages.drv
warning: ignoring the client-specified setting 'store', because it is a restricted setting and you are not a trusted user
error: gRPC QueryValidPaths on 'nix-store.geninf.io:50051' failed: error: substituter 'https://cache.clan.lol' is disabled
failed checks.aarch64-darwin.clan-pytest-with-core 3h 0m
setup: /nix/store/60ghsifz7bi7ik3pzsqkigszj2kvjhp8-xz-5.8.3-man /nix/store/pzxa63mqffdvnnylzh22xgncrv5zsa3d-zerotier-tools-0.1.0 /nix/store/pnq5zs7gd74m8v …
setup:
  /nix/store/60ghsifz7bi7ik3pzsqkigszj2kvjhp8-xz-5.8.3-man
  /nix/store/pzxa63mqffdvnnylzh22xgncrv5zsa3d-zerotier-tools-0.1.0
  /nix/store/pnq5zs7gd74m8vgsq85rdasr5l9lk7c7-zerotierone-1.16.0
  /nix/store/vpvnj4260scrmdn6l5znli37yqqm47ia-zerotierone-1.16.0
  /nix/store/c22awswni39gwgshhzwjah0m0ca3jabx-zlib-1.3.2
  /nix/store/y28fq7k5l83mmc0jk52kq34ljf07b5kh-zlib-1.3.2-dev
  /nix/store/x5wxpkgv6bqq33yq9ma5ib6sm8hmf01f-zlib-1.3.2-static
warning: ignoring the client-specified setting 'store', because it is a restricted setting and you are not a trusted user
failed checks.aarch64-darwin.clan-pytest-without-core 2m 31s
setup: ymiv46lnxx3v7vapbq7xgfdnfxvxv3j9-clan-pytest-without-core.drv: build04: build04: input not substitutable: error: path '/nix/store/sdddk8nk3nr8yx3a96j2l3v …
setup:
ymiv46lnxx3v7vapbq7xgfdnfxvxv3j9-clan-pytest-without-core.drv: build04: build04: input not substitutable: error: path '/nix/store/sdddk8nk3nr8yx3a96j2l3v7gdlmpp88-python3-3.14.7-env' is required, but there is no substituter that can build it, asking the scheduler again
ymiv46lnxx3v7vapbq7xgfdnfxvxv3j9-clan-pytest-without-core.drv: build04: build04: input not substitutable: error: path '/nix/store/sdddk8nk3nr8yx3a96j2l3v7gdlmpp88-python3-3.14.7-env' is required, but there is no substituter that can build it, asking the scheduler again
ymiv46lnxx3v7vapbq7xgfdnfxvxv3j9-clan-pytest-without-core.drv: build04: build04: input not substitutable: error: path '/nix/store/sdddk8nk3nr8yx3a96j2l3v7gdlmpp88-python3-3.14.7-env' is required, but there is no substituter that can build it, asking the scheduler again
ymiv46lnxx3v7vapbq7xgfdnfxvxv3j9-clan-pytest-without-core.drv: build04: build04: input not substitutable: error: path '/nix/store/sdddk8nk3nr8yx3a96j2l3v7gdlmpp88-python3-3.14.7-env' is required, but there is no substituter that can build it, asking the scheduler again
ymiv46lnxx3v7vapbq7xgfdnfxvxv3j9-clan-pytest-without-core.drv: build04: build04: input not substitutable: error: path '/nix/store/sdddk8nk3nr8yx3a96j2l3v7gdlmpp88-python3-3.14.7-env' is required, but there is no substituter that can build it, asking the scheduler again
ymiv46lnxx3v7vapbq7xgfdnfxvxv3j9-clan-pytest-without-core.drv: build04: build04: input not substitutable: error: path '/nix/store/sdddk8nk3nr8yx3a96j2l3v7gdlmpp88-python3-3.14.7-env' is required, but there is no substituter that can build it, asking the scheduler again
ymiv46lnxx3v7vapbq7xgfdnfxvxv3j9-clan-pytest-without-core.drv: build04: build04: input not substitutable: error: path '/nix/store/sdddk8nk3nr8yx3a96j2l3v7gdlmpp88-python3-3.14.7-env' is required, but there is no substituter that can build it, asking the scheduler again
error: gave up after 9 reschedules
failed checks.aarch64-darwin.devshell 2m 35s
setup: don't know how to build these paths: /nix/store/arsxhrkag0i1cy5rp63479f6zlisvn2m-check-devshell-not-depends-on-clan-cli.drv warning: ignoring the clien …
setup:
don't know how to build these paths:
  /nix/store/arsxhrkag0i1cy5rp63479f6zlisvn2m-check-devshell-not-depends-on-clan-cli.drv
warning: ignoring the client-specified setting 'store', because it is a restricted setting and you are not a trusted user
error: gRPC QueryValidPaths on 'nix-store.geninf.io:50051' failed: error: substituter 'https://cache.geninf.io' is disabled
failed checks.aarch64-darwin.devShell-clan-site 1m 7s
setup: don't know how to build these paths: /nix/store/b47jynl3y6b8211kf8pvby98n6d9mqw2-nix-shell.drv warning: ignoring the client-specified setting 'store', …
setup:
don't know how to build these paths:
  /nix/store/b47jynl3y6b8211kf8pvby98n6d9mqw2-nix-shell.drv
warning: ignoring the client-specified setting 'store', because it is a restricted setting and you are not a trusted user
error: gRPC QueryValidPaths on 'nix-store.geninf.io:50051' failed: error: unable to download 'https://cache.clan.lol/mkxn7h73d9gy0n7ck8ih4y8mkawpjq03.narinfo': HTTP error 503

              response body:

              <?xml version="1.0" encoding="UTF-8" standalone="yes"?>
              <Error>
                  <Code>SlowDown</Code>
                  <Message>Your account has made too many requests; try again later.</Message>
              </Error>
failed checks.aarch64-darwin.eval-tests 3h 1m
setup: don't know how to build these paths: /nix/store/gh3gxhjwdf07mlc92af9z342v2n2z7lq-eval-tests-aarch64-darwin.drv warning: ignoring the client-specified s …
setup:
don't know how to build these paths:
  /nix/store/gh3gxhjwdf07mlc92af9z342v2n2z7lq-eval-tests-aarch64-darwin.drv
warning: ignoring the client-specified setting 'store', because it is a restricted setting and you are not a trusted user
failed checks.aarch64-linux.clan-pytest-with-core 3m 24s
setup: don't know how to build these paths: /nix/store/9z4mz60dm42wfw52xf3i958dl01n2y8j-clan-pytest-with-core.drv warning: ignoring the client-specified setti …
setup:
don't know how to build these paths:
  /nix/store/9z4mz60dm42wfw52xf3i958dl01n2y8j-clan-pytest-with-core.drv
warning: ignoring the client-specified setting 'store', because it is a restricted setting and you are not a trusted user
error: gRPC QueryValidPaths on 'nix-store.geninf.io:50051' failed: error: unable to download 'https://cache.clan.lol/s59nflyyxa5dryzwxkmfpya1ywp1y4a1.narinfo': HTTP error 503

              response body:

              <?xml version="1.0" encoding="UTF-8" standalone="yes"?>
              <Error>
                  <Code>SlowDown</Code>
                  <Message>Your account has made too many requests; try again later.</Message>
              </Error>
failed checks.aarch64-linux.clan-test-iso 27s
setup: don't know how to build these paths: /nix/store/d6gl7m7zffkpr5q7czz17l4flb8f8zhn--test-run-clan-test-iso.drv warning: ignoring the client-specified set …
setup:
don't know how to build these paths:
  /nix/store/d6gl7m7zffkpr5q7czz17l4flb8f8zhn--test-run-clan-test-iso.drv
warning: ignoring the client-specified setting 'store', because it is a restricted setting and you are not a trusted user
error: gRPC QueryValidPaths on 'nix-store.geninf.io:50051' failed: error: unable to download 'https://cache.geninf.io/h0km83ln6mzzs997k117ff08ca5znglz.narinfo': HTTP error 503

              response body:

              <?xml version="1.0" encoding="UTF-8" standalone="yes"?>
              <Error>
                  <Code>SlowDown</Code>
                  <Message>Your account has made too many requests; try again later.</Message>
              </Error>
failed checks.aarch64-linux.devshell 3h 1m
setup: don't know how to build these paths: /nix/store/2ggvm6igzk49b13w5iv1pvkcjmy363pc-check-devshell-not-depends-on-clan-cli.drv warning: ignoring the clien …
setup:
don't know how to build these paths:
  /nix/store/2ggvm6igzk49b13w5iv1pvkcjmy363pc-check-devshell-not-depends-on-clan-cli.drv
warning: ignoring the client-specified setting 'store', because it is a restricted setting and you are not a trusted user
failed checks.aarch64-linux.devShell-clan-site 3h 0m
setup: /nix/store/hpd9bqprgcclfxd1mac3750vd419qbd2-python-runtime-deps-check-hook.sh /nix/store/zhl6n9jr0g40b0x1fdn8rnl325n8i5n0-python3.14-build-1.5.1 /n …
setup:
  /nix/store/hpd9bqprgcclfxd1mac3750vd419qbd2-python-runtime-deps-check-hook.sh
  /nix/store/zhl6n9jr0g40b0x1fdn8rnl325n8i5n0-python3.14-build-1.5.1
  /nix/store/s4bvcp0g1nj0xv12v7p6y05a0srk292j-python3.14-installer-1.0.1
  /nix/store/vwjy6fbn2nc06nhakdq252xgivqb804g-python3.14-pyproject-hooks-1.2.0
  /nix/store/idlwgfiz0sx90mimq3jjxl7vyi4pqspy-python3.14-setuptools-83.0.0
  /nix/store/6rpvwbfgakbcvwspaw98lqh0k2h4azg6-python3.14-wheel-0.47.0
  /nix/store/s636h8q3f1rhs81zj38zp6pdkvsmcch2-wrap-python-hook
warning: ignoring the client-specified setting 'store', because it is a restricted setting and you are not a trusted user
failed checks.aarch64-linux.devShell-docs 3h 1m
setup: don't know how to build these paths: /nix/store/c436kqjqwiqs2l48wzdd3fzpl12dg3ki-nix-shell.drv warning: ignoring the client-specified setting 'store', …
setup:
don't know how to build these paths:
  /nix/store/c436kqjqwiqs2l48wzdd3fzpl12dg3ki-nix-shell.drv
warning: ignoring the client-specified setting 'store', because it is a restricted setting and you are not a trusted user
failed eval checks.aarch64-linux.hello-service —
error: … while evaluating the attribute 'drvPath' at «https://releases.nixos.org/nixpkgs/nixpkgs-26.11pre1078010.b6c98e9e6633/nixexprs.tar.xz?na …
error:
       … while evaluating the attribute 'drvPath'
         at «https://releases.nixos.org/nixpkgs/nixpkgs-26.11pre1078010.b6c98e9e6633/nixexprs.tar.xz?narHash=sha256-wQZif6Lyrg1IDl8k68Gwa3OK9PermeRsjdKgso4K1VA%3D»/lib/customisation.nix:416:11:
          415|         // {
          416|           drvPath =
             |           ^
          417|             assert condition;

       … while calling the 'derivationStrict' builtin
         at «nix-internal»/derivation-internal.nix:37:12:
           36|
           37|   strict = derivationStrict drvAttrs;
             |            ^
           38|

       … while evaluating the option `driverConfiguration.vlans':

       … while evaluating definitions from `/nix/store/b5yz03mfyd67drnilplad1drbxbkap1w-source/nixos/lib/testing/driver-configuration.nix':

       … while evaluating the option `containers.peer1.networking.interfaces':

       … while evaluating definitions from `/nix/store/b5yz03mfyd67drnilplad1drbxbkap1w-source/nixos/modules/hardware/facter/networking':

       … while evaluating the option `containers.peer1.hardware.facter.enable':

       … while evaluating the option `containers.peer1.hardware.facter.report':

       … while evaluating the option `containers.peer1.hardware.facter.reportPath':

       … while evaluating definitions from `/nix/store/g0g49772apda62b5696bzbxjqv4alsmq-source/nixosModules/clanCore/nixos-facter.nix':

       (stack trace truncated; use '--show-trace' to show the full, detailed trace)

       error: Cannot build '/nix/store/15a949chgf4lq3gg8afaacqw9ybf94y6-merged-test-dir-hello-service.drv'.
       Reason: 1 dependency failed.
       Output paths:
         /nix/store/j1mhsajhr3hykkmrb0h1pb4fphlz7zmk-merged-test-dir-hello-service
failed eval checks.aarch64-linux.kde —
error: … while evaluating the attribute 'drvPath' at «https://releases.nixos.org/nixpkgs/nixpkgs-26.11pre1078010.b6c98e9e6633/nixexprs.tar.xz?na …
error:
       … while evaluating the attribute 'drvPath'
         at «https://releases.nixos.org/nixpkgs/nixpkgs-26.11pre1078010.b6c98e9e6633/nixexprs.tar.xz?narHash=sha256-wQZif6Lyrg1IDl8k68Gwa3OK9PermeRsjdKgso4K1VA%3D»/lib/customisation.nix:416:11:
          415|         // {
          416|           drvPath =
             |           ^
          417|             assert condition;

       … while calling the 'derivationStrict' builtin
         at «nix-internal»/derivation-internal.nix:37:12:
           36|
           37|   strict = derivationStrict drvAttrs;
             |            ^
           38|

       … while evaluating the option `driverConfiguration.vlans':

       … while evaluating definitions from `/nix/store/b5yz03mfyd67drnilplad1drbxbkap1w-source/nixos/lib/testing/driver-configuration.nix':

       … while evaluating the option `containers.client.networking.interfaces':

       … while evaluating definitions from `/nix/store/b5yz03mfyd67drnilplad1drbxbkap1w-source/nixos/modules/hardware/facter/networking':

       … while evaluating the option `containers.client.hardware.facter.enable':

       … while evaluating the option `containers.client.hardware.facter.report':

       … while evaluating the option `containers.client.hardware.facter.reportPath':

       … while evaluating definitions from `/nix/store/g0g49772apda62b5696bzbxjqv4alsmq-source/nixosModules/clanCore/nixos-facter.nix':

       (stack trace truncated; use '--show-trace' to show the full, detailed trace)

       error: Cannot build '/nix/store/nrphaicbbjvdczs7gxg3wxacxnzkd1gg-merged-test-dir-kde.drv'.
       Reason: 1 dependency failed.
       Output paths:
         /nix/store/adrkf0xgnr4l9839z3wkjvdhmd4c8gs1-merged-test-dir-kde
failed eval checks.aarch64-linux.localbackup —
error: … while evaluating the attribute 'drvPath' at «https://releases.nixos.org/nixpkgs/nixpkgs-26.11pre1078010.b6c98e9e6633/nixexprs.tar.xz?na …
error:
       … while evaluating the attribute 'drvPath'
         at «https://releases.nixos.org/nixpkgs/nixpkgs-26.11pre1078010.b6c98e9e6633/nixexprs.tar.xz?narHash=sha256-wQZif6Lyrg1IDl8k68Gwa3OK9PermeRsjdKgso4K1VA%3D»/lib/customisation.nix:416:11:
          415|         // {
          416|           drvPath =
             |           ^
          417|             assert condition;

       … while calling the 'derivationStrict' builtin
         at «nix-internal»/derivation-internal.nix:37:12:
           36|
           37|   strict = derivationStrict drvAttrs;
             |            ^
           38|

       … while evaluating the option `driverConfiguration.vlans':

       … while evaluating definitions from `/nix/store/b5yz03mfyd67drnilplad1drbxbkap1w-source/nixos/lib/testing/driver-configuration.nix':

       … while evaluating the option `containers.machine.networking.interfaces':

       … while evaluating definitions from `/nix/store/b5yz03mfyd67drnilplad1drbxbkap1w-source/nixos/modules/hardware/facter/networking':

       … while evaluating the option `containers.machine.hardware.facter.enable':

       … while evaluating the option `containers.machine.hardware.facter.report':

       … while evaluating the option `containers.machine.hardware.facter.reportPath':

       … while evaluating definitions from `/nix/store/g0g49772apda62b5696bzbxjqv4alsmq-source/nixosModules/clanCore/nixos-facter.nix':

       (stack trace truncated; use '--show-trace' to show the full, detailed trace)

       error: Cannot build '/nix/store/3ggbd2jpcfxaba1yc91vvay0p59sl3x4-merged-test-dir-localbackup.drv'.
       Reason: 1 dependency failed.
       Output paths:
         /nix/store/z8h2byqv64ap17iz2cqb0q7175bj07r2-merged-test-dir-localbackup
failed eval checks.aarch64-linux.machine-id —
error: … while evaluating the attribute 'drvPath' at «https://releases.nixos.org/nixpkgs/nixpkgs-26.11pre1078010.b6c98e9e6633/nixexprs.tar.xz?na …
error:
       … while evaluating the attribute 'drvPath'
         at «https://releases.nixos.org/nixpkgs/nixpkgs-26.11pre1078010.b6c98e9e6633/nixexprs.tar.xz?narHash=sha256-wQZif6Lyrg1IDl8k68Gwa3OK9PermeRsjdKgso4K1VA%3D»/lib/customisation.nix:416:11:
          415|         // {
          416|           drvPath =
             |           ^
          417|             assert condition;

       … while calling the 'derivationStrict' builtin
         at «nix-internal»/derivation-internal.nix:37:12:
           36|
           37|   strict = derivationStrict drvAttrs;
             |            ^
           38|

       … while evaluating the option `driverConfiguration.vlans':

       … while evaluating definitions from `/nix/store/b5yz03mfyd67drnilplad1drbxbkap1w-source/nixos/lib/testing/driver-configuration.nix':

       … while evaluating the option `containers.server.networking.interfaces':

       … while evaluating definitions from `/nix/store/b5yz03mfyd67drnilplad1drbxbkap1w-source/nixos/modules/hardware/facter/networking':

       … while evaluating the option `containers.server.hardware.facter.enable':

       … while evaluating the option `containers.server.hardware.facter.report':

       … while evaluating the option `containers.server.hardware.facter.reportPath':

       … while evaluating definitions from `/nix/store/g0g49772apda62b5696bzbxjqv4alsmq-source/nixosModules/clanCore/nixos-facter.nix':

       (stack trace truncated; use '--show-trace' to show the full, detailed trace)

       error: Cannot build '/nix/store/9b3gd9v67ffz0vd6h7hqk4nzy4dry8cb-merged-test-dir-service-machine-id.drv'.
       Reason: 1 dependency failed.
       Output paths:
         /nix/store/frx9ga4m7nbqry1ci6n9rxphd8b522al-merged-test-dir-service-machine-id
failed eval checks.aarch64-linux.monitoring —
error: … while evaluating the attribute 'drvPath' at «https://releases.nixos.org/nixpkgs/nixpkgs-26.11pre1078010.b6c98e9e6633/nixexprs.tar.xz?na …
error:
       … while evaluating the attribute 'drvPath'
         at «https://releases.nixos.org/nixpkgs/nixpkgs-26.11pre1078010.b6c98e9e6633/nixexprs.tar.xz?narHash=sha256-wQZif6Lyrg1IDl8k68Gwa3OK9PermeRsjdKgso4K1VA%3D»/lib/customisation.nix:416:11:
          415|         // {
          416|           drvPath =
             |           ^
          417|             assert condition;

       … while calling the 'derivationStrict' builtin
         at «nix-internal»/derivation-internal.nix:37:12:
           36|
           37|   strict = derivationStrict drvAttrs;
             |            ^
           38|

       … while evaluating the option `driverConfiguration.vlans':

       … while evaluating definitions from `/nix/store/b5yz03mfyd67drnilplad1drbxbkap1w-source/nixos/lib/testing/driver-configuration.nix':

       … while evaluating the option `containers.machine1.networking.interfaces':

       … while evaluating definitions from `/nix/store/b5yz03mfyd67drnilplad1drbxbkap1w-source/nixos/modules/hardware/facter/networking':

       … while evaluating the option `containers.machine1.hardware.facter.enable':

       … while evaluating the option `containers.machine1.hardware.facter.report':

       … while evaluating the option `containers.machine1.hardware.facter.reportPath':

       … while evaluating definitions from `/nix/store/g0g49772apda62b5696bzbxjqv4alsmq-source/nixosModules/clanCore/nixos-facter.nix':

       (stack trace truncated; use '--show-trace' to show the full, detailed trace)

       error: Cannot build '/nix/store/lla6dvjyh7fry2igkcq6sf5qlrh51gv6-merged-test-dir-monitoring.drv'.
       Reason: 1 dependency failed.
       Output paths:
         /nix/store/px1qlq8mwwdrqaw83smbzz892kj79xba-merged-test-dir-monitoring
failed checks.aarch64-linux.nixos-documentation 3h 0m
setup: these 13 derivations will be built:
setup:
these 13 derivations will be built:
failed eval checks.aarch64-linux.nixos-test-password-store-mounts —
error: … while evaluating the attribute 'drvPath' at «https://releases.nixos.org/nixpkgs/nixpkgs-26.11pre1078010.b6c98e9e6633/nixexprs.tar.xz?na …
error:
       … while evaluating the attribute 'drvPath'
         at «https://releases.nixos.org/nixpkgs/nixpkgs-26.11pre1078010.b6c98e9e6633/nixexprs.tar.xz?narHash=sha256-wQZif6Lyrg1IDl8k68Gwa3OK9PermeRsjdKgso4K1VA%3D»/lib/customisation.nix:416:11:
          415|         // {
          416|           drvPath =
             |           ^
          417|             assert condition;

       … while calling the 'derivationStrict' builtin
         at «nix-internal»/derivation-internal.nix:37:12:
           36|
           37|   strict = derivationStrict drvAttrs;
             |            ^
           38|

       … while evaluating the option `driverConfiguration.vlans':

       … while evaluating definitions from `/nix/store/b5yz03mfyd67drnilplad1drbxbkap1w-source/nixos/lib/testing/driver-configuration.nix':

       … while evaluating the option `nodes.machine.networking.interfaces':

       … while evaluating definitions from `/nix/store/b5yz03mfyd67drnilplad1drbxbkap1w-source/nixos/modules/hardware/facter/networking':

       … while evaluating the option `nodes.machine.hardware.facter.enable':

       … while evaluating the option `nodes.machine.hardware.facter.report':

       … while evaluating the option `nodes.machine.hardware.facter.reportPath':

       … while evaluating definitions from `/nix/store/g0g49772apda62b5696bzbxjqv4alsmq-source/nixosModules/clanCore/nixos-facter.nix':

       (stack trace truncated; use '--show-trace' to show the full, detailed trace)

       error: Cannot build '/nix/store/f8dhid1g8f4xyrk2j26mxk00b1y1ad13-merged-test-dir-nixos-test-password-store-mounts.drv'.
       Reason: 1 dependency failed.
       Output paths:
         /nix/store/7z7p2lidw3fvpbqf15h7xr7p03g33jjz-merged-test-dir-nixos-test-password-store-mounts
failed eval checks.aarch64-linux.packages —
error: … while evaluating the attribute 'drvPath' at «https://releases.nixos.org/nixpkgs/nixpkgs-26.11pre1078010.b6c98e9e6633/nixexprs.tar.xz?na …
error:
       … while evaluating the attribute 'drvPath'
         at «https://releases.nixos.org/nixpkgs/nixpkgs-26.11pre1078010.b6c98e9e6633/nixexprs.tar.xz?narHash=sha256-wQZif6Lyrg1IDl8k68Gwa3OK9PermeRsjdKgso4K1VA%3D»/lib/customisation.nix:416:11:
          415|         // {
          416|           drvPath =
             |           ^
          417|             assert condition;

       … while calling the 'derivationStrict' builtin
         at «nix-internal»/derivation-internal.nix:37:12:
           36|
           37|   strict = derivationStrict drvAttrs;
             |            ^
           38|

       … while evaluating the option `driverConfiguration.vlans':

       … while evaluating definitions from `/nix/store/b5yz03mfyd67drnilplad1drbxbkap1w-source/nixos/lib/testing/driver-configuration.nix':

       … while evaluating the option `containers.server.networking.interfaces':

       … while evaluating definitions from `/nix/store/b5yz03mfyd67drnilplad1drbxbkap1w-source/nixos/modules/hardware/facter/networking':

       … while evaluating the option `containers.server.hardware.facter.enable':

       … while evaluating the option `containers.server.hardware.facter.report':

       … while evaluating the option `containers.server.hardware.facter.reportPath':

       … while evaluating definitions from `/nix/store/g0g49772apda62b5696bzbxjqv4alsmq-source/nixosModules/clanCore/nixos-facter.nix':

       (stack trace truncated; use '--show-trace' to show the full, detailed trace)

       error: Cannot build '/nix/store/520mx12zld0j5ja9jdvr05lg26zh7xwi-merged-test-dir-packages.drv'.
       Reason: 1 dependency failed.
       Output paths:
         /nix/store/28vmfx1hjzh0g8g6s2vamb1wwa0c4mwk-merged-test-dir-packages
failed eval checks.aarch64-linux.postgresql —
error: … while evaluating the attribute 'drvPath' at «https://releases.nixos.org/nixpkgs/nixpkgs-26.11pre1078010.b6c98e9e6633/nixexprs.tar.xz?na …
error:
       … while evaluating the attribute 'drvPath'
         at «https://releases.nixos.org/nixpkgs/nixpkgs-26.11pre1078010.b6c98e9e6633/nixexprs.tar.xz?narHash=sha256-wQZif6Lyrg1IDl8k68Gwa3OK9PermeRsjdKgso4K1VA%3D»/lib/customisation.nix:416:11:
          415|         // {
          416|           drvPath =
             |           ^
          417|             assert condition;

       … while calling the 'derivationStrict' builtin
         at «nix-internal»/derivation-internal.nix:37:12:
           36|
           37|   strict = derivationStrict drvAttrs;
             |            ^
           38|

       … while evaluating the option `driverConfiguration.vlans':

       … while evaluating definitions from `/nix/store/b5yz03mfyd67drnilplad1drbxbkap1w-source/nixos/lib/testing/driver-configuration.nix':

       … while evaluating the option `containers.machine.networking.interfaces':

       … while evaluating definitions from `/nix/store/b5yz03mfyd67drnilplad1drbxbkap1w-source/nixos/modules/hardware/facter/networking':

       … while evaluating the option `containers.machine.hardware.facter.enable':

       … while evaluating the option `containers.machine.hardware.facter.report':

       … while evaluating the option `containers.machine.hardware.facter.reportPath':

       … while evaluating definitions from `/nix/store/g0g49772apda62b5696bzbxjqv4alsmq-source/nixosModules/clanCore/nixos-facter.nix':

       (stack trace truncated; use '--show-trace' to show the full, detailed trace)

       error: Cannot build '/nix/store/za03x3iaia4gkjx2r4s7hhw380cgyhif-merged-test-dir-service-postgresql.drv'.
       Reason: 1 dependency failed.
       Output paths:
         /nix/store/2iqf0d0hz72f6x81s1a2mc9dvnhgiw5p-merged-test-dir-service-postgresql
failed eval checks.aarch64-linux.state-version —
error: … while evaluating the attribute 'drvPath' at «https://releases.nixos.org/nixpkgs/nixpkgs-26.11pre1078010.b6c98e9e6633/nixexprs.tar.xz?na …
error:
       … while evaluating the attribute 'drvPath'
         at «https://releases.nixos.org/nixpkgs/nixpkgs-26.11pre1078010.b6c98e9e6633/nixexprs.tar.xz?narHash=sha256-wQZif6Lyrg1IDl8k68Gwa3OK9PermeRsjdKgso4K1VA%3D»/lib/customisation.nix:416:11:
          415|         // {
          416|           drvPath =
             |           ^
          417|             assert condition;

       … while calling the 'derivationStrict' builtin
         at «nix-internal»/derivation-internal.nix:37:12:
           36|
           37|   strict = derivationStrict drvAttrs;
             |            ^
           38|

       … while evaluating the option `driverConfiguration.vlans':

       … while evaluating definitions from `/nix/store/b5yz03mfyd67drnilplad1drbxbkap1w-source/nixos/lib/testing/driver-configuration.nix':

       … while evaluating the option `containers.server.networking.interfaces':

       … while evaluating definitions from `/nix/store/b5yz03mfyd67drnilplad1drbxbkap1w-source/nixos/modules/hardware/facter/networking':

       … while evaluating the option `containers.server.hardware.facter.enable':

       … while evaluating the option `containers.server.hardware.facter.report':

       … while evaluating the option `containers.server.hardware.facter.reportPath':

       … while evaluating definitions from `/nix/store/g0g49772apda62b5696bzbxjqv4alsmq-source/nixosModules/clanCore/nixos-facter.nix':

       (stack trace truncated; use '--show-trace' to show the full, detailed trace)

       error: Cannot build '/nix/store/yb9y787327fibhbqin9m7c4b8iywlbpc-merged-test-dir-service-state-version.drv'.
       Reason: 1 dependency failed.
       Output paths:
         /nix/store/nk9rm7knk8rngd5kpqdp9qj7hcrqqldj-merged-test-dir-service-state-version
failed checks.aarch64-linux.treefmt 3h 0m
setup: this derivation will be built:
setup:
this derivation will be built:
failed eval checks.aarch64-linux.trusted-nix-caches —
error: … while evaluating the attribute 'drvPath' at «https://releases.nixos.org/nixpkgs/nixpkgs-26.11pre1078010.b6c98e9e6633/nixexprs.tar.xz?na …
error:
       … while evaluating the attribute 'drvPath'
         at «https://releases.nixos.org/nixpkgs/nixpkgs-26.11pre1078010.b6c98e9e6633/nixexprs.tar.xz?narHash=sha256-wQZif6Lyrg1IDl8k68Gwa3OK9PermeRsjdKgso4K1VA%3D»/lib/customisation.nix:416:11:
          415|         // {
          416|           drvPath =
             |           ^
          417|             assert condition;

       … while calling the 'derivationStrict' builtin
         at «nix-internal»/derivation-internal.nix:37:12:
           36|
           37|   strict = derivationStrict drvAttrs;
             |            ^
           38|

       … while evaluating the option `driverConfiguration.vlans':

       … while evaluating definitions from `/nix/store/b5yz03mfyd67drnilplad1drbxbkap1w-source/nixos/lib/testing/driver-configuration.nix':

       … while evaluating the option `containers.server.networking.interfaces':

       … while evaluating definitions from `/nix/store/b5yz03mfyd67drnilplad1drbxbkap1w-source/nixos/modules/hardware/facter/networking':

       … while evaluating the option `containers.server.hardware.facter.enable':

       … while evaluating the option `containers.server.hardware.facter.report':

       … while evaluating the option `containers.server.hardware.facter.reportPath':

       … while evaluating definitions from `/nix/store/g0g49772apda62b5696bzbxjqv4alsmq-source/nixosModules/clanCore/nixos-facter.nix':

       (stack trace truncated; use '--show-trace' to show the full, detailed trace)

       error: Cannot build '/nix/store/w4dg2xppmnynkhfpgibi5dfisgf1yyab-merged-test-dir-trusted-nix-caches.drv'.
       Reason: 1 dependency failed.
       Output paths:
         /nix/store/wjyjng3hnwl4ckhpmc6rji40dmxz7j9x-merged-test-dir-trusted-nix-caches
failed eval checks.aarch64-linux.zerotier-multi-instance —
error: … while evaluating the attribute 'drvPath' at «https://releases.nixos.org/nixpkgs/nixpkgs-26.11pre1078010.b6c98e9e6633/nixexprs.tar.xz?na …
error:
       … while evaluating the attribute 'drvPath'
         at «https://releases.nixos.org/nixpkgs/nixpkgs-26.11pre1078010.b6c98e9e6633/nixexprs.tar.xz?narHash=sha256-wQZif6Lyrg1IDl8k68Gwa3OK9PermeRsjdKgso4K1VA%3D»/lib/customisation.nix:416:11:
          415|         // {
          416|           drvPath =
             |           ^
          417|             assert condition;

       … while calling the 'derivationStrict' builtin
         at «nix-internal»/derivation-internal.nix:37:12:
           36|
           37|   strict = derivationStrict drvAttrs;
             |            ^
           38|

       … while evaluating the option `driverConfiguration.vlans':

       … while evaluating definitions from `/nix/store/b5yz03mfyd67drnilplad1drbxbkap1w-source/nixos/lib/testing/driver-configuration.nix':

       … while evaluating the option `nodes.alpha.networking.interfaces':

       … while evaluating definitions from `/nix/store/b5yz03mfyd67drnilplad1drbxbkap1w-source/nixos/modules/hardware/facter/networking':

       … while evaluating the option `nodes.alpha.hardware.facter.enable':

       … while evaluating the option `nodes.alpha.hardware.facter.report':

       … while evaluating the option `nodes.alpha.hardware.facter.reportPath':

       … while evaluating definitions from `/nix/store/g0g49772apda62b5696bzbxjqv4alsmq-source/nixosModules/clanCore/nixos-facter.nix':

       (stack trace truncated; use '--show-trace' to show the full, detailed trace)

       error: Cannot build '/nix/store/n5vdssnsa6vrczhzwcfkjws152xaj56j-merged-test-dir-zerotier-multi-instance.drv'.
       Reason: 1 dependency failed.
       Output paths:
         /nix/store/80d1ci4qhghb4kgppg9cpbaw7f4dm1y1-merged-test-dir-zerotier-multi-instance
failed checks.x86_64-linux.borgbackup 2h 59m
setup: don't know how to build these paths: /nix/store/nd6hpy09qrw6wk5x1mk6lc3y3gld3j4b-container-test-run-borgbackup.drv warning: ignoring the client-specifi …
setup:
don't know how to build these paths:
  /nix/store/nd6hpy09qrw6wk5x1mk6lc3y3gld3j4b-container-test-run-borgbackup.drv
warning: ignoring the client-specified setting 'store', because it is a restricted setting and you are not a trusted user
error: gRPC QueryValidPaths on 'nix-store.geninf.io:50051' failed: error: unable to download 'https://cache.geninf.io/8l5hbzsraq2ldp07kkqrfcr4hxyylm7r.narinfo': HTTP error 503

              response body:

              <?xml version="1.0" encoding="UTF-8" standalone="yes"?>
              <Error>
                  <Code>SlowDown</Code>
                  <Message>Your account has made too many requests; try again later.</Message>
              </Error>
failed checks.x86_64-linux.clan-pytest-with-core 3h 0m
setup: don't know how to build these paths: /nix/store/alsnd0417sjyzvm5djhn1955mi6990cj-clan-pytest-with-core.drv warning: ignoring the client-specified setti …
setup:
don't know how to build these paths:
  /nix/store/alsnd0417sjyzvm5djhn1955mi6990cj-clan-pytest-with-core.drv
warning: ignoring the client-specified setting 'store', because it is a restricted setting and you are not a trusted user
failed checks.x86_64-linux.clan-pytest-without-core 2h 59m
setup: /nix/store/nx67sdy9ljl1b8z06sbz4adzng39msdd-python3-3.14.7-env.drv /nix/store/sakyhgcjvdn4v7pvcsimlx086hykpkn4-clan-cli-source.drv /nix/store/rrwhf …
setup:
  /nix/store/nx67sdy9ljl1b8z06sbz4adzng39msdd-python3-3.14.7-env.drv
  /nix/store/sakyhgcjvdn4v7pvcsimlx086hykpkn4-clan-cli-source.drv
  /nix/store/rrwhffg7yl0hay05zq5rh8xapmkh7wwv-clan-pytest-without-core.drv
these 2 paths will be fetched (0.0 KiB download, 4.0 KiB unpacked):
  /nix/store/3p6870ii9wqq702p014wpvv5sbv2vbyn-closure-info
  /nix/store/np3sm8abd7g9rbz6pqwhc3szz2yj5g92-closure-info
warning: ignoring the client-specified setting 'store', because it is a restricted setting and you are not a trusted user
error: gRPC QueryValidPaths on 'nix-store.geninf.io:50051' failed: error: unable to download 'https://cache.clan.lol/hvj0ynkcc85m95lqx0nyc0cfzxk3jcgk.narinfo': HTTP error 503

              response body:

              <?xml version="1.0" encoding="UTF-8" standalone="yes"?>
              <Error>
                  <Code>SlowDown</Code>
                  <Message>Your account has made too many requests; try again later.</Message>
              </Error>
failed checks.x86_64-linux.clan-site-lint 3h 0m
setup: don't know how to build these paths: /nix/store/zzxl2g972q4xgdkaz1d813k938qsiv1f-clan-site-lint.drv warning: ignoring the client-specified setting 'sto …
setup:
don't know how to build these paths:
  /nix/store/zzxl2g972q4xgdkaz1d813k938qsiv1f-clan-site-lint.drv
warning: ignoring the client-specified setting 'store', because it is a restricted setting and you are not a trusted user
failed checks.x86_64-linux.clan-test-iso 3h 0m
setup: don't know how to build these paths: /nix/store/yb8n4xj2n9k8d3v1844jpynranibjv9y--test-run-clan-test-iso.drv warning: ignoring the client-specified set …
setup:
don't know how to build these paths:
  /nix/store/yb8n4xj2n9k8d3v1844jpynranibjv9y--test-run-clan-test-iso.drv
warning: ignoring the client-specified setting 'store', because it is a restricted setting and you are not a trusted user
failed checks.x86_64-linux.clan-test-update 3h 0m
setup: don't know how to build these paths: /nix/store/zmk6snpxqzznnl7bsb1x5n3303qzln1z-vm-test-run-clan-test-update.drv warning: ignoring the client-specifie …
setup:
don't know how to build these paths:
  /nix/store/zmk6snpxqzznnl7bsb1x5n3303qzln1z-vm-test-run-clan-test-update.drv
warning: ignoring the client-specified setting 'store', because it is a restricted setting and you are not a trusted user
kjqp02qsqiz0akylv88y01v9zfa6wjad-offline-flake-for-test-clan-test-update.drv: gi-build-x86-02: not scheduled here: kjqp02qsqiz0akylv88y01v9zfa6wjad-offline-flake-for-test-clan-test-update.drv, asking the scheduler again
failed checks.x86_64-linux.devshell 3h 0m
setup: don't know how to build these paths: /nix/store/ql3gmjr3wdid7ip2676v54kvd9r9ar4z-check-devshell-not-depends-on-clan-cli.drv warning: ignoring the clien …
setup:
don't know how to build these paths:
  /nix/store/ql3gmjr3wdid7ip2676v54kvd9r9ar4z-check-devshell-not-depends-on-clan-cli.drv
warning: ignoring the client-specified setting 'store', because it is a restricted setting and you are not a trusted user
failed checks.x86_64-linux.devShell-clan-site 3h 0m
setup: these 5 derivations will be built:
setup:
these 5 derivations will be built:
failed checks.x86_64-linux.devShell-docs 3h 0m
setup: /nix/store/vm7ypq06bm28wcjfxn7rk0wa6iidpgly-render-options.drv /nix/store/p3qkxcw3akvzk947r6sw8q8k2crjsnzd-rendered.drv /nix/store/g1gfnnbn1y3ww9za …
setup:
  /nix/store/vm7ypq06bm28wcjfxn7rk0wa6iidpgly-render-options.drv
  /nix/store/p3qkxcw3akvzk947r6sw8q8k2crjsnzd-rendered.drv
  /nix/store/g1gfnnbn1y3ww9zakf43mnxq795mvnsv-generated-docs.drv
  /nix/store/s0ifx318m1zx91yiq54fmkj8k4bi9hf2-nix-shell.drv
this path will be fetched (0.0 KiB download, 1.1 MiB unpacked):
  /nix/store/bdsg4542k0x36k13i0mm9yi9qchihmh8-clan-cli-source
warning: ignoring the client-specified setting 'store', because it is a restricted setting and you are not a trusted user
aw2fa8n15smr9v26aiw92gqwz37k2yif-clan-cli.drv: gi-build-x86-02: not scheduled here: aw2fa8n15smr9v26aiw92gqwz37k2yif-clan-cli.drv, asking the scheduler again
failed checks.x86_64-linux.dm-dns 3h 0m
setup: don't know how to build these paths: /nix/store/dsvp4jig350vljncxa498384fjz3kil1-container-test-run-dm-dns.drv warning: ignoring the client-specified s …
setup:
don't know how to build these paths:
  /nix/store/dsvp4jig350vljncxa498384fjz3kil1-container-test-run-dm-dns.drv
warning: ignoring the client-specified setting 'store', because it is a restricted setting and you are not a trusted user
failed checks.x86_64-linux.eval-tests 21s
setup: don't know how to build these paths: /nix/store/yk95iqzgcn1s1n5gz58g5bv0srqbhpks-eval-tests-x86_64-linux.drv warning: ignoring the client-specified set …
setup:
don't know how to build these paths:
  /nix/store/yk95iqzgcn1s1n5gz58g5bv0srqbhpks-eval-tests-x86_64-linux.drv
warning: ignoring the client-specified setting 'store', because it is a restricted setting and you are not a trusted user
error: gRPC QueryValidPaths on 'nix-store.geninf.io:50051' failed: error: unable to download 'https://cache.clan.lol/g7m1k5vw2zdnvdpzvd3kks5h7wc9msb4.narinfo': HTTP error 503

              response body:

              <?xml version="1.0" encoding="UTF-8" standalone="yes"?>
              <Error>
                  <Code>SlowDown</Code>
                  <Message>Your account has made too many requests; try again later.</Message>
              </Error>
failed checks.x86_64-linux.nixos-documentation 3h 1m
setup: don't know how to build these paths: /nix/store/b3b3f2frv84x09bz66m5h3xb7nm9nz1q-nixos-system-test-documentation-26.11.20260922.b6c98e9.drv warning: ig …
setup:
don't know how to build these paths:
  /nix/store/b3b3f2frv84x09bz66m5h3xb7nm9nz1q-nixos-system-test-documentation-26.11.20260922.b6c98e9.drv
warning: ignoring the client-specified setting 'store', because it is a restricted setting and you are not a trusted user
failed checks.x86_64-linux.nixos-test-flash 3h 0m
setup: don't know how to build these paths: /nix/store/vrisriiai2z9d10pifva7c8vnc6a0nn4-vm-test-run-flash.drv warning: ignoring the client-specified setting ' …
setup:
don't know how to build these paths:
  /nix/store/vrisriiai2z9d10pifva7c8vnc6a0nn4-vm-test-run-flash.drv
warning: ignoring the client-specified setting 'store', because it is a restricted setting and you are not a trusted user
c1yammf1w9inyxjrl3j97kwq2hd73c04-flash-test-flake-x86_64-linux.drv: gi-build-x86-02: not scheduled here: c1yammf1w9inyxjrl3j97kwq2hd73c04-flash-test-flake-x86_64-linux.drv, asking the scheduler again
9lrb5w24fxs16c7l66g4b9a8b4c3fday-test-script.drv: error: gRPC QueryValidPaths on 'nix-store.geninf.io:50051' failed: error: substituter 'https://cache.clan.lol' is disabled
mhh0l4f1y42i8ym150rsrl1xv10kfwpb-string-references.drv: error: gRPC QueryValidPaths on 'nix-store.geninf.io:50051' failed: error: substituter 'https://cache.clan.lol' is disabled
s4xsbcn0x0pmqms9ixalbld0yavy1r5b-closure-info.drv: error: gRPC QueryValidPaths on 'nix-store.geninf.io:50051' failed: error: substituter 'https://cache.clan.lol' is disabled
failed checks.x86_64-linux.nixos-test-installation 3h 0m
setup: these 8 derivations will be built:
setup:
these 8 derivations will be built:
failed checks.x86_64-linux.nixos-test-installation-age 3h 0m
setup: don't know how to build these paths: /nix/store/3k1qrr1irjijamhaqbma5wsn6cxh34k2-vm-test-run-installation.drv warning: ignoring the client-specified se …
setup:
don't know how to build these paths:
  /nix/store/3k1qrr1irjijamhaqbma5wsn6cxh34k2-vm-test-run-installation.drv
warning: ignoring the client-specified setting 'store', because it is a restricted setting and you are not a trusted user
failed checks.x86_64-linux.nixos-test-installation-password-store 3h 0m
setup: don't know how to build these paths: /nix/store/vqc6rrmb3vq7jyd989nb7n7viiav8nk5-vm-test-run-installation.drv warning: ignoring the client-specified se …
setup:
don't know how to build these paths:
  /nix/store/vqc6rrmb3vq7jyd989nb7n7viiav8nk5-vm-test-run-installation.drv
warning: ignoring the client-specified setting 'store', because it is a restricted setting and you are not a trusted user
failed checks.x86_64-linux.nixos-test-update-hardware-configuration 3h 0m
setup: don't know how to build these paths: /nix/store/91asbs4aq3kqn86mx7il29km8085asfl-vm-test-run-update-hardware-configuration.drv warning: ignoring the cl …
setup:
don't know how to build these paths:
  /nix/store/91asbs4aq3kqn86mx7il29km8085asfl-vm-test-run-update-hardware-configuration.drv
warning: ignoring the client-specified setting 'store', because it is a restricted setting and you are not a trusted user
failed checks.x86_64-linux.service-dummy-test-from-flake 3h 0m
setup: don't know how to build these paths: /nix/store/hnqwp82mif480rf8a249mc8wbgigcasm-container-test-run-service-dummy-test-from-flake.drv warning: ignoring …
setup:
don't know how to build these paths:
  /nix/store/hnqwp82mif480rf8a249mc8wbgigcasm-container-test-run-service-dummy-test-from-flake.drv
warning: ignoring the client-specified setting 'store', because it is a restricted setting and you are not a trusted user
failed checks.x86_64-linux.treefmt 3h 1m
setup: this derivation will be built: /nix/store/1hamxhv1vyhdzs6jzgcsbd4lfssbnm1b-treefmt-check.drv warning: ignoring the client-specified setting 'store', be …
setup:
this derivation will be built:
  /nix/store/1hamxhv1vyhdzs6jzgcsbd4lfssbnm1b-treefmt-check.drv
warning: ignoring the client-specified setting 'store', because it is a restricted setting and you are not a trusted user
8 succeeded ⚠ 1
succeeded attributes
status attribute duration
succeeded checks.aarch64-linux.all-packages
  • stdenv.isDarwin is deprecated, use stdenv.hostPlatform.isDarwin instead
4m 58s
succeeded checks.aarch64-darwin.treefmt 1m 28s
succeeded checks.aarch64-linux.borgbackup 3m 35s
succeeded checks.aarch64-linux.clan-pytest-without-core 3h 0m
succeeded checks.aarch64-linux.clan-site-lint 5m 0s
succeeded checks.aarch64-linux.eval-tests 1m 44s
succeeded checks.aarch64-linux.service-dummy-test-from-flake 2m 35s
succeeded checks.x86_64-linux.machine-id 1m 41s
98 already built
skipped attributes
status attribute duration
loading…