nixbot

builds

clan/clan-core build #767 failed

branch main · PR #8136 · commit f3373d3b1b · · took 3h 6m · eval 1m 30s

eval warnings 19 kinds · 66 occurrences
  • error Cannot build '/nix/store/…-generator-state-version.drv'. ×9
  • error Cannot build '/nix/store/…-test-vars-generated.drv'. ×11
  • error ×11
  • error Cannot build '/nix/store/…-merged-test-dir-localbackup.drv'. ×1
  • error Cannot build '/nix/store/…-merged-test-dir-hello-service.drv'. ×1
  • error Cannot build '/nix/store/…-generator-machine-id.drv'. ×1
  • error Cannot build '/nix/store/…-merged-test-dir-kde.drv'. ×1
  • error Cannot build '/nix/store/…-merged-test-dir-service-machine-id.drv'. ×1
  • error Cannot build '/nix/store/…-generator-grafana-admin.drv'. ×1
  • error Cannot build '/nix/store/…-merged-test-dir-monitoring.drv'. ×1
  • error Cannot build '/nix/store/…-merged-test-dir-nixos-test-password-store-mounts.drv'. ×1
  • error Cannot build '/nix/store/…-merged-test-dir-packages.drv'. ×1
  • error Cannot build '/nix/store/…-merged-test-dir-service-postgresql.drv'. ×1
  • error Cannot build '/nix/store/…-merged-test-dir-service-state-version.drv'. ×1
  • error Cannot build '/nix/store/…-merged-test-dir-trusted-nix-caches.drv'. ×1
  • error Cannot build '/nix/store/…-merged-test-dir-zerotier-multi-instance.drv'. ×1
  • warn stdenv.isDarwin is deprecated, use stdenv.hostPlatform.isDarwin instead ×2
  • warn file 'nar/0j4bang2lixa9a7ydxls6ikk2pk1lk191idqafyya1q2z8xqf6lv.nar.zst' does not exist in binary cache 'https://cache.clan.lol/…' ×1
  • warn unable to download 'https://cache.clan.lol/…': HTTP error 503 ×19

75 failed ⚠ 2
failed attributes
status attribute duration
failed checks.aarch64-linux.all-packages
  • stdenv.isDarwin is deprecated, use stdenv.hostPlatform.isDarwin instead
3h 0m
setup: these 18 derivations will be built:
setup:
these 18 derivations will be built:
failed checks.x86_64-linux.all-packages
  • stdenv.isDarwin is deprecated, use stdenv.hostPlatform.isDarwin instead
3h 0m
setup: these 15 derivations will be built:
setup:
these 15 derivations will be built:
failed checks.aarch64-darwin.all-packages 3h 0m
setup: don't know how to build these paths: /nix/store/m8y8j2wvw33dnmzpmrr3wwscdaxh9pfn-all-packages.drv warning: ignoring the client-specified setting 'store …
setup:
don't know how to build these paths:
  /nix/store/m8y8j2wvw33dnmzpmrr3wwscdaxh9pfn-all-packages.drv
warning: ignoring the client-specified setting 'store', because it is a restricted setting and you are not a trusted user
failed checks.aarch64-darwin.clan-pytest-with-core 2m 33s
setup: don't know how to build these paths: /nix/store/ysgpkg5a3gss9z5918pp1k9bshbxd4q2-clan-pytest-with-core.drv warning: ignoring the client-specified setti …
setup:
don't know how to build these paths:
  /nix/store/ysgpkg5a3gss9z5918pp1k9bshbxd4q2-clan-pytest-with-core.drv
warning: ignoring the client-specified setting 'store', because it is a restricted setting and you are not a trusted user
dnjlcw3j98yzfc2s0ymyf1c77lckiwrz-clan-runtime.drv: error: gRPC QueryValidPaths on 'nix-store.geninf.io:50051' failed: error: substituter 'https://cache.clan.lol' is disabled
kbgp85inx0jka6724x2p0d5zb0fi2xai-clan-core-flake.drv: error: gRPC QueryValidPaths on 'nix-store.geninf.io:50051' failed: error: substituter 'https://cache.clan.lol' is disabled
error: dependency '0h385vb1pz92l0lfv05kiqs201ppb7vg-clan-cli-source.drv' failed
failed checks.aarch64-darwin.clan-pytest-without-core 3h 0m
setup: don't know how to build these paths: /nix/store/y440y5gizcb5il7fc9n2kzyj3rp839jn-clan-pytest-without-core.drv warning: ignoring the client-specified se …
setup:
don't know how to build these paths:
  /nix/store/y440y5gizcb5il7fc9n2kzyj3rp839jn-clan-pytest-without-core.drv
warning: ignoring the client-specified setting 'store', because it is a restricted setting and you are not a trusted user
failed checks.aarch64-darwin.darwin-test-darwin-machine 3h 1m
setup: these 20 derivations will be built:
setup:
these 20 derivations will be built:
dependency failed checks.aarch64-darwin.devshell —
failed checks.aarch64-darwin.devShell-clan-cli 1m 28s
setup: don't know how to build these paths: /nix/store/a07yc1lzdrr9rl6msr51fid8zsp0hswx-clan-cli.drv warning: ignoring the client-specified setting 'store', b …
setup:
don't know how to build these paths:
  /nix/store/a07yc1lzdrr9rl6msr51fid8zsp0hswx-clan-cli.drv
warning: ignoring the client-specified setting 'store', because it is a restricted setting and you are not a trusted user
dnjlcw3j98yzfc2s0ymyf1c77lckiwrz-clan-runtime.drv: error: gRPC QueryValidPaths on 'nix-store.geninf.io:50051' failed: error: substituter 'https://cache.clan.lol' is disabled
error: dependency 'dnjlcw3j98yzfc2s0ymyf1c77lckiwrz-clan-runtime.drv' failed
failed checks.aarch64-darwin.devShell-clan-site 3h 0m
setup: don't know how to build these paths: /nix/store/y46jj2x9fm3s9s9p7ilqx9kmix048fyp-nix-shell.drv warning: ignoring the client-specified setting 'store', …
setup:
don't know how to build these paths:
  /nix/store/y46jj2x9fm3s9s9p7ilqx9kmix048fyp-nix-shell.drv
warning: ignoring the client-specified setting 'store', because it is a restricted setting and you are not a trusted user
failed checks.aarch64-darwin.devShell-default 4m 3s
setup: these 2 derivations will be built: /nix/store/7nbvc9vygiasyyhlaw52b3axl82nqkrh-clan.drv /nix/store/dnjlcw3j98yzfc2s0ymyf1c77lckiwrz-clan-runtime.drv …
setup:
these 2 derivations will be built:
  /nix/store/7nbvc9vygiasyyhlaw52b3axl82nqkrh-clan.drv
  /nix/store/dnjlcw3j98yzfc2s0ymyf1c77lckiwrz-clan-runtime.drv
warning: ignoring the client-specified setting 'store', because it is a restricted setting and you are not a trusted user
error: gRPC QueryValidPaths on 'nix-store.geninf.io:50051' failed: error: substituter 'https://cache.geninf.io' is disabled
failed checks.aarch64-darwin.devShell-inventory-schema 42s
setup: don't know how to build these paths: /nix/store/cd4bnhhf77hnriq9a1bc554qydawyhdp-clan-inventory-schema.drv warning: ignoring the client-specified setti …
setup:
don't know how to build these paths:
  /nix/store/cd4bnhhf77hnriq9a1bc554qydawyhdp-clan-inventory-schema.drv
warning: ignoring the client-specified setting 'store', because it is a restricted setting and you are not a trusted user
dnjlcw3j98yzfc2s0ymyf1c77lckiwrz-clan-runtime.drv: error: gRPC QueryValidPaths on 'nix-store.geninf.io:50051' failed: error: unable to download 'https://cache.clan.lol/9kj7xplg18izvf8mx4s7q5kzqpw6pcw4.narinfo': HTTP error 503

              response body:

              <?xml version="1.0" encoding="UTF-8" standalone="yes"?>
              <Error>
                  <Code>SlowDown</Code>
                  <Message>Your account has made too many requests; try again later.</Message>
              </Error>
error: dependency 'dnjlcw3j98yzfc2s0ymyf1c77lckiwrz-clan-runtime.drv' failed
failed checks.aarch64-darwin.eval-tests 3h 0m
setup: don't know how to build these paths: /nix/store/4wcyx1y6hhch7f7nyfi2hc3sklb00bf0-eval-tests-aarch64-darwin.drv warning: ignoring the client-specified s …
setup:
don't know how to build these paths:
  /nix/store/4wcyx1y6hhch7f7nyfi2hc3sklb00bf0-eval-tests-aarch64-darwin.drv
warning: ignoring the client-specified setting 'store', because it is a restricted setting and you are not a trusted user
failed checks.aarch64-darwin.nixos-flash-installer 2m 43s
setup: don't know how to build these paths: /nix/store/8dd2pl3abq1ns5x48ybbdlrg52y1lsij-nixos-system-flash-installer-26.11.20260924.34ca302.drv warning: ignor …
setup:
don't know how to build these paths:
  /nix/store/8dd2pl3abq1ns5x48ybbdlrg52y1lsij-nixos-system-flash-installer-26.11.20260924.34ca302.drv
warning: ignoring the client-specified setting 'store', because it is a restricted setting and you are not a trusted user
error: gRPC QueryValidPaths on 'nix-store.geninf.io:50051' failed: error: unable to download 'https://cache.geninf.io/jmy9npf8wd3bxc6amg5k5nbdaw9zan0d.narinfo': HTTP error 503

              response body:

              <?xml version="1.0" encoding="UTF-8" standalone="yes"?>
              <Error>
                  <Code>SlowDown</Code>
                  <Message>Your account has made too many requests; try again later.</Message>
              </Error>
failed checks.aarch64-linux.borgbackup 49s
setup: don't know how to build these paths: /nix/store/7wx894vww1vsrzs1h5r5c3cc548fsifd-container-test-run-borgbackup.drv warning: ignoring the client-specifi …
setup:
don't know how to build these paths:
  /nix/store/7wx894vww1vsrzs1h5r5c3cc548fsifd-container-test-run-borgbackup.drv
warning: ignoring the client-specified setting 'store', because it is a restricted setting and you are not a trusted user
hqi3qw6cva6bsh0iv4scpj3vrh6akq9a-clan-runtime.drv: error: gRPC QueryValidPaths on 'nix-store.geninf.io:50051' failed: error: substituter 'https://cache.clan.lol' is disabled
error: dependency 'v4xiqla4xbm2ylvh836phdpzmarl206j-nixos-test-driver-borgbackup.drv' failed
failed checks.aarch64-linux.certificates 31s
setup: don't know how to build these paths: /nix/store/d5y1j2r5j3isln4sm4v65w29z040smc1-container-test-run-certificates.drv warning: ignoring the client-speci …
setup:
don't know how to build these paths:
  /nix/store/d5y1j2r5j3isln4sm4v65w29z040smc1-container-test-run-certificates.drv
warning: ignoring the client-specified setting 'store', because it is a restricted setting and you are not a trusted user
error: gRPC QueryValidPaths on 'nix-store.geninf.io:50051' failed: error: unable to download 'https://cache.geninf.io/w1khh7czk4m59bmq574zhi88vn4w227l.narinfo': HTTP error 503

              response body:

              <?xml version="1.0" encoding="UTF-8" standalone="yes"?>
              <Error>
                  <Code>SlowDown</Code>
                  <Message>Your account has made too many requests; try again later.</Message>
              </Error>
failed checks.aarch64-linux.clan-deps 1m 53s
setup: don't know how to build these paths: /nix/store/26ag2mjjhfq2v6hwv9w0zmxn1fdbsnhr-clan-deps.drv warning: ignoring the client-specified setting 'store', …
setup:
don't know how to build these paths:
  /nix/store/26ag2mjjhfq2v6hwv9w0zmxn1fdbsnhr-clan-deps.drv
warning: ignoring the client-specified setting 'store', because it is a restricted setting and you are not a trusted user
error: gRPC QueryValidPaths on 'nix-store.geninf.io:50051' failed: error: unable to download 'https://cache.geninf.io/6q5haqavia336wdlfdsgshf4b3y9f6zs.narinfo': HTTP error 503

              response body:

              <?xml version="1.0" encoding="UTF-8" standalone="yes"?>
              <Error>
                  <Code>SlowDown</Code>
                  <Message>Your account has made too many requests; try again later.</Message>
              </Error>
failed checks.aarch64-linux.clan-pytest-with-core 1m 12s
setup: don't know how to build these paths: /nix/store/f7bzc08nj89dq29zwx1aygmsr6vihzka-clan-pytest-with-core.drv warning: ignoring the client-specified setti …
setup:
don't know how to build these paths:
  /nix/store/f7bzc08nj89dq29zwx1aygmsr6vihzka-clan-pytest-with-core.drv
warning: ignoring the client-specified setting 'store', because it is a restricted setting and you are not a trusted user
wk3fx83ld7x615xb3sfm1aw3vcdn17y2-clan-core-flake.drv: error: gRPC QueryValidPaths on 'nix-store.geninf.io:50051' failed: error: substituter 'https://cache.clan.lol' is disabled
hqi3qw6cva6bsh0iv4scpj3vrh6akq9a-clan-runtime.drv: error: gRPC QueryValidPaths on 'nix-store.geninf.io:50051' failed: error: substituter 'https://cache.clan.lol' is disabled
error: dependency 'wk3fx83ld7x615xb3sfm1aw3vcdn17y2-clan-core-flake.drv' failed
failed checks.aarch64-linux.clan-pytest-without-core 56s
setup: don't know how to build these paths: /nix/store/9qf62407kscl3y861pgy2pw2vj97kxr4-clan-pytest-without-core.drv warning: ignoring the client-specified se …
setup:
don't know how to build these paths:
  /nix/store/9qf62407kscl3y861pgy2pw2vj97kxr4-clan-pytest-without-core.drv
warning: ignoring the client-specified setting 'store', because it is a restricted setting and you are not a trusted user
hqi3qw6cva6bsh0iv4scpj3vrh6akq9a-clan-runtime.drv: error: gRPC QueryValidPaths on 'nix-store.geninf.io:50051' failed: error: substituter 'https://cache.clan.lol' is disabled
error: dependency 'y9plz81a8lawgd3gf3cn6yi907i9vdqq-clan-cli-source.drv' failed
failed checks.aarch64-linux.clan-site-lint 42s
setup: don't know how to build these paths: /nix/store/9zv8dcpakgs4xrqp6qk8wndq4icpsf9f-clan-site-lint.drv warning: ignoring the client-specified setting 'sto …
setup:
don't know how to build these paths:
  /nix/store/9zv8dcpakgs4xrqp6qk8wndq4icpsf9f-clan-site-lint.drv
warning: ignoring the client-specified setting 'store', because it is a restricted setting and you are not a trusted user
hqi3qw6cva6bsh0iv4scpj3vrh6akq9a-clan-runtime.drv: error: gRPC QueryValidPaths on 'nix-store.geninf.io:50051' failed: error: unable to download 'https://cache.clan.lol/9kj7xplg18izvf8mx4s7q5kzqpw6pcw4.narinfo': HTTP error 503

              response body:

              <?xml version="1.0" encoding="UTF-8" standalone="yes"?>
              <Error>
                  <Code>SlowDown</Code>
                  <Message>Your account has made too many requests; try again later.</Message>
              </Error>
error: dependency '4h9768sjxlyllfk7zcbkidrrj286kv8b-generated-docs.drv' failed
failed checks.aarch64-linux.clan-test-iso 1m 15s
setup: don't know how to build these paths: /nix/store/79d5zf89n6pi60pj3f66j3wh0v4nldah--test-run-clan-test-iso.drv warning: ignoring the client-specified set …
setup:
don't know how to build these paths:
  /nix/store/79d5zf89n6pi60pj3f66j3wh0v4nldah--test-run-clan-test-iso.drv
warning: ignoring the client-specified setting 'store', because it is a restricted setting and you are not a trusted user
error: gRPC QueryValidPaths on 'nix-store.geninf.io:50051' failed: error: unable to download 'https://cache.clan.lol/c7sa0ix4qa2pb4p9j6m027wwwka3lasn.narinfo': HTTP error 503

              response body:

              <?xml version="1.0" encoding="UTF-8" standalone="yes"?>
              <Error>
                  <Code>SlowDown</Code>
                  <Message>Your account has made too many requests; try again later.</Message>
              </Error>
failed checks.aarch64-linux.darwin-test-darwin-machine 3h 0m
setup: these 21 derivations will be built:
setup:
these 21 derivations will be built:
failed checks.aarch64-linux.devShell-clan-cli 24s
setup: these 2 derivations will be built: /nix/store/hqi3qw6cva6bsh0iv4scpj3vrh6akq9a-clan-runtime.drv /nix/store/sggz0ijsh7cs757m5c1vvn1k1jmas9hj-clan-cli. …
setup:
these 2 derivations will be built:
  /nix/store/hqi3qw6cva6bsh0iv4scpj3vrh6akq9a-clan-runtime.drv
  /nix/store/sggz0ijsh7cs757m5c1vvn1k1jmas9hj-clan-cli.drv
this path will be fetched (2.2 MiB download, 6.2 MiB unpacked):
  /nix/store/7fa63ycjv8vrpy53jjr3ml5izi91b6hs-tor-0.4.9.13
warning: ignoring the client-specified setting 'store', because it is a restricted setting and you are not a trusted user
error: gRPC QueryValidPaths on 'nix-store.geninf.io:50051' failed: error: unable to download 'https://cache.clan.lol/w9fsl0jafkvk39r6k0m2bl7ijz410mjz.narinfo': HTTP error 503

              response body:

              <?xml version="1.0" encoding="UTF-8" standalone="yes"?>
              <Error>
                  <Code>SlowDown</Code>
                  <Message>Your account has made too many requests; try again later.</Message>
              </Error>
failed checks.aarch64-linux.devShell-clan-site 3h 0m
setup: don't know how to build these paths: /nix/store/34zagjch7kvvnl4g9j1454mkc6cwk1m7-nix-shell.drv warning: ignoring the client-specified setting 'store', …
setup:
don't know how to build these paths:
  /nix/store/34zagjch7kvvnl4g9j1454mkc6cwk1m7-nix-shell.drv
warning: ignoring the client-specified setting 'store', because it is a restricted setting and you are not a trusted user
failed checks.aarch64-linux.devShell-docs 3h 0m
setup: don't know how to build these paths: /nix/store/idl719am9yvlqby277xzv408qsa0zp2r-nix-shell.drv warning: ignoring the client-specified setting 'store', …
setup:
don't know how to build these paths:
  /nix/store/idl719am9yvlqby277xzv408qsa0zp2r-nix-shell.drv
warning: ignoring the client-specified setting 'store', because it is a restricted setting and you are not a trusted user
failed checks.aarch64-linux.devShell-inventory-schema 54s
setup: don't know how to build these paths: /nix/store/4f30wq9rqnccx9kjjnxnaa53zw9vrd49-clan-inventory-schema.drv warning: ignoring the client-specified setti …
setup:
don't know how to build these paths:
  /nix/store/4f30wq9rqnccx9kjjnxnaa53zw9vrd49-clan-inventory-schema.drv
warning: ignoring the client-specified setting 'store', because it is a restricted setting and you are not a trusted user
hqi3qw6cva6bsh0iv4scpj3vrh6akq9a-clan-runtime.drv: error: gRPC QueryValidPaths on 'nix-store.geninf.io:50051' failed: error: substituter 'https://cache.clan.lol' is disabled
error: dependency 'hqi3qw6cva6bsh0iv4scpj3vrh6akq9a-clan-runtime.drv' failed
failed checks.aarch64-linux.dyndns 1m 25s
setup: don't know how to build these paths: /nix/store/cg58l1ksh84vaiqn0i6q7n0qhg58bh7c-container-test-run-dyndns.drv warning: ignoring the client-specified s …
setup:
don't know how to build these paths:
  /nix/store/cg58l1ksh84vaiqn0i6q7n0qhg58bh7c-container-test-run-dyndns.drv
warning: ignoring the client-specified setting 'store', because it is a restricted setting and you are not a trusted user
v3i4ccqv8mjh5njn6hv35dylj3pw3nh2-system-units.drv: error: gRPC QueryValidPaths on 'nix-store.geninf.io:50051' failed: error: substituter 'https://cache.clan.lol' is disabled
error: dependency '11v0m1cvrn8jdvw1ccdwgy578hhijfl9-nixos-test-driver-dyndns.drv' failed
failed checks.aarch64-linux.eval-tests 3h 0m
setup: don't know how to build these paths: /nix/store/mjcnxzy9lidga70q1g24sdyzp31xmk99-eval-tests-aarch64-linux.drv warning: ignoring the client-specified se …
setup:
don't know how to build these paths:
  /nix/store/mjcnxzy9lidga70q1g24sdyzp31xmk99-eval-tests-aarch64-linux.drv
warning: ignoring the client-specified setting 'store', because it is a restricted setting and you are not a trusted user
jgnm2k4s3znr235wsz9f2x74wxvggdq2-evalCheck-eval-lib-distributedServices.drv: error: gRPC QueryValidPaths on 'nix-store.geninf.io:50051' failed: error: substituter 'https://cache.clan.lol' is disabled
insj5r6mzgzks1p0rmakglyxfv6qan9k-evalCheck-eval-tests-installer.drv: error: gRPC QueryValidPaths on 'nix-store.geninf.io:50051' failed: error: substituter 'https://cache.clan.lol' is disabled
2zvpwl3dz82n41fhxrb60xzyr512i48r-evalCheck-eval-lib-exports.drv: error: gRPC QueryValidPaths on 'nix-store.geninf.io:50051' failed: error: substituter 'https://cache.clan.lol' is disabled
failed eval checks.aarch64-linux.hello-service —
error: … while evaluating the attribute 'drvPath' at «https://releases.nixos.org/nixpkgs/nixpkgs-26.11pre1078969.34ca302a9572/nixexprs.tar.xz?na …
error:
       … while evaluating the attribute 'drvPath'
         at «https://releases.nixos.org/nixpkgs/nixpkgs-26.11pre1078969.34ca302a9572/nixexprs.tar.xz?narHash=sha256-nuO5fxDxKTeYxSEfD4mVB%2BXwzOy5qj9T2LxVc5vk4Bc%3D»/lib/customisation.nix:416:11:
          415|         // {
          416|           drvPath =
             |           ^
          417|             assert condition;

       … while calling the 'derivationStrict' builtin
         at «nix-internal»/derivation-internal.nix:37:12:
           36|
           37|   strict = derivationStrict drvAttrs;
             |            ^
           38|

       … while evaluating the option `driverConfiguration.vlans':

       … while evaluating definitions from `/nix/store/9kj7xplg18izvf8mx4s7q5kzqpw6pcw4-source/nixos/lib/testing/driver-configuration.nix':

       … while evaluating the option `containers.peer1.networking.interfaces':

       … while evaluating definitions from `/nix/store/9kj7xplg18izvf8mx4s7q5kzqpw6pcw4-source/nixos/modules/hardware/facter/networking':

       … while evaluating the option `containers.peer1.hardware.facter.enable':

       … while evaluating the option `containers.peer1.hardware.facter.report':

       … while evaluating the option `containers.peer1.hardware.facter.reportPath':

       … while evaluating definitions from `/nix/store/kym2ijnk6j3z1i8wa5zhl3ys58nfsnfc-source/nixosModules/clanCore/nixos-facter.nix':

       (stack trace truncated; use '--show-trace' to show the full, detailed trace)

       error: Cannot build '/nix/store/15a949chgf4lq3gg8afaacqw9ybf94y6-merged-test-dir-hello-service.drv'.
       Reason: 1 dependency failed.
       Output paths:
         /nix/store/j1mhsajhr3hykkmrb0h1pb4fphlz7zmk-merged-test-dir-hello-service
failed eval checks.aarch64-linux.kde —
error: … while evaluating the attribute 'drvPath' at «https://releases.nixos.org/nixpkgs/nixpkgs-26.11pre1078969.34ca302a9572/nixexprs.tar.xz?na …
error:
       … while evaluating the attribute 'drvPath'
         at «https://releases.nixos.org/nixpkgs/nixpkgs-26.11pre1078969.34ca302a9572/nixexprs.tar.xz?narHash=sha256-nuO5fxDxKTeYxSEfD4mVB%2BXwzOy5qj9T2LxVc5vk4Bc%3D»/lib/customisation.nix:416:11:
          415|         // {
          416|           drvPath =
             |           ^
          417|             assert condition;

       … while calling the 'derivationStrict' builtin
         at «nix-internal»/derivation-internal.nix:37:12:
           36|
           37|   strict = derivationStrict drvAttrs;
             |            ^
           38|

       … while evaluating the option `driverConfiguration.vlans':

       … while evaluating definitions from `/nix/store/9kj7xplg18izvf8mx4s7q5kzqpw6pcw4-source/nixos/lib/testing/driver-configuration.nix':

       … while evaluating the option `containers.client.networking.interfaces':

       … while evaluating definitions from `/nix/store/9kj7xplg18izvf8mx4s7q5kzqpw6pcw4-source/nixos/modules/hardware/facter/networking':

       … while evaluating the option `containers.client.hardware.facter.enable':

       … while evaluating the option `containers.client.hardware.facter.report':

       … while evaluating the option `containers.client.hardware.facter.reportPath':

       … while evaluating definitions from `/nix/store/kym2ijnk6j3z1i8wa5zhl3ys58nfsnfc-source/nixosModules/clanCore/nixos-facter.nix':

       (stack trace truncated; use '--show-trace' to show the full, detailed trace)

       error: Cannot build '/nix/store/nrphaicbbjvdczs7gxg3wxacxnzkd1gg-merged-test-dir-kde.drv'.
       Reason: 1 dependency failed.
       Output paths:
         /nix/store/adrkf0xgnr4l9839z3wkjvdhmd4c8gs1-merged-test-dir-kde
failed eval checks.aarch64-linux.localbackup —
error: … while evaluating the attribute 'drvPath' at «https://releases.nixos.org/nixpkgs/nixpkgs-26.11pre1078969.34ca302a9572/nixexprs.tar.xz?na …
error:
       … while evaluating the attribute 'drvPath'
         at «https://releases.nixos.org/nixpkgs/nixpkgs-26.11pre1078969.34ca302a9572/nixexprs.tar.xz?narHash=sha256-nuO5fxDxKTeYxSEfD4mVB%2BXwzOy5qj9T2LxVc5vk4Bc%3D»/lib/customisation.nix:416:11:
          415|         // {
          416|           drvPath =
             |           ^
          417|             assert condition;

       … while calling the 'derivationStrict' builtin
         at «nix-internal»/derivation-internal.nix:37:12:
           36|
           37|   strict = derivationStrict drvAttrs;
             |            ^
           38|

       … while evaluating the option `driverConfiguration.vlans':

       … while evaluating definitions from `/nix/store/9kj7xplg18izvf8mx4s7q5kzqpw6pcw4-source/nixos/lib/testing/driver-configuration.nix':

       … while evaluating the option `containers.machine.networking.interfaces':

       … while evaluating definitions from `/nix/store/9kj7xplg18izvf8mx4s7q5kzqpw6pcw4-source/nixos/modules/hardware/facter/networking':

       … while evaluating the option `containers.machine.hardware.facter.enable':

       … while evaluating the option `containers.machine.hardware.facter.report':

       … while evaluating the option `containers.machine.hardware.facter.reportPath':

       … while evaluating definitions from `/nix/store/kym2ijnk6j3z1i8wa5zhl3ys58nfsnfc-source/nixosModules/clanCore/nixos-facter.nix':

       (stack trace truncated; use '--show-trace' to show the full, detailed trace)

       error: Cannot build '/nix/store/3ggbd2jpcfxaba1yc91vvay0p59sl3x4-merged-test-dir-localbackup.drv'.
       Reason: 1 dependency failed.
       Output paths:
         /nix/store/z8h2byqv64ap17iz2cqb0q7175bj07r2-merged-test-dir-localbackup
failed eval checks.aarch64-linux.machine-id —
error: … while evaluating the attribute 'drvPath' at «https://releases.nixos.org/nixpkgs/nixpkgs-26.11pre1078969.34ca302a9572/nixexprs.tar.xz?na …
error:
       … while evaluating the attribute 'drvPath'
         at «https://releases.nixos.org/nixpkgs/nixpkgs-26.11pre1078969.34ca302a9572/nixexprs.tar.xz?narHash=sha256-nuO5fxDxKTeYxSEfD4mVB%2BXwzOy5qj9T2LxVc5vk4Bc%3D»/lib/customisation.nix:416:11:
          415|         // {
          416|           drvPath =
             |           ^
          417|             assert condition;

       … while calling the 'derivationStrict' builtin
         at «nix-internal»/derivation-internal.nix:37:12:
           36|
           37|   strict = derivationStrict drvAttrs;
             |            ^
           38|

       … while evaluating the option `driverConfiguration.vlans':

       … while evaluating definitions from `/nix/store/9kj7xplg18izvf8mx4s7q5kzqpw6pcw4-source/nixos/lib/testing/driver-configuration.nix':

       … while evaluating the option `containers.server.networking.interfaces':

       … while evaluating definitions from `/nix/store/9kj7xplg18izvf8mx4s7q5kzqpw6pcw4-source/nixos/modules/hardware/facter/networking':

       … while evaluating the option `containers.server.hardware.facter.enable':

       … while evaluating the option `containers.server.hardware.facter.report':

       … while evaluating the option `containers.server.hardware.facter.reportPath':

       … while evaluating definitions from `/nix/store/kym2ijnk6j3z1i8wa5zhl3ys58nfsnfc-source/nixosModules/clanCore/nixos-facter.nix':

       (stack trace truncated; use '--show-trace' to show the full, detailed trace)

       error: Cannot build '/nix/store/9b3gd9v67ffz0vd6h7hqk4nzy4dry8cb-merged-test-dir-service-machine-id.drv'.
       Reason: 1 dependency failed.
       Output paths:
         /nix/store/frx9ga4m7nbqry1ci6n9rxphd8b522al-merged-test-dir-service-machine-id
failed checks.aarch64-linux.matrix-synapse 9s
setup: don't know how to build these paths: /nix/store/2f7iv8mws6znha1dkswsnnyvlkjiixvj-container-test-run-matrix-synapse.drv warning: ignoring the client-spe …
setup:
don't know how to build these paths:
  /nix/store/2f7iv8mws6znha1dkswsnnyvlkjiixvj-container-test-run-matrix-synapse.drv
warning: ignoring the client-specified setting 'store', because it is a restricted setting and you are not a trusted user
error: gRPC QueryValidPaths on 'nix-store.geninf.io:50051' failed: error: unable to download 'https://cache.clan.lol/4w4y7m45q8i6h62n63pz73dik8k0pssn.narinfo': HTTP error 503

              response body:

              <?xml version="1.0" encoding="UTF-8" standalone="yes"?>
              <Error>
                  <Code>SlowDown</Code>
                  <Message>Your account has made too many requests; try again later.</Message>
              </Error>
failed eval checks.aarch64-linux.monitoring —
error: … while evaluating the attribute 'drvPath' at «https://releases.nixos.org/nixpkgs/nixpkgs-26.11pre1078969.34ca302a9572/nixexprs.tar.xz?na …
error:
       … while evaluating the attribute 'drvPath'
         at «https://releases.nixos.org/nixpkgs/nixpkgs-26.11pre1078969.34ca302a9572/nixexprs.tar.xz?narHash=sha256-nuO5fxDxKTeYxSEfD4mVB%2BXwzOy5qj9T2LxVc5vk4Bc%3D»/lib/customisation.nix:416:11:
          415|         // {
          416|           drvPath =
             |           ^
          417|             assert condition;

       … while calling the 'derivationStrict' builtin
         at «nix-internal»/derivation-internal.nix:37:12:
           36|
           37|   strict = derivationStrict drvAttrs;
             |            ^
           38|

       … while evaluating the option `driverConfiguration.vlans':

       … while evaluating definitions from `/nix/store/9kj7xplg18izvf8mx4s7q5kzqpw6pcw4-source/nixos/lib/testing/driver-configuration.nix':

       … while evaluating the option `containers.machine1.networking.interfaces':

       … while evaluating definitions from `/nix/store/9kj7xplg18izvf8mx4s7q5kzqpw6pcw4-source/nixos/modules/hardware/facter/networking':

       … while evaluating the option `containers.machine1.hardware.facter.enable':

       … while evaluating the option `containers.machine1.hardware.facter.report':

       … while evaluating the option `containers.machine1.hardware.facter.reportPath':

       … while evaluating definitions from `/nix/store/kym2ijnk6j3z1i8wa5zhl3ys58nfsnfc-source/nixosModules/clanCore/nixos-facter.nix':

       (stack trace truncated; use '--show-trace' to show the full, detailed trace)

       error: Cannot build '/nix/store/lla6dvjyh7fry2igkcq6sf5qlrh51gv6-merged-test-dir-monitoring.drv'.
       Reason: 1 dependency failed.
       Output paths:
         /nix/store/px1qlq8mwwdrqaw83smbzz892kj79xba-merged-test-dir-monitoring
failed checks.aarch64-linux.nixos-documentation 3h 0m
setup: don't know how to build these paths: /nix/store/z99ddlcvvpf2qagr3958b86gvg3j4i0w-nixos-system-test-documentation-26.11.20260924.34ca302.drv warning: ig …
setup:
don't know how to build these paths:
  /nix/store/z99ddlcvvpf2qagr3958b86gvg3j4i0w-nixos-system-test-documentation-26.11.20260924.34ca302.drv
warning: ignoring the client-specified setting 'store', because it is a restricted setting and you are not a trusted user
h92xl5rrwq0i9cp777s95l8103iswnkh-boot.json.drv: build-x86-01: not scheduled here: h92xl5rrwq0i9cp777s95l8103iswnkh-boot.json.drv, asking the scheduler again
pvc3b0viyl9vbi16jxd2w42gzq8s434n-issue.drv: build-x86-01: not scheduled here: pvc3b0viyl9vbi16jxd2w42gzq8s434n-issue.drv, asking the scheduler again
failed checks.aarch64-linux.nixos-flash-installer 3h 0m
setup: these 26 derivations will be built:
setup:
these 26 derivations will be built:
failed eval checks.aarch64-linux.nixos-test-password-store-mounts —
error: … while evaluating the attribute 'drvPath' at «https://releases.nixos.org/nixpkgs/nixpkgs-26.11pre1078969.34ca302a9572/nixexprs.tar.xz?na …
error:
       … while evaluating the attribute 'drvPath'
         at «https://releases.nixos.org/nixpkgs/nixpkgs-26.11pre1078969.34ca302a9572/nixexprs.tar.xz?narHash=sha256-nuO5fxDxKTeYxSEfD4mVB%2BXwzOy5qj9T2LxVc5vk4Bc%3D»/lib/customisation.nix:416:11:
          415|         // {
          416|           drvPath =
             |           ^
          417|             assert condition;

       … while calling the 'derivationStrict' builtin
         at «nix-internal»/derivation-internal.nix:37:12:
           36|
           37|   strict = derivationStrict drvAttrs;
             |            ^
           38|

       … while evaluating the option `driverConfiguration.vlans':

       … while evaluating definitions from `/nix/store/9kj7xplg18izvf8mx4s7q5kzqpw6pcw4-source/nixos/lib/testing/driver-configuration.nix':

       … while evaluating the option `nodes.machine.networking.interfaces':

       … while evaluating definitions from `/nix/store/9kj7xplg18izvf8mx4s7q5kzqpw6pcw4-source/nixos/modules/hardware/facter/networking':

       … while evaluating the option `nodes.machine.hardware.facter.enable':

       … while evaluating the option `nodes.machine.hardware.facter.report':

       … while evaluating the option `nodes.machine.hardware.facter.reportPath':

       … while evaluating definitions from `/nix/store/kym2ijnk6j3z1i8wa5zhl3ys58nfsnfc-source/nixosModules/clanCore/nixos-facter.nix':

       (stack trace truncated; use '--show-trace' to show the full, detailed trace)

       error: Cannot build '/nix/store/f8dhid1g8f4xyrk2j26mxk00b1y1ad13-merged-test-dir-nixos-test-password-store-mounts.drv'.
       Reason: 1 dependency failed.
       Output paths:
         /nix/store/7z7p2lidw3fvpbqf15h7xr7p03g33jjz-merged-test-dir-nixos-test-password-store-mounts
failed checks.aarch64-linux.nixos-test-wayland-proxy-virtwl 27s
setup: don't know how to build these paths: /nix/store/sfgbcycpan8cw74sqnilfv2004mxhi5h-vm-test-run-wayland-proxy-virtwl.drv warning: ignoring the client-spec …
setup:
don't know how to build these paths:
  /nix/store/sfgbcycpan8cw74sqnilfv2004mxhi5h-vm-test-run-wayland-proxy-virtwl.drv
warning: ignoring the client-specified setting 'store', because it is a restricted setting and you are not a trusted user
error: gRPC QueryValidPaths on 'nix-store.geninf.io:50051' failed: error: unable to download 'https://cache.clan.lol/dni95d04zy9fmmnk3zym9s5hm8sq0cj6.narinfo': HTTP error 503

              response body:

              <?xml version="1.0" encoding="UTF-8" standalone="yes"?>
              <Error>
                  <Code>SlowDown</Code>
                  <Message>Your account has made too many requests; try again later.</Message>
              </Error>
failed eval checks.aarch64-linux.packages —
error: … while evaluating the attribute 'drvPath' at «https://releases.nixos.org/nixpkgs/nixpkgs-26.11pre1078969.34ca302a9572/nixexprs.tar.xz?na …
error:
       … while evaluating the attribute 'drvPath'
         at «https://releases.nixos.org/nixpkgs/nixpkgs-26.11pre1078969.34ca302a9572/nixexprs.tar.xz?narHash=sha256-nuO5fxDxKTeYxSEfD4mVB%2BXwzOy5qj9T2LxVc5vk4Bc%3D»/lib/customisation.nix:416:11:
          415|         // {
          416|           drvPath =
             |           ^
          417|             assert condition;

       … while calling the 'derivationStrict' builtin
         at «nix-internal»/derivation-internal.nix:37:12:
           36|
           37|   strict = derivationStrict drvAttrs;
             |            ^
           38|

       … while evaluating the option `driverConfiguration.vlans':

       … while evaluating definitions from `/nix/store/9kj7xplg18izvf8mx4s7q5kzqpw6pcw4-source/nixos/lib/testing/driver-configuration.nix':

       … while evaluating the option `containers.server.networking.interfaces':

       … while evaluating definitions from `/nix/store/9kj7xplg18izvf8mx4s7q5kzqpw6pcw4-source/nixos/modules/hardware/facter/networking':

       … while evaluating the option `containers.server.hardware.facter.enable':

       … while evaluating the option `containers.server.hardware.facter.report':

       … while evaluating the option `containers.server.hardware.facter.reportPath':

       … while evaluating definitions from `/nix/store/kym2ijnk6j3z1i8wa5zhl3ys58nfsnfc-source/nixosModules/clanCore/nixos-facter.nix':

       (stack trace truncated; use '--show-trace' to show the full, detailed trace)

       error: Cannot build '/nix/store/520mx12zld0j5ja9jdvr05lg26zh7xwi-merged-test-dir-packages.drv'.
       Reason: 1 dependency failed.
       Output paths:
         /nix/store/28vmfx1hjzh0g8g6s2vamb1wwa0c4mwk-merged-test-dir-packages
failed eval checks.aarch64-linux.postgresql —
error: … while evaluating the attribute 'drvPath' at «https://releases.nixos.org/nixpkgs/nixpkgs-26.11pre1078969.34ca302a9572/nixexprs.tar.xz?na …
error:
       … while evaluating the attribute 'drvPath'
         at «https://releases.nixos.org/nixpkgs/nixpkgs-26.11pre1078969.34ca302a9572/nixexprs.tar.xz?narHash=sha256-nuO5fxDxKTeYxSEfD4mVB%2BXwzOy5qj9T2LxVc5vk4Bc%3D»/lib/customisation.nix:416:11:
          415|         // {
          416|           drvPath =
             |           ^
          417|             assert condition;

       … while calling the 'derivationStrict' builtin
         at «nix-internal»/derivation-internal.nix:37:12:
           36|
           37|   strict = derivationStrict drvAttrs;
             |            ^
           38|

       … while evaluating the option `driverConfiguration.vlans':

       … while evaluating definitions from `/nix/store/9kj7xplg18izvf8mx4s7q5kzqpw6pcw4-source/nixos/lib/testing/driver-configuration.nix':

       … while evaluating the option `containers.machine.networking.interfaces':

       … while evaluating definitions from `/nix/store/9kj7xplg18izvf8mx4s7q5kzqpw6pcw4-source/nixos/modules/hardware/facter/networking':

       … while evaluating the option `containers.machine.hardware.facter.enable':

       … while evaluating the option `containers.machine.hardware.facter.report':

       … while evaluating the option `containers.machine.hardware.facter.reportPath':

       … while evaluating definitions from `/nix/store/kym2ijnk6j3z1i8wa5zhl3ys58nfsnfc-source/nixosModules/clanCore/nixos-facter.nix':

       (stack trace truncated; use '--show-trace' to show the full, detailed trace)

       error: Cannot build '/nix/store/za03x3iaia4gkjx2r4s7hhw380cgyhif-merged-test-dir-service-postgresql.drv'.
       Reason: 1 dependency failed.
       Output paths:
         /nix/store/2iqf0d0hz72f6x81s1a2mc9dvnhgiw5p-merged-test-dir-service-postgresql
failed checks.aarch64-linux.service-dummy-test-from-flake 1m 4s
setup: don't know how to build these paths: /nix/store/wk5aw5qx3qkgimw83a0f4pqbwcjagica-container-test-run-service-dummy-test-from-flake.drv warning: ignoring …
setup:
don't know how to build these paths:
  /nix/store/wk5aw5qx3qkgimw83a0f4pqbwcjagica-container-test-run-service-dummy-test-from-flake.drv
warning: ignoring the client-specified setting 'store', because it is a restricted setting and you are not a trusted user
error: gRPC QueryValidPaths on 'nix-store.geninf.io:50051' failed: error: unable to download 'https://cache.clan.lol/ij3kkrv08sfjqibja3p23sgn1xb1nc9v.narinfo': HTTP error 503

              response body:

              <?xml version="1.0" encoding="UTF-8" standalone="yes"?>
              <Error>
                  <Code>SlowDown</Code>
                  <Message>Your account has made too many requests; try again later.</Message>
              </Error>
failed eval checks.aarch64-linux.state-version —
error: … while evaluating the attribute 'drvPath' at «https://releases.nixos.org/nixpkgs/nixpkgs-26.11pre1078969.34ca302a9572/nixexprs.tar.xz?na …
error:
       … while evaluating the attribute 'drvPath'
         at «https://releases.nixos.org/nixpkgs/nixpkgs-26.11pre1078969.34ca302a9572/nixexprs.tar.xz?narHash=sha256-nuO5fxDxKTeYxSEfD4mVB%2BXwzOy5qj9T2LxVc5vk4Bc%3D»/lib/customisation.nix:416:11:
          415|         // {
          416|           drvPath =
             |           ^
          417|             assert condition;

       … while calling the 'derivationStrict' builtin
         at «nix-internal»/derivation-internal.nix:37:12:
           36|
           37|   strict = derivationStrict drvAttrs;
             |            ^
           38|

       … while evaluating the option `driverConfiguration.vlans':

       … while evaluating definitions from `/nix/store/9kj7xplg18izvf8mx4s7q5kzqpw6pcw4-source/nixos/lib/testing/driver-configuration.nix':

       … while evaluating the option `containers.server.networking.interfaces':

       … while evaluating definitions from `/nix/store/9kj7xplg18izvf8mx4s7q5kzqpw6pcw4-source/nixos/modules/hardware/facter/networking':

       … while evaluating the option `containers.server.hardware.facter.enable':

       … while evaluating the option `containers.server.hardware.facter.report':

       … while evaluating the option `containers.server.hardware.facter.reportPath':

       … while evaluating definitions from `/nix/store/kym2ijnk6j3z1i8wa5zhl3ys58nfsnfc-source/nixosModules/clanCore/nixos-facter.nix':

       (stack trace truncated; use '--show-trace' to show the full, detailed trace)

       error: Cannot build '/nix/store/yb9y787327fibhbqin9m7c4b8iywlbpc-merged-test-dir-service-state-version.drv'.
       Reason: 1 dependency failed.
       Output paths:
         /nix/store/nk9rm7knk8rngd5kpqdp9qj7hcrqqldj-merged-test-dir-service-state-version
failed eval checks.aarch64-linux.trusted-nix-caches —
error: … while evaluating the attribute 'drvPath' at «https://releases.nixos.org/nixpkgs/nixpkgs-26.11pre1078969.34ca302a9572/nixexprs.tar.xz?na …
error:
       … while evaluating the attribute 'drvPath'
         at «https://releases.nixos.org/nixpkgs/nixpkgs-26.11pre1078969.34ca302a9572/nixexprs.tar.xz?narHash=sha256-nuO5fxDxKTeYxSEfD4mVB%2BXwzOy5qj9T2LxVc5vk4Bc%3D»/lib/customisation.nix:416:11:
          415|         // {
          416|           drvPath =
             |           ^
          417|             assert condition;

       … while calling the 'derivationStrict' builtin
         at «nix-internal»/derivation-internal.nix:37:12:
           36|
           37|   strict = derivationStrict drvAttrs;
             |            ^
           38|

       … while evaluating the option `driverConfiguration.vlans':

       … while evaluating definitions from `/nix/store/9kj7xplg18izvf8mx4s7q5kzqpw6pcw4-source/nixos/lib/testing/driver-configuration.nix':

       … while evaluating the option `containers.server.networking.interfaces':

       … while evaluating definitions from `/nix/store/9kj7xplg18izvf8mx4s7q5kzqpw6pcw4-source/nixos/modules/hardware/facter/networking':

       … while evaluating the option `containers.server.hardware.facter.enable':

       … while evaluating the option `containers.server.hardware.facter.report':

       … while evaluating the option `containers.server.hardware.facter.reportPath':

       … while evaluating definitions from `/nix/store/kym2ijnk6j3z1i8wa5zhl3ys58nfsnfc-source/nixosModules/clanCore/nixos-facter.nix':

       (stack trace truncated; use '--show-trace' to show the full, detailed trace)

       error: Cannot build '/nix/store/w4dg2xppmnynkhfpgibi5dfisgf1yyab-merged-test-dir-trusted-nix-caches.drv'.
       Reason: 1 dependency failed.
       Output paths:
         /nix/store/wjyjng3hnwl4ckhpmc6rji40dmxz7j9x-merged-test-dir-trusted-nix-caches
failed eval checks.aarch64-linux.zerotier-multi-instance —
error: … while evaluating the attribute 'drvPath' at «https://releases.nixos.org/nixpkgs/nixpkgs-26.11pre1078969.34ca302a9572/nixexprs.tar.xz?na …
error:
       … while evaluating the attribute 'drvPath'
         at «https://releases.nixos.org/nixpkgs/nixpkgs-26.11pre1078969.34ca302a9572/nixexprs.tar.xz?narHash=sha256-nuO5fxDxKTeYxSEfD4mVB%2BXwzOy5qj9T2LxVc5vk4Bc%3D»/lib/customisation.nix:416:11:
          415|         // {
          416|           drvPath =
             |           ^
          417|             assert condition;

       … while calling the 'derivationStrict' builtin
         at «nix-internal»/derivation-internal.nix:37:12:
           36|
           37|   strict = derivationStrict drvAttrs;
             |            ^
           38|

       … while evaluating the option `driverConfiguration.vlans':

       … while evaluating definitions from `/nix/store/9kj7xplg18izvf8mx4s7q5kzqpw6pcw4-source/nixos/lib/testing/driver-configuration.nix':

       … while evaluating the option `nodes.alpha.networking.interfaces':

       … while evaluating definitions from `/nix/store/9kj7xplg18izvf8mx4s7q5kzqpw6pcw4-source/nixos/modules/hardware/facter/networking':

       … while evaluating the option `nodes.alpha.hardware.facter.enable':

       … while evaluating the option `nodes.alpha.hardware.facter.report':

       … while evaluating the option `nodes.alpha.hardware.facter.reportPath':

       … while evaluating definitions from `/nix/store/kym2ijnk6j3z1i8wa5zhl3ys58nfsnfc-source/nixosModules/clanCore/nixos-facter.nix':

       (stack trace truncated; use '--show-trace' to show the full, detailed trace)

       error: Cannot build '/nix/store/n5vdssnsa6vrczhzwcfkjws152xaj56j-merged-test-dir-zerotier-multi-instance.drv'.
       Reason: 1 dependency failed.
       Output paths:
         /nix/store/80d1ci4qhghb4kgppg9cpbaw7f4dm1y1-merged-test-dir-zerotier-multi-instance
failed checks.x86_64-linux.borgbackup 1m 27s
setup: don't know how to build these paths: /nix/store/bkgmf7w2s4h17nk5pczfq5chnqbh437k-container-test-run-borgbackup.drv warning: ignoring the client-specifi …
setup:
don't know how to build these paths:
  /nix/store/bkgmf7w2s4h17nk5pczfq5chnqbh437k-container-test-run-borgbackup.drv
warning: ignoring the client-specified setting 'store', because it is a restricted setting and you are not a trusted user
iq48fada9c2fpry0ivz0nkc0vf1xf7nk-clan-runtime.drv: error: gRPC QueryValidPaths on 'nix-store.geninf.io:50051' failed: error: unable to download 'https://cache.clan.lol/9kj7xplg18izvf8mx4s7q5kzqpw6pcw4.narinfo': HTTP error 503

              response body:

              <?xml version="1.0" encoding="UTF-8" standalone="yes"?>
              <Error>
                  <Code>SlowDown</Code>
                  <Message>Your account has made too many requests; try again later.</Message>
              </Error>
error: dependency '9nd0chdsy33y10pvimcns3dc5cv445dl-nixos-test-driver-borgbackup.drv' failed
failed checks.x86_64-linux.clan-deps 3h 0m
setup: don't know how to build these paths: /nix/store/01dcxfb1mfk1vxx2s9x8shhqbyqcn40m-clan-deps.drv warning: ignoring the client-specified setting 'store', …
setup:
don't know how to build these paths:
  /nix/store/01dcxfb1mfk1vxx2s9x8shhqbyqcn40m-clan-deps.drv
warning: ignoring the client-specified setting 'store', because it is a restricted setting and you are not a trusted user
failed checks.x86_64-linux.clan-pytest-with-core 2m 3s
setup: don't know how to build these paths: /nix/store/nwvcl5cnmkavjng4fynk8wa2rl7xjglh-clan-pytest-with-core.drv warning: ignoring the client-specified setti …
setup:
don't know how to build these paths:
  /nix/store/nwvcl5cnmkavjng4fynk8wa2rl7xjglh-clan-pytest-with-core.drv
warning: ignoring the client-specified setting 'store', because it is a restricted setting and you are not a trusted user
kc58j9k16kfy8wg41pddz4naxxk24mcv-clan-core-flake.drv: error: gRPC QueryValidPaths on 'nix-store.geninf.io:50051' failed: error: substituter 'https://cache.geninf.io' is disabled
iq48fada9c2fpry0ivz0nkc0vf1xf7nk-clan-runtime.drv: error: gRPC QueryValidPaths on 'nix-store.geninf.io:50051' failed: error: substituter 'https://cache.geninf.io' is disabled
error: dependency 'kc58j9k16kfy8wg41pddz4naxxk24mcv-clan-core-flake.drv' failed
failed checks.x86_64-linux.clan-pytest-without-core 3h 0m
setup: don't know how to build these paths: /nix/store/cgqk006jkk0z6bp93l04y2q0zzn9wiqs-clan-pytest-without-core.drv warning: ignoring the client-specified se …
setup:
don't know how to build these paths:
  /nix/store/cgqk006jkk0z6bp93l04y2q0zzn9wiqs-clan-pytest-without-core.drv
warning: ignoring the client-specified setting 'store', because it is a restricted setting and you are not a trusted user
failed checks.x86_64-linux.clan-site-lint 3m 9s
setup: don't know how to build these paths: /nix/store/3hjmm64zcsqwv0a7dzcg9nsdyfqc17gn-clan-site-lint.drv warning: ignoring the client-specified setting 'sto …
setup:
don't know how to build these paths:
  /nix/store/3hjmm64zcsqwv0a7dzcg9nsdyfqc17gn-clan-site-lint.drv
warning: ignoring the client-specified setting 'store', because it is a restricted setting and you are not a trusted user
error: gRPC QueryValidPaths on 'nix-store.geninf.io:50051' failed: error: substituter 'https://cache.geninf.io' is disabled
failed checks.x86_64-linux.clan-test-iso 3h 0m
setup: don't know how to build these paths: /nix/store/i0iyaq12c1vabfhhx0x19qa0m5x371a7--test-run-clan-test-iso.drv warning: ignoring the client-specified set …
setup:
don't know how to build these paths:
  /nix/store/i0iyaq12c1vabfhhx0x19qa0m5x371a7--test-run-clan-test-iso.drv
warning: ignoring the client-specified setting 'store', because it is a restricted setting and you are not a trusted user
lpn7mfib3i6gn0jm8hksakm8l6r30l36-etc-nix-registry.json.drv: error: gRPC QueryValidPaths on 'nix-store.geninf.io:50051' failed: error: unable to download 'https://cache.clan.lol/lpn7mfib3i6gn0jm8hksakm8l6r30l36.narinfo': HTTP error 503

              response body:

              <?xml version="1.0" encoding="UTF-8" standalone="yes"?>
              <Error>
                  <Code>SlowDown</Code>
                  <Message>Your account has made too many requests; try again later.</Message>
              </Error>
fk56hha5v0b4wqsccswiv2g5p1nwlp5z-version.drv: gi-build-x86-02: not scheduled here: fk56hha5v0b4wqsccswiv2g5p1nwlp5z-version.drv, asking the scheduler again
472i6ic9kxz057m4nkjfj4m82nliipxq-boot.json.drv: gi-build-x86-01: not scheduled here: 472i6ic9kxz057m4nkjfj4m82nliipxq-boot.json.drv, asking the scheduler again
gdqb6dm0p0755wy9fqalz4frxpiqh6s6-clan-runtime.drv: error: gRPC QueryValidPaths on 'nix-store.geninf.io:50051' failed: error: substituter 'https://cache.geninf.io' is disabled
f4w7hfqllyxxjpdfzf96mzwy2pi633xg-offline-flake-for-test-clan-test-iso.drv: error: gRPC QueryValidPaths on 'nix-store.geninf.io:50051' failed: error: substituter 'https://cache.geninf.io' is disabled
failed checks.x86_64-linux.clan-test-update 3h 0m
setup: /nix/store/cn1b0x763sygvlgfchcjbjybvj910jya-clan-cli.drv /nix/store/gdqb6dm0p0755wy9fqalz4frxpiqh6s6-clan-runtime.drv /nix/store/jh9fl6m695zs979bd4 …
setup:
  /nix/store/cn1b0x763sygvlgfchcjbjybvj910jya-clan-cli.drv
  /nix/store/gdqb6dm0p0755wy9fqalz4frxpiqh6s6-clan-runtime.drv
  /nix/store/jh9fl6m695zs979bd47wv373w8snbpd4-driverConfiguration.json.drv
  /nix/store/wbdw1k1h6jl8jlx9pgfif663kny1xglb-initrd-unit-env.drv
these 2 paths will be fetched (2.2 MiB download, 9.9 MiB unpacked):
  /nix/store/r6zbs64d8xzg2qx10llzb9214hd55qx7-nix-diff-1.0.21
  /nix/store/1qswf1mgr8xqvclxcgnd61bygyzac86m-tor-0.4.9.13
warning: ignoring the client-specified setting 'store', because it is a restricted setting and you are not a trusted user
failed checks.x86_64-linux.darwin-test-darwin-machine 3h 1m
setup: these 19 derivations will be built:
setup:
these 19 derivations will be built:
dependency failed checks.x86_64-linux.devshell —
failed checks.x86_64-linux.devShell-clan-cli 3h 0m
setup: don't know how to build these paths: /nix/store/f3x637apm0f5yfz154a1nymfgprn0pvq-clan-cli.drv warning: ignoring the client-specified setting 'store', b …
setup:
don't know how to build these paths:
  /nix/store/f3x637apm0f5yfz154a1nymfgprn0pvq-clan-cli.drv
warning: ignoring the client-specified setting 'store', because it is a restricted setting and you are not a trusted user
failed checks.x86_64-linux.devShell-clan-site 3h 2m
setup: /nix/store/iq48fada9c2fpry0ivz0nkc0vf1xf7nk-clan-runtime.drv /nix/store/7164i3b71gp7k68a5j9gq4wx1gz7a928-clan-cli-source.drv /nix/store/m692x7wfm1m …
setup:
  /nix/store/iq48fada9c2fpry0ivz0nkc0vf1xf7nk-clan-runtime.drv
  /nix/store/7164i3b71gp7k68a5j9gq4wx1gz7a928-clan-cli-source.drv
  /nix/store/m692x7wfm1mdm2sylb6m3r77qpaacdw7-clan-cli.drv
  /nix/store/c40gaq4ijmlqd6wvw0ij9f7rfqf117lc-render-options.drv
  /nix/store/lydkwj83yb0d5pw0xivc0bz358ijdrb2-rendered.drv
  /nix/store/nfxli6nwm4yxr4l8nzhigxy3vz4jxbyl-generated-docs.drv
  /nix/store/3k2rrr0xywm02q5p3zj6kagf6f3sp715-nix-shell.drv
warning: ignoring the client-specified setting 'store', because it is a restricted setting and you are not a trusted user
failed checks.x86_64-linux.devShell-default 3h 1m
setup: don't know how to build these paths: /nix/store/s0l96w57ragbcknhmrjzmzh2ly2dpxnw-clan.drv warning: ignoring the client-specified setting 'store', becau …
setup:
don't know how to build these paths:
  /nix/store/s0l96w57ragbcknhmrjzmzh2ly2dpxnw-clan.drv
warning: ignoring the client-specified setting 'store', because it is a restricted setting and you are not a trusted user
iq48fada9c2fpry0ivz0nkc0vf1xf7nk-clan-runtime.drv: gi-build-x86-02: not scheduled here: iq48fada9c2fpry0ivz0nkc0vf1xf7nk-clan-runtime.drv, asking the scheduler again
s0l96w57ragbcknhmrjzmzh2ly2dpxnw-clan.drv: error: gRPC QueryValidPaths on 'nix-store.geninf.io:50051' failed: error: substituter 'https://cache.clan.lol' is disabled
error: error: gRPC QueryValidPaths on 'nix-store.geninf.io:50051' failed: error: substituter 'https://cache.clan.lol' is disabled
failed checks.x86_64-linux.devShell-docs 3h 0m
setup: don't know how to build these paths: /nix/store/j30kq621r5wllnixnm60k6wqf9aqyk2h-nix-shell.drv warning: ignoring the client-specified setting 'store', …
setup:
don't know how to build these paths:
  /nix/store/j30kq621r5wllnixnm60k6wqf9aqyk2h-nix-shell.drv
warning: ignoring the client-specified setting 'store', because it is a restricted setting and you are not a trusted user
failed checks.x86_64-linux.devShell-inventory-schema 3h 1m
setup: don't know how to build these paths: /nix/store/w0c5lxqzd81nybw64cj2qnqqhbidldrr-clan-inventory-schema.drv warning: ignoring the client-specified setti …
setup:
don't know how to build these paths:
  /nix/store/w0c5lxqzd81nybw64cj2qnqqhbidldrr-clan-inventory-schema.drv
warning: ignoring the client-specified setting 'store', because it is a restricted setting and you are not a trusted user
iq48fada9c2fpry0ivz0nkc0vf1xf7nk-clan-runtime.drv: gi-build-x86-02: not scheduled here: iq48fada9c2fpry0ivz0nkc0vf1xf7nk-clan-runtime.drv, asking the scheduler again
w0c5lxqzd81nybw64cj2qnqqhbidldrr-clan-inventory-schema.drv: error: gRPC QueryValidPaths on 'nix-store.geninf.io:50051' failed: error: substituter 'https://cache.clan.lol' is disabled
error: error: gRPC QueryValidPaths on 'nix-store.geninf.io:50051' failed: error: substituter 'https://cache.clan.lol' is disabled
failed checks.x86_64-linux.dm-dns 3h 0m
setup: /nix/store/dsvp4jig350vljncxa498384fjz3kil1-container-test-run-dm-dns.drv warning: ignoring the client-specified setting 'store', because it is a restr …
setup:
  /nix/store/dsvp4jig350vljncxa498384fjz3kil1-container-test-run-dm-dns.drv
warning: ignoring the client-specified setting 'store', because it is a restricted setting and you are not a trusted user
9n5b8hy0w2b3zf3s7agj719nqcbm9hac-generator-data-mesher-network.drv: gi-build-x86-01: not scheduled here: 9n5b8hy0w2b3zf3s7agj719nqcbm9hac-generator-data-mesher-network.drv, asking the scheduler again
qx55nqib8k90rp8p13zpz8a436wi2ix7-unbound.conf.drv: gi-build-x86-01: not scheduled here: qx55nqib8k90rp8p13zpz8a436wi2ix7-unbound.conf.drv, asking the scheduler again
kmnpbrkk050pwazgzsxhm1fylzn912lk-generator-data-mesher-node-identity.drv: error: gRPC QueryValidPaths on 'nix-store.geninf.io:50051' failed: error: substituter 'https://cache.geninf.io' is disabled
spg9qv9frbxrqzqpmh0ic6in6rhw0zn0-dm.toml.drv: error: gRPC QueryValidPaths on 'nix-store.geninf.io:50051' failed: error: substituter 'https://cache.geninf.io' is disabled
619yp6azrh2jsi284ihbdn3mabpp439v-unbound.conf.drv: error: gRPC QueryValidPaths on 'nix-store.geninf.io:50051' failed: error: substituter 'https://cache.geninf.io' is disabled
zy5qiqr4lvnra8ncrvd8wd1c8qicbwzs-X-Restart-Triggers-unbound.drv: error: gRPC QueryValidPaths on 'nix-store.geninf.io:50051' failed: error: substituter 'https://cache.geninf.io' is disabled
failed checks.x86_64-linux.dyndns 3h 0m
setup: don't know how to build these paths: /nix/store/0mh92k7jqimwhyxf511gkjm89i5kfb5l-container-test-run-dyndns.drv warning: ignoring the client-specified s …
setup:
don't know how to build these paths:
  /nix/store/0mh92k7jqimwhyxf511gkjm89i5kfb5l-container-test-run-dyndns.drv
warning: ignoring the client-specified setting 'store', because it is a restricted setting and you are not a trusted user
9v70pxc8rhjkc0agyinwfmkiab8p12fm-vars-check-dyndns.drv: build-x86-01: not scheduled here: 9v70pxc8rhjkc0agyinwfmkiab8p12fm-vars-check-dyndns.drv, asking the scheduler again
f2wgl8swgp8n538p5kqf3xjvf971v85v-dry-activate.drv: build-x86-01: not scheduled here: f2wgl8swgp8n538p5kqf3xjvf971v85v-dry-activate.drv, asking the scheduler again
failed checks.x86_64-linux.eval-tests 3h 0m
setup: don't know how to build these paths: /nix/store/43k3x2h2ivq29gqzg5jams4yqzyg5sac-eval-tests-x86_64-linux.drv warning: ignoring the client-specified set …
setup:
don't know how to build these paths:
  /nix/store/43k3x2h2ivq29gqzg5jams4yqzyg5sac-eval-tests-x86_64-linux.drv
warning: ignoring the client-specified setting 'store', because it is a restricted setting and you are not a trusted user
24yjdab58nx3rf1hfjka19p328xyfl8k-evalCheck-eval-lib-distributedServices.drv: error: gRPC QueryValidPaths on 'nix-store.geninf.io:50051' failed: error: unable to download 'https://cache.clan.lol/42ljc4yrs8mg0rml4biaxkwp4szrv52v.narinfo': HTTP error 503

              response body:

              <?xml version="1.0" encoding="UTF-8" standalone="yes"?>
              <Error>
                  <Code>SlowDown</Code>
                  <Message>Your account has made too many requests; try again later.</Message>
              </Error>
s6klwp3da7aazrs7rlr5amkw0i2qgl5b-evalCheck-eval-lib-resolve-module.drv: error: gRPC QueryValidPaths on 'nix-store.geninf.io:50051' failed: error: substituter 'https://cache.geninf.io' is disabled
failed checks.x86_64-linux.kde 2m 12s
setup: don't know how to build these paths: /nix/store/990kb069whzlpnib0w6pf4mql291yzql-container-test-run-kde.drv warning: ignoring the client-specified sett …
setup:
don't know how to build these paths:
  /nix/store/990kb069whzlpnib0w6pf4mql291yzql-container-test-run-kde.drv
warning: ignoring the client-specified setting 'store', because it is a restricted setting and you are not a trusted user
error: gRPC QueryValidPaths on 'nix-store.geninf.io:50051' failed: error: unable to download 'https://cache.clan.lol/3x1ilynymyf4y2rxcyw3fxqjqxbpw4vw.narinfo': HTTP error 503

              response body:

              <?xml version="1.0" encoding="UTF-8" standalone="yes"?>
              <Error>
                  <Code>SlowDown</Code>
                  <Message>Your account has made too many requests; try again later.</Message>
              </Error>
failed checks.x86_64-linux.matrix-synapse 3h 0m
setup: ldv46qk9xbirxw4fwzpx44vsvy3rfj8w-generator-matrix-synapse.drv: gi-build-x86-02: not scheduled here: ldv46qk9xbirxw4fwzpx44vsvy3rfj8w-generator-matrix-syn …
setup:
ldv46qk9xbirxw4fwzpx44vsvy3rfj8w-generator-matrix-synapse.drv: gi-build-x86-02: not scheduled here: ldv46qk9xbirxw4fwzpx44vsvy3rfj8w-generator-matrix-synapse.drv, asking the scheduler again
v74l1xdqdqsg98pcz2j6nv4rz34y4jfw-unit-script-postgresql-pre-start.drv: gi-build-x86-01: not scheduled here: v74l1xdqdqsg98pcz2j6nv4rz34y4jfw-unit-script-postgresql-pre-start.drv, asking the scheduler again
bv8rj84viqajfn86fw2h5pqx3kbpzn0p-users-groups.json.drv: gi-build-x86-02: not scheduled here: bv8rj84viqajfn86fw2h5pqx3kbpzn0p-users-groups.json.drv, asking the scheduler again
v6pw5d0xjijly1ikkhpmgpzlrxp8ny2q-string-hosts.drv: error: gRPC QueryValidPaths on 'nix-store.geninf.io:50051' failed: error: substituter 'https://cache.geninf.io' is disabled
yv5h27zglbdiakn5pvnr73n5wmzfarsq-element-web-with-config.drv: error: gRPC QueryValidPaths on 'nix-store.geninf.io:50051' failed: error: substituter 'https://cache.geninf.io' is disabled
f1z7kajnia8k1w1rnna69pn93ljyim6m-test-script.drv: error: gRPC QueryValidPaths on 'nix-store.geninf.io:50051' failed: error: substituter 'https://cache.geninf.io' is disabled
sr0z5kxjal8gxnfq7rwqa2vhc0qqj9gw-extra-hosts.drv: gi-build-x86-02: not scheduled here: sr0z5kxjal8gxnfq7rwqa2vhc0qqj9gw-extra-hosts.drv, asking the scheduler again
kgy5snm60am17374vz5vs2v20d1n19h1-generator-matrix-password-someuser.drv: error: gRPC QueryValidPaths on 'nix-store.geninf.io:50051' failed: error: substituter 'https://cache.geninf.io' is disabled
failed checks.x86_64-linux.monitoring 3h 0m
setup: crgsw8fxv64kmadgal0ih3gwz1yyqivf-system-path.drv: error: gRPC QueryValidPaths on 'nix-store.geninf.io:50051' failed: error: substituter 'https://cache.ge …
setup:
crgsw8fxv64kmadgal0ih3gwz1yyqivf-system-path.drv: error: gRPC QueryValidPaths on 'nix-store.geninf.io:50051' failed: error: substituter 'https://cache.geninf.io' is disabled
13l333j28fvsnw26dv60aahm1yaqd37z-generator-grafana-secret.drv: error: gRPC QueryValidPaths on 'nix-store.geninf.io:50051' failed: error: substituter 'https://cache.geninf.io' is disabled
qndn79d1wdd3r2rf979fvcd50w4ajpkb-datasource.yaml.drv: error: gRPC QueryValidPaths on 'nix-store.geninf.io:50051' failed: error: substituter 'https://cache.geninf.io' is disabled
8cf4gc93vy61w7r32mslilp7yjm22y7l-generator-grafana-admin.drv: gi-build-x86-02: not scheduled here: 8cf4gc93vy61w7r32mslilp7yjm22y7l-generator-grafana-admin.drv, asking the scheduler again
cmg3vx7xnisi90i1bgy6rqfjpij43qv8-system-path.drv: gi-build-x86-02: gi-build-x86-02: input not substitutable: error: path '/nix/store/2b8mrdfx08pr3bjkmka9abyaykjfbzyp-postgres-db-restore-command-grafana' is required, but there is no substituter that can build it, asking the scheduler again
cmg3vx7xnisi90i1bgy6rqfjpij43qv8-system-path.drv: gi-build-x86-02: gi-build-x86-02: input not substitutable: error: path '/nix/store/2b8mrdfx08pr3bjkmka9abyaykjfbzyp-postgres-db-restore-command-grafana' is required, but there is no substituter that can build it, asking the scheduler again
lzyqamlya1489r91z4v9mn700dhp024z-hosts.drv: gi-build-x86-02: not scheduled here: lzyqamlya1489r91z4v9mn700dhp024z-hosts.drv, asking the scheduler again
ik0860ngvpxl7ikv97yv77jajd4n6p79-unit-script-nginx-pre-start.drv: gi-build-x86-02: not scheduled here: ik0860ngvpxl7ikv97yv77jajd4n6p79-unit-script-nginx-pre-start.drv, asking the scheduler again
failed checks.x86_64-linux.nixos-documentation 3h 0m
setup: these 18 derivations will be built:
setup:
these 18 derivations will be built:
failed checks.x86_64-linux.nixos-flash-installer 3h 0m
setup: don't know how to build these paths: /nix/store/8dd2pl3abq1ns5x48ybbdlrg52y1lsij-nixos-system-flash-installer-26.11.20260924.34ca302.drv warning: ignor …
setup:
don't know how to build these paths:
  /nix/store/8dd2pl3abq1ns5x48ybbdlrg52y1lsij-nixos-system-flash-installer-26.11.20260924.34ca302.drv
warning: ignoring the client-specified setting 'store', because it is a restricted setting and you are not a trusted user
d205xk3f6m79xgzqzwqvyvp4n59zd9rn-etc-os-release.drv: error: gRPC QueryValidPaths on 'nix-store.geninf.io:50051' failed: error: substituter 'https://cache.geninf.io' is disabled
1466pia8ix32ymwabm2x16wqb46d1h21-boot.json.drv: error: gRPC QueryValidPaths on 'nix-store.geninf.io:50051' failed: error: substituter 'https://cache.geninf.io' is disabled
92qry06i9sf5rcj83bhng1d6dwifzn4x-system-path.drv: error: gRPC QueryValidPaths on 'nix-store.geninf.io:50051' failed: error: unable to download 'https://cache.clan.lol/6gp191871rq5j1p9swy3dz7p5pvmhh3s.narinfo': HTTP error 503

              response body:

              <?xml version="1.0" encoding="UTF-8" standalone="yes"?>
              <Error>
                  <Code>SlowDown</Code>
                  <Message>Your account has made too many requests; try again later.</Message>
              </Error>
ar4bhxfvc8d2ddq2dz52yialkb8s26d8-nixos-26.11.20260924.34ca302.drv: gi-build-x86-01: not scheduled here: ar4bhxfvc8d2ddq2dz52yialkb8s26d8-nixos-26.11.20260924.34ca302.drv, asking the scheduler again
failed checks.x86_64-linux.nixos-test-flash 3h 0m
setup: don't know how to build these paths: /nix/store/fm2b448kp7a28y2kbyzdcya6cs8lhqj9-vm-test-run-flash.drv warning: ignoring the client-specified setting ' …
setup:
don't know how to build these paths:
  /nix/store/fm2b448kp7a28y2kbyzdcya6cs8lhqj9-vm-test-run-flash.drv
warning: ignoring the client-specified setting 'store', because it is a restricted setting and you are not a trusted user
failed checks.x86_64-linux.nixos-test-flash-installer-boot 3h 0m
setup: don't know how to build these paths: /nix/store/bnf7c513xifs1zsjaxsi1yr2mwy5zdj4-vm-test-run-flash-installer-boot.drv warning: ignoring the client-spec …
setup:
don't know how to build these paths:
  /nix/store/bnf7c513xifs1zsjaxsi1yr2mwy5zdj4-vm-test-run-flash-installer-boot.drv
warning: ignoring the client-specified setting 'store', because it is a restricted setting and you are not a trusted user
failed checks.x86_64-linux.nixos-test-installation 3h 2m
setup: don't know how to build these paths: /nix/store/6a58lyf4k3inlswx90fvhqxykg65224z-vm-test-run-installation.drv warning: ignoring the client-specified se …
setup:
don't know how to build these paths:
  /nix/store/6a58lyf4k3inlswx90fvhqxykg65224z-vm-test-run-installation.drv
warning: ignoring the client-specified setting 'store', because it is a restricted setting and you are not a trusted user
failed checks.x86_64-linux.nixos-test-installation-age 3h 0m
setup: don't know how to build these paths: /nix/store/5jf8wymxsaapgqjbwidasgw3v8cv2f0s-vm-test-run-installation.drv warning: ignoring the client-specified se …
setup:
don't know how to build these paths:
  /nix/store/5jf8wymxsaapgqjbwidasgw3v8cv2f0s-vm-test-run-installation.drv
warning: ignoring the client-specified setting 'store', because it is a restricted setting and you are not a trusted user
gdqb6dm0p0755wy9fqalz4frxpiqh6s6-clan-runtime.drv: error: gRPC QueryValidPaths on 'nix-store.geninf.io:50051' failed: error: substituter 'https://cache.geninf.io' is disabled
pgpfx6j80zw8xdlczsq302x8hsmy9mhi-installation-test-flake-x86_64-linux.drv: gi-build-x86-01: not scheduled here: pgpfx6j80zw8xdlczsq302x8hsmy9mhi-installation-test-flake-x86_64-linux.drv, asking the scheduler again
pgpfx6j80zw8xdlczsq302x8hsmy9mhi-installation-test-flake-x86_64-linux.drv: build-x86-01: not scheduled here: pgpfx6j80zw8xdlczsq302x8hsmy9mhi-installation-test-flake-x86_64-linux.drv, asking the scheduler again
failed checks.x86_64-linux.nixos-test-installation-password-store 3h 0m
setup: don't know how to build these paths: /nix/store/hq7b0k1gy4rrsw562ry1vcqi276r0axy-vm-test-run-installation.drv warning: ignoring the client-specified se …
setup:
don't know how to build these paths:
  /nix/store/hq7b0k1gy4rrsw562ry1vcqi276r0axy-vm-test-run-installation.drv
warning: ignoring the client-specified setting 'store', because it is a restricted setting and you are not a trusted user
failed checks.x86_64-linux.nixos-test-update-hardware-configuration 3h 5m
setup: don't know how to build these paths: /nix/store/yrji7hlwwmngvvmgrac1xx4d800ppivd-vm-test-run-update-hardware-configuration.drv warning: ignoring the cl …
setup:
don't know how to build these paths:
  /nix/store/yrji7hlwwmngvvmgrac1xx4d800ppivd-vm-test-run-update-hardware-configuration.drv
warning: ignoring the client-specified setting 'store', because it is a restricted setting and you are not a trusted user
gdqb6dm0p0755wy9fqalz4frxpiqh6s6-clan-runtime.drv: gi-build-x86-02: not scheduled here: gdqb6dm0p0755wy9fqalz4frxpiqh6s6-clan-runtime.drv, asking the scheduler again
b8nhipmzgxl5bmkzvdm56qaqj23gqxkf-clan-cli-source.drv: error: gRPC QueryValidPaths on 'nix-store.geninf.io:50051' failed: error: substituter 'https://cache.clan.lol' is disabled
failed checks.x86_64-linux.nixos-test-wayland-proxy-virtwl 3h 0m
setup: don't know how to build these paths: /nix/store/wb8mrb4n11c6mdchmfd8c7gdispwrd26-vm-test-run-wayland-proxy-virtwl.drv warning: ignoring the client-spec …
setup:
don't know how to build these paths:
  /nix/store/wb8mrb4n11c6mdchmfd8c7gdispwrd26-vm-test-run-wayland-proxy-virtwl.drv
warning: ignoring the client-specified setting 'store', because it is a restricted setting and you are not a trusted user
failed checks.x86_64-linux.service-dummy-test-from-flake 3h 0m
setup: don't know how to build these paths: /nix/store/ds6w39744by6cs8gy7h23m0pivsifhqq-container-test-run-service-dummy-test-from-flake.drv warning: ignoring …
setup:
don't know how to build these paths:
  /nix/store/ds6w39744by6cs8gy7h23m0pivsifhqq-container-test-run-service-dummy-test-from-flake.drv
warning: ignoring the client-specified setting 'store', because it is a restricted setting and you are not a trusted user
9m8d7612qr0i62ymz6x1hj47hnby6k76-offline-flake-for-test-service-dummy-test-from-flake.drv: error: gRPC QueryValidPaths on 'nix-store.geninf.io:50051' failed: error: substituter 'https://cache.geninf.io' is disabled
failed checks.x86_64-linux.template-minimal 3h 0m
setup: don't know how to build these paths: /nix/store/dylb7vm1rz1b0ygxykf6gav8h4fwfzwv-nixos-system-testmachine-26.11.20260924.34ca302.drv warning: ignoring …
setup:
don't know how to build these paths:
  /nix/store/dylb7vm1rz1b0ygxykf6gav8h4fwfzwv-nixos-system-testmachine-26.11.20260924.34ca302.drv
warning: ignoring the client-specified setting 'store', because it is a restricted setting and you are not a trusted user
6dm8bw3slk97b53ril5hhwdzv2pv0w2x-system-path.drv: error: gRPC QueryValidPaths on 'nix-store.geninf.io:50051' failed: error: unable to download 'https://cache.clan.lol/6dm8bw3slk97b53ril5hhwdzv2pv0w2x.narinfo': HTTP error 503

              response body:

              <?xml version="1.0" encoding="UTF-8" standalone="yes"?>
              <Error>
                  <Code>SlowDown</Code>
                  <Message>Your account has made too many requests; try again later.</Message>
              </Error>
82z17g7h65djnn99zyryzdny7r7yn7j6-boot.json.drv: error: gRPC QueryValidPaths on 'nix-store.geninf.io:50051' failed: error: substituter 'https://cache.geninf.io' is disabled
lpn7mfib3i6gn0jm8hksakm8l6r30l36-etc-nix-registry.json.drv: gi-build-x86-01: not scheduled here: lpn7mfib3i6gn0jm8hksakm8l6r30l36-etc-nix-registry.json.drv, asking the scheduler again
failed checks.x86_64-linux.treefmt 3h 0m
treefmt-check: build-x86-01: building 6qbqb3iqficzzqx7qblfrw1lpzxcbxjn-treefmt-check.drv treefmt v2.6.0traversed 1082 files emitted 920 files for processing for …
treefmt-check:
build-x86-01: building 6qbqb3iqficzzqx7qblfrw1lpzxcbxjn-treefmt-check.drv
treefmt v2.6.0traversed 1082 files
emitted 920 files for processing
formatted 920 files (0 changed) in 4.201s
7 succeeded
succeeded attributes
status attribute duration
loading…
68 already built
skipped attributes
status attribute duration
loading…