nixbot

builds

clan/clan-core build #771 failed

branch main · PR #5970 · commit 45c5262eae · · took 19m 55s · eval 1m 16s

eval warnings 19 kinds · 51 occurrences
  • error Cannot build '/nix/store/…-generator-state-version.drv'. ×9
  • error Cannot build '/nix/store/…-test-vars-generated.drv'. ×11
  • error ×13
  • error Cannot build '/nix/store/…-merged-test-dir-hello-service.drv'. ×1
  • error Cannot build '/nix/store/…-merged-test-dir-localbackup.drv'. ×1
  • error Cannot build '/nix/store/…-generator-machine-id.drv'. ×1
  • error Cannot build '/nix/store/…-merged-test-dir-service-machine-id.drv'. ×1
  • error Cannot build '/nix/store/…-generator-grafana-admin.drv'. ×1
  • error Cannot build '/nix/store/…-merged-test-dir-monitoring.drv'. ×1
  • error Cannot build '/nix/store/…-merged-test-dir-kde.drv'. ×1
  • error Cannot build '/nix/store/…-merged-test-dir-nixos-test-password-store-mounts.drv'. ×1
  • error Cannot build '/nix/store/…-merged-test-dir-packages.drv'. ×1
  • error Cannot build '/nix/store/…-merged-test-dir-service-postgresql.drv'. ×1
  • error Cannot build '/nix/store/…-merged-test-dir-service-state-version.drv'. ×1
  • error Cannot build '/nix/store/…-merged-test-dir-trusted-nix-caches.drv'. ×1
  • error Cannot build '/nix/store/…-merged-test-dir-zerotier-multi-instance.drv'. ×1
  • warn stdenv.isDarwin is deprecated, use stdenv.hostPlatform.isDarwin instead ×2
  • warn Database 'matrix-synapse' configured for backup in clan.core.postgresql.backupDatabases.matrix-synapse ×2
  • warn file 'nar/0j4bang2lixa9a7ydxls6ikk2pk1lk191idqafyya1q2z8xqf6lv.nar.zst' does not exist in binary cache 'https://cache.clan.lol/…' ×1

17 failed
failed attributes
status attribute duration
failed checks.aarch64-darwin.all-packages 2m 14s
setup: bnsq12xnw4ra2qpbq7avmdwvhrbysf90-all-packages.drv: build02: build02: input not substitutable: error: path '/nix/store/m59zq8560lx9bbq38gq4qn5qca5bv57g-py …
setup:
bnsq12xnw4ra2qpbq7avmdwvhrbysf90-all-packages.drv: build02: build02: input not substitutable: error: path '/nix/store/m59zq8560lx9bbq38gq4qn5qca5bv57g-python3.14-datamodel-code-generator-0.52.1' is required, but there is no substituter that can build it, asking the scheduler again
bnsq12xnw4ra2qpbq7avmdwvhrbysf90-all-packages.drv: build02: build02: input not substitutable: error: path '/nix/store/m59zq8560lx9bbq38gq4qn5qca5bv57g-python3.14-datamodel-code-generator-0.52.1' is required, but there is no substituter that can build it, asking the scheduler again
bnsq12xnw4ra2qpbq7avmdwvhrbysf90-all-packages.drv: build02: build02: input not substitutable: error: path '/nix/store/m59zq8560lx9bbq38gq4qn5qca5bv57g-python3.14-datamodel-code-generator-0.52.1' is required, but there is no substituter that can build it, asking the scheduler again
bnsq12xnw4ra2qpbq7avmdwvhrbysf90-all-packages.drv: build02: build02: input not substitutable: error: path '/nix/store/m59zq8560lx9bbq38gq4qn5qca5bv57g-python3.14-datamodel-code-generator-0.52.1' is required, but there is no substituter that can build it, asking the scheduler again
bnsq12xnw4ra2qpbq7avmdwvhrbysf90-all-packages.drv: build02: build02: input not substitutable: error: path '/nix/store/m59zq8560lx9bbq38gq4qn5qca5bv57g-python3.14-datamodel-code-generator-0.52.1' is required, but there is no substituter that can build it, asking the scheduler again
bnsq12xnw4ra2qpbq7avmdwvhrbysf90-all-packages.drv: build02: build02: input not substitutable: error: path '/nix/store/m59zq8560lx9bbq38gq4qn5qca5bv57g-python3.14-datamodel-code-generator-0.52.1' is required, but there is no substituter that can build it, asking the scheduler again
bnsq12xnw4ra2qpbq7avmdwvhrbysf90-all-packages.drv: build02: build02: input not substitutable: error: path '/nix/store/m59zq8560lx9bbq38gq4qn5qca5bv57g-python3.14-datamodel-code-generator-0.52.1' is required, but there is no substituter that can build it, asking the scheduler again
error: gave up after 9 reschedules
failed checks.aarch64-darwin.treefmt 28s
treefmt-check: machines.machine = { clan.core.postgresql.enable = true; - clan.core.postgresql.backupDatabases.test = {}; + …
treefmt-check:
 
           machines.machine = {
             clan.core.postgresql.enable = true;
-            clan.core.postgresql.backupDatabases.test = {};
+            clan.core.postgresql.backupDatabases.test = { };
 
             services.postgresql.ensureDatabases = [ "test" ];
             services.postgresql.ensureUsers = [
failed eval checks.aarch64-linux.hello-service —
error: … while evaluating the attribute 'drvPath' at «https://releases.nixos.org/nixpkgs/nixpkgs-26.11pre1078010.b6c98e9e6633/nixexprs.tar.xz?na …
error:
       … while evaluating the attribute 'drvPath'
         at «https://releases.nixos.org/nixpkgs/nixpkgs-26.11pre1078010.b6c98e9e6633/nixexprs.tar.xz?narHash=sha256-wQZif6Lyrg1IDl8k68Gwa3OK9PermeRsjdKgso4K1VA%3D»/lib/customisation.nix:416:11:
          415|         // {
          416|           drvPath =
             |           ^
          417|             assert condition;

       … while calling the 'derivationStrict' builtin
         at «nix-internal»/derivation-internal.nix:37:12:
           36|
           37|   strict = derivationStrict drvAttrs;
             |            ^
           38|

       … while evaluating the option `driverConfiguration.vlans':

       … while evaluating definitions from `/nix/store/b5yz03mfyd67drnilplad1drbxbkap1w-source/nixos/lib/testing/driver-configuration.nix':

       … while evaluating the option `containers.peer1.networking.interfaces':

       … while evaluating definitions from `/nix/store/b5yz03mfyd67drnilplad1drbxbkap1w-source/nixos/modules/hardware/facter/networking':

       … while evaluating the option `containers.peer1.hardware.facter.enable':

       … while evaluating the option `containers.peer1.hardware.facter.report':

       … while evaluating the option `containers.peer1.hardware.facter.reportPath':

       … while evaluating definitions from `/nix/store/s46yqyhiwyb3n259r2qq1jbn2h4l38hp-source/nixosModules/clanCore/nixos-facter.nix':

       (stack trace truncated; use '--show-trace' to show the full, detailed trace)

       error: Cannot build '/nix/store/15a949chgf4lq3gg8afaacqw9ybf94y6-merged-test-dir-hello-service.drv'.
       Reason: 1 dependency failed.
       Output paths:
         /nix/store/j1mhsajhr3hykkmrb0h1pb4fphlz7zmk-merged-test-dir-hello-service
failed eval checks.aarch64-linux.kde —
error: … while evaluating the attribute 'drvPath' at «https://releases.nixos.org/nixpkgs/nixpkgs-26.11pre1078010.b6c98e9e6633/nixexprs.tar.xz?na …
error:
       … while evaluating the attribute 'drvPath'
         at «https://releases.nixos.org/nixpkgs/nixpkgs-26.11pre1078010.b6c98e9e6633/nixexprs.tar.xz?narHash=sha256-wQZif6Lyrg1IDl8k68Gwa3OK9PermeRsjdKgso4K1VA%3D»/lib/customisation.nix:416:11:
          415|         // {
          416|           drvPath =
             |           ^
          417|             assert condition;

       … while calling the 'derivationStrict' builtin
         at «nix-internal»/derivation-internal.nix:37:12:
           36|
           37|   strict = derivationStrict drvAttrs;
             |            ^
           38|

       … while evaluating the option `driverConfiguration.vlans':

       … while evaluating definitions from `/nix/store/b5yz03mfyd67drnilplad1drbxbkap1w-source/nixos/lib/testing/driver-configuration.nix':

       … while evaluating the option `containers.client.networking.interfaces':

       … while evaluating definitions from `/nix/store/b5yz03mfyd67drnilplad1drbxbkap1w-source/nixos/modules/hardware/facter/networking':

       … while evaluating the option `containers.client.hardware.facter.enable':

       … while evaluating the option `containers.client.hardware.facter.report':

       … while evaluating the option `containers.client.hardware.facter.reportPath':

       … while evaluating definitions from `/nix/store/s46yqyhiwyb3n259r2qq1jbn2h4l38hp-source/nixosModules/clanCore/nixos-facter.nix':

       (stack trace truncated; use '--show-trace' to show the full, detailed trace)

       error: Cannot build '/nix/store/nrphaicbbjvdczs7gxg3wxacxnzkd1gg-merged-test-dir-kde.drv'.
       Reason: 1 dependency failed.
       Output paths:
         /nix/store/adrkf0xgnr4l9839z3wkjvdhmd4c8gs1-merged-test-dir-kde
failed eval checks.aarch64-linux.localbackup —
error: … while evaluating the attribute 'drvPath' at «https://releases.nixos.org/nixpkgs/nixpkgs-26.11pre1078010.b6c98e9e6633/nixexprs.tar.xz?na …
error:
       … while evaluating the attribute 'drvPath'
         at «https://releases.nixos.org/nixpkgs/nixpkgs-26.11pre1078010.b6c98e9e6633/nixexprs.tar.xz?narHash=sha256-wQZif6Lyrg1IDl8k68Gwa3OK9PermeRsjdKgso4K1VA%3D»/lib/customisation.nix:416:11:
          415|         // {
          416|           drvPath =
             |           ^
          417|             assert condition;

       … while calling the 'derivationStrict' builtin
         at «nix-internal»/derivation-internal.nix:37:12:
           36|
           37|   strict = derivationStrict drvAttrs;
             |            ^
           38|

       … while evaluating the option `driverConfiguration.vlans':

       … while evaluating definitions from `/nix/store/b5yz03mfyd67drnilplad1drbxbkap1w-source/nixos/lib/testing/driver-configuration.nix':

       … while evaluating the option `containers.machine.networking.interfaces':

       … while evaluating definitions from `/nix/store/b5yz03mfyd67drnilplad1drbxbkap1w-source/nixos/modules/hardware/facter/networking':

       … while evaluating the option `containers.machine.hardware.facter.enable':

       … while evaluating the option `containers.machine.hardware.facter.report':

       … while evaluating the option `containers.machine.hardware.facter.reportPath':

       … while evaluating definitions from `/nix/store/s46yqyhiwyb3n259r2qq1jbn2h4l38hp-source/nixosModules/clanCore/nixos-facter.nix':

       (stack trace truncated; use '--show-trace' to show the full, detailed trace)

       error: Cannot build '/nix/store/3ggbd2jpcfxaba1yc91vvay0p59sl3x4-merged-test-dir-localbackup.drv'.
       Reason: 1 dependency failed.
       Output paths:
         /nix/store/z8h2byqv64ap17iz2cqb0q7175bj07r2-merged-test-dir-localbackup
failed eval checks.aarch64-linux.machine-id —
error: … while evaluating the attribute 'drvPath' at «https://releases.nixos.org/nixpkgs/nixpkgs-26.11pre1078010.b6c98e9e6633/nixexprs.tar.xz?na …
error:
       … while evaluating the attribute 'drvPath'
         at «https://releases.nixos.org/nixpkgs/nixpkgs-26.11pre1078010.b6c98e9e6633/nixexprs.tar.xz?narHash=sha256-wQZif6Lyrg1IDl8k68Gwa3OK9PermeRsjdKgso4K1VA%3D»/lib/customisation.nix:416:11:
          415|         // {
          416|           drvPath =
             |           ^
          417|             assert condition;

       … while calling the 'derivationStrict' builtin
         at «nix-internal»/derivation-internal.nix:37:12:
           36|
           37|   strict = derivationStrict drvAttrs;
             |            ^
           38|

       … while evaluating the option `driverConfiguration.vlans':

       … while evaluating definitions from `/nix/store/b5yz03mfyd67drnilplad1drbxbkap1w-source/nixos/lib/testing/driver-configuration.nix':

       … while evaluating the option `containers.server.networking.interfaces':

       … while evaluating definitions from `/nix/store/b5yz03mfyd67drnilplad1drbxbkap1w-source/nixos/modules/hardware/facter/networking':

       … while evaluating the option `containers.server.hardware.facter.enable':

       … while evaluating the option `containers.server.hardware.facter.report':

       … while evaluating the option `containers.server.hardware.facter.reportPath':

       … while evaluating definitions from `/nix/store/s46yqyhiwyb3n259r2qq1jbn2h4l38hp-source/nixosModules/clanCore/nixos-facter.nix':

       (stack trace truncated; use '--show-trace' to show the full, detailed trace)

       error: Cannot build '/nix/store/9b3gd9v67ffz0vd6h7hqk4nzy4dry8cb-merged-test-dir-service-machine-id.drv'.
       Reason: 1 dependency failed.
       Output paths:
         /nix/store/frx9ga4m7nbqry1ci6n9rxphd8b522al-merged-test-dir-service-machine-id
failed eval checks.aarch64-linux.monitoring —
error: … while evaluating the attribute 'drvPath' at «https://releases.nixos.org/nixpkgs/nixpkgs-26.11pre1078010.b6c98e9e6633/nixexprs.tar.xz?na …
error:
       … while evaluating the attribute 'drvPath'
         at «https://releases.nixos.org/nixpkgs/nixpkgs-26.11pre1078010.b6c98e9e6633/nixexprs.tar.xz?narHash=sha256-wQZif6Lyrg1IDl8k68Gwa3OK9PermeRsjdKgso4K1VA%3D»/lib/customisation.nix:416:11:
          415|         // {
          416|           drvPath =
             |           ^
          417|             assert condition;

       … while calling the 'derivationStrict' builtin
         at «nix-internal»/derivation-internal.nix:37:12:
           36|
           37|   strict = derivationStrict drvAttrs;
             |            ^
           38|

       … while evaluating the option `driverConfiguration.vlans':

       … while evaluating definitions from `/nix/store/b5yz03mfyd67drnilplad1drbxbkap1w-source/nixos/lib/testing/driver-configuration.nix':

       … while evaluating the option `containers.machine1.networking.interfaces':

       … while evaluating definitions from `/nix/store/b5yz03mfyd67drnilplad1drbxbkap1w-source/nixos/modules/hardware/facter/networking':

       … while evaluating the option `containers.machine1.hardware.facter.enable':

       … while evaluating the option `containers.machine1.hardware.facter.report':

       … while evaluating the option `containers.machine1.hardware.facter.reportPath':

       … while evaluating definitions from `/nix/store/s46yqyhiwyb3n259r2qq1jbn2h4l38hp-source/nixosModules/clanCore/nixos-facter.nix':

       (stack trace truncated; use '--show-trace' to show the full, detailed trace)

       error: Cannot build '/nix/store/lla6dvjyh7fry2igkcq6sf5qlrh51gv6-merged-test-dir-monitoring.drv'.
       Reason: 1 dependency failed.
       Output paths:
         /nix/store/px1qlq8mwwdrqaw83smbzz892kj79xba-merged-test-dir-monitoring
failed eval checks.aarch64-linux.nixos-test-password-store-mounts —
error: … while evaluating the attribute 'drvPath' at «https://releases.nixos.org/nixpkgs/nixpkgs-26.11pre1078010.b6c98e9e6633/nixexprs.tar.xz?na …
error:
       … while evaluating the attribute 'drvPath'
         at «https://releases.nixos.org/nixpkgs/nixpkgs-26.11pre1078010.b6c98e9e6633/nixexprs.tar.xz?narHash=sha256-wQZif6Lyrg1IDl8k68Gwa3OK9PermeRsjdKgso4K1VA%3D»/lib/customisation.nix:416:11:
          415|         // {
          416|           drvPath =
             |           ^
          417|             assert condition;

       … while calling the 'derivationStrict' builtin
         at «nix-internal»/derivation-internal.nix:37:12:
           36|
           37|   strict = derivationStrict drvAttrs;
             |            ^
           38|

       … while evaluating the option `driverConfiguration.vlans':

       … while evaluating definitions from `/nix/store/b5yz03mfyd67drnilplad1drbxbkap1w-source/nixos/lib/testing/driver-configuration.nix':

       … while evaluating the option `nodes.machine.networking.interfaces':

       … while evaluating definitions from `/nix/store/b5yz03mfyd67drnilplad1drbxbkap1w-source/nixos/modules/hardware/facter/networking':

       … while evaluating the option `nodes.machine.hardware.facter.enable':

       … while evaluating the option `nodes.machine.hardware.facter.report':

       … while evaluating the option `nodes.machine.hardware.facter.reportPath':

       … while evaluating definitions from `/nix/store/s46yqyhiwyb3n259r2qq1jbn2h4l38hp-source/nixosModules/clanCore/nixos-facter.nix':

       (stack trace truncated; use '--show-trace' to show the full, detailed trace)

       error: Cannot build '/nix/store/f8dhid1g8f4xyrk2j26mxk00b1y1ad13-merged-test-dir-nixos-test-password-store-mounts.drv'.
       Reason: 1 dependency failed.
       Output paths:
         /nix/store/7z7p2lidw3fvpbqf15h7xr7p03g33jjz-merged-test-dir-nixos-test-password-store-mounts
failed eval checks.aarch64-linux.packages —
error: … while evaluating the attribute 'drvPath' at «https://releases.nixos.org/nixpkgs/nixpkgs-26.11pre1078010.b6c98e9e6633/nixexprs.tar.xz?na …
error:
       … while evaluating the attribute 'drvPath'
         at «https://releases.nixos.org/nixpkgs/nixpkgs-26.11pre1078010.b6c98e9e6633/nixexprs.tar.xz?narHash=sha256-wQZif6Lyrg1IDl8k68Gwa3OK9PermeRsjdKgso4K1VA%3D»/lib/customisation.nix:416:11:
          415|         // {
          416|           drvPath =
             |           ^
          417|             assert condition;

       … while calling the 'derivationStrict' builtin
         at «nix-internal»/derivation-internal.nix:37:12:
           36|
           37|   strict = derivationStrict drvAttrs;
             |            ^
           38|

       … while evaluating the option `driverConfiguration.vlans':

       … while evaluating definitions from `/nix/store/b5yz03mfyd67drnilplad1drbxbkap1w-source/nixos/lib/testing/driver-configuration.nix':

       … while evaluating the option `containers.server.networking.interfaces':

       … while evaluating definitions from `/nix/store/b5yz03mfyd67drnilplad1drbxbkap1w-source/nixos/modules/hardware/facter/networking':

       … while evaluating the option `containers.server.hardware.facter.enable':

       … while evaluating the option `containers.server.hardware.facter.report':

       … while evaluating the option `containers.server.hardware.facter.reportPath':

       … while evaluating definitions from `/nix/store/s46yqyhiwyb3n259r2qq1jbn2h4l38hp-source/nixosModules/clanCore/nixos-facter.nix':

       (stack trace truncated; use '--show-trace' to show the full, detailed trace)

       error: Cannot build '/nix/store/520mx12zld0j5ja9jdvr05lg26zh7xwi-merged-test-dir-packages.drv'.
       Reason: 1 dependency failed.
       Output paths:
         /nix/store/28vmfx1hjzh0g8g6s2vamb1wwa0c4mwk-merged-test-dir-packages
failed eval checks.aarch64-linux.postgresql —
error: … while evaluating the attribute 'drvPath' at «https://releases.nixos.org/nixpkgs/nixpkgs-26.11pre1078010.b6c98e9e6633/nixexprs.tar.xz?na …
error:
       … while evaluating the attribute 'drvPath'
         at «https://releases.nixos.org/nixpkgs/nixpkgs-26.11pre1078010.b6c98e9e6633/nixexprs.tar.xz?narHash=sha256-wQZif6Lyrg1IDl8k68Gwa3OK9PermeRsjdKgso4K1VA%3D»/lib/customisation.nix:416:11:
          415|         // {
          416|           drvPath =
             |           ^
          417|             assert condition;

       … while calling the 'derivationStrict' builtin
         at «nix-internal»/derivation-internal.nix:37:12:
           36|
           37|   strict = derivationStrict drvAttrs;
             |            ^
           38|

       … while evaluating the option `driverConfiguration.vlans':

       … while evaluating definitions from `/nix/store/b5yz03mfyd67drnilplad1drbxbkap1w-source/nixos/lib/testing/driver-configuration.nix':

       … while evaluating the option `containers.machine.networking.interfaces':

       … while evaluating definitions from `/nix/store/b5yz03mfyd67drnilplad1drbxbkap1w-source/nixos/modules/hardware/facter/networking':

       … while evaluating the option `containers.machine.hardware.facter.enable':

       … while evaluating the option `containers.machine.hardware.facter.report':

       … while evaluating the option `containers.machine.hardware.facter.reportPath':

       … while evaluating definitions from `/nix/store/s46yqyhiwyb3n259r2qq1jbn2h4l38hp-source/nixosModules/clanCore/nixos-facter.nix':

       (stack trace truncated; use '--show-trace' to show the full, detailed trace)

       error: Cannot build '/nix/store/ikhln6pvqnv7mhkcp9mani9mp369h43i-merged-test-dir-service-postgresql.drv'.
       Reason: 1 dependency failed.
       Output paths:
         /nix/store/k9zk06ixv96h39xrcj2gwaxxcmqdqfm1-merged-test-dir-service-postgresql
failed eval checks.aarch64-linux.state-version —
error: … while evaluating the attribute 'drvPath' at «https://releases.nixos.org/nixpkgs/nixpkgs-26.11pre1078010.b6c98e9e6633/nixexprs.tar.xz?na …
error:
       … while evaluating the attribute 'drvPath'
         at «https://releases.nixos.org/nixpkgs/nixpkgs-26.11pre1078010.b6c98e9e6633/nixexprs.tar.xz?narHash=sha256-wQZif6Lyrg1IDl8k68Gwa3OK9PermeRsjdKgso4K1VA%3D»/lib/customisation.nix:416:11:
          415|         // {
          416|           drvPath =
             |           ^
          417|             assert condition;

       … while calling the 'derivationStrict' builtin
         at «nix-internal»/derivation-internal.nix:37:12:
           36|
           37|   strict = derivationStrict drvAttrs;
             |            ^
           38|

       … while evaluating the option `driverConfiguration.vlans':

       … while evaluating definitions from `/nix/store/b5yz03mfyd67drnilplad1drbxbkap1w-source/nixos/lib/testing/driver-configuration.nix':

       … while evaluating the option `containers.server.networking.interfaces':

       … while evaluating definitions from `/nix/store/b5yz03mfyd67drnilplad1drbxbkap1w-source/nixos/modules/hardware/facter/networking':

       … while evaluating the option `containers.server.hardware.facter.enable':

       … while evaluating the option `containers.server.hardware.facter.report':

       … while evaluating the option `containers.server.hardware.facter.reportPath':

       … while evaluating definitions from `/nix/store/s46yqyhiwyb3n259r2qq1jbn2h4l38hp-source/nixosModules/clanCore/nixos-facter.nix':

       (stack trace truncated; use '--show-trace' to show the full, detailed trace)

       error: Cannot build '/nix/store/yb9y787327fibhbqin9m7c4b8iywlbpc-merged-test-dir-service-state-version.drv'.
       Reason: 1 dependency failed.
       Output paths:
         /nix/store/nk9rm7knk8rngd5kpqdp9qj7hcrqqldj-merged-test-dir-service-state-version
failed checks.aarch64-linux.treefmt 30s
treefmt-check: machines.machine = { clan.core.postgresql.enable = true; - clan.core.postgresql.backupDatabases.test = {}; + …
treefmt-check:
 
           machines.machine = {
             clan.core.postgresql.enable = true;
-            clan.core.postgresql.backupDatabases.test = {};
+            clan.core.postgresql.backupDatabases.test = { };
 
             services.postgresql.ensureDatabases = [ "test" ];
             services.postgresql.ensureUsers = [
failed eval checks.aarch64-linux.trusted-nix-caches —
error: … while evaluating the attribute 'drvPath' at «https://releases.nixos.org/nixpkgs/nixpkgs-26.11pre1078010.b6c98e9e6633/nixexprs.tar.xz?na …
error:
       … while evaluating the attribute 'drvPath'
         at «https://releases.nixos.org/nixpkgs/nixpkgs-26.11pre1078010.b6c98e9e6633/nixexprs.tar.xz?narHash=sha256-wQZif6Lyrg1IDl8k68Gwa3OK9PermeRsjdKgso4K1VA%3D»/lib/customisation.nix:416:11:
          415|         // {
          416|           drvPath =
             |           ^
          417|             assert condition;

       … while calling the 'derivationStrict' builtin
         at «nix-internal»/derivation-internal.nix:37:12:
           36|
           37|   strict = derivationStrict drvAttrs;
             |            ^
           38|

       … while evaluating the option `driverConfiguration.vlans':

       … while evaluating definitions from `/nix/store/b5yz03mfyd67drnilplad1drbxbkap1w-source/nixos/lib/testing/driver-configuration.nix':

       … while evaluating the option `containers.server.networking.interfaces':

       … while evaluating definitions from `/nix/store/b5yz03mfyd67drnilplad1drbxbkap1w-source/nixos/modules/hardware/facter/networking':

       … while evaluating the option `containers.server.hardware.facter.enable':

       … while evaluating the option `containers.server.hardware.facter.report':

       … while evaluating the option `containers.server.hardware.facter.reportPath':

       … while evaluating definitions from `/nix/store/s46yqyhiwyb3n259r2qq1jbn2h4l38hp-source/nixosModules/clanCore/nixos-facter.nix':

       (stack trace truncated; use '--show-trace' to show the full, detailed trace)

       error: Cannot build '/nix/store/w4dg2xppmnynkhfpgibi5dfisgf1yyab-merged-test-dir-trusted-nix-caches.drv'.
       Reason: 1 dependency failed.
       Output paths:
         /nix/store/wjyjng3hnwl4ckhpmc6rji40dmxz7j9x-merged-test-dir-trusted-nix-caches
failed eval checks.aarch64-linux.zerotier-multi-instance —
error: … while evaluating the attribute 'drvPath' at «https://releases.nixos.org/nixpkgs/nixpkgs-26.11pre1078010.b6c98e9e6633/nixexprs.tar.xz?na …
error:
       … while evaluating the attribute 'drvPath'
         at «https://releases.nixos.org/nixpkgs/nixpkgs-26.11pre1078010.b6c98e9e6633/nixexprs.tar.xz?narHash=sha256-wQZif6Lyrg1IDl8k68Gwa3OK9PermeRsjdKgso4K1VA%3D»/lib/customisation.nix:416:11:
          415|         // {
          416|           drvPath =
             |           ^
          417|             assert condition;

       … while calling the 'derivationStrict' builtin
         at «nix-internal»/derivation-internal.nix:37:12:
           36|
           37|   strict = derivationStrict drvAttrs;
             |            ^
           38|

       … while evaluating the option `driverConfiguration.vlans':

       … while evaluating definitions from `/nix/store/b5yz03mfyd67drnilplad1drbxbkap1w-source/nixos/lib/testing/driver-configuration.nix':

       … while evaluating the option `nodes.alpha.networking.interfaces':

       … while evaluating definitions from `/nix/store/b5yz03mfyd67drnilplad1drbxbkap1w-source/nixos/modules/hardware/facter/networking':

       … while evaluating the option `nodes.alpha.hardware.facter.enable':

       … while evaluating the option `nodes.alpha.hardware.facter.report':

       … while evaluating the option `nodes.alpha.hardware.facter.reportPath':

       … while evaluating definitions from `/nix/store/s46yqyhiwyb3n259r2qq1jbn2h4l38hp-source/nixosModules/clanCore/nixos-facter.nix':

       (stack trace truncated; use '--show-trace' to show the full, detailed trace)

       error: Cannot build '/nix/store/n5vdssnsa6vrczhzwcfkjws152xaj56j-merged-test-dir-zerotier-multi-instance.drv'.
       Reason: 1 dependency failed.
       Output paths:
         /nix/store/80d1ci4qhghb4kgppg9cpbaw7f4dm1y1-merged-test-dir-zerotier-multi-instance
failed checks.x86_64-linux.dm-dns 19m 13s
container-test-run-dm-dns: !!! !!! RequestedAssertionFailed: action timed out after 900.40 seconds (timeout=900.0) cleanup kill NspawnMachine (pid 53) kill Nsp …
container-test-run-dm-dns:
!!! 
!!! RequestedAssertionFailed: action timed out after 900.40 seconds (timeout=900.0)
cleanup
kill NspawnMachine (pid 53)
kill NspawnMachine (pid 52)
Container client terminated by signal KILL.
Container server terminated by signal KILL.
(finished: cleanup, in 0.18 seconds)
failed eval checks.x86_64-linux.monitoring —
error: … while evaluating the attribute 'drvPath' at «https://releases.nixos.org/nixpkgs/nixpkgs-26.11pre1078010.b6c98e9e6633/nixexprs.tar.xz?na …
error:
       … while evaluating the attribute 'drvPath'
         at «https://releases.nixos.org/nixpkgs/nixpkgs-26.11pre1078010.b6c98e9e6633/nixexprs.tar.xz?narHash=sha256-wQZif6Lyrg1IDl8k68Gwa3OK9PermeRsjdKgso4K1VA%3D»/lib/customisation.nix:416:11:
          415|         // {
          416|           drvPath =
             |           ^
          417|             assert condition;

       … while calling the 'derivationStrict' builtin
         at «nix-internal»/derivation-internal.nix:37:12:
           36|
           37|   strict = derivationStrict drvAttrs;
             |            ^
           38|

       … while evaluating the option `driverConfiguration.containers.machine1.start_script':

       … while evaluating definitions from `/nix/store/b5yz03mfyd67drnilplad1drbxbkap1w-source/nixos/lib/testing/driver-configuration.nix':

       … while evaluating definitions from `/nix/store/b5yz03mfyd67drnilplad1drbxbkap1w-source/nixos/modules/virtualisation/nspawn-container':

       … while evaluating the option `containers.machine1.system.build.toplevel':

       … while evaluating definitions from `/nix/store/b5yz03mfyd67drnilplad1drbxbkap1w-source/nixos/modules/system/activation/top-level.nix':

       (stack trace truncated; use '--show-trace' to show the full, detailed trace)

       error:
       Failed assertions:
       - The option definition `clan.core.postgresql.databases' in `/nix/store/s46yqyhiwyb3n259r2qq1jbn2h4l38hp-source/clanServices/monitoring/default.nix, via option clan._services.allServices.self-monitoring.roles.server.perInstance, via option nixosModule' no longer has any effect; please remove it.
       Use services.postgresql.ensureDatabases for database provisioning and clan.core.postgresql.backupDatabases for backup configuration.

       - The option definition `clan.core.postgresql.users' in `/nix/store/s46yqyhiwyb3n259r2qq1jbn2h4l38hp-source/clanServices/monitoring/default.nix, via option clan._services.allServices.self-monitoring.roles.server.perInstance, via option nixosModule' no longer has any effect; please remove it.
       Use services.postgresql.ensureUsers instead. See https://search.nixos.org/options?show=services.postgresql.ensureUsers
failed checks.x86_64-linux.treefmt 44s
treefmt-check: machines.machine = { clan.core.postgresql.enable = true; - clan.core.postgresql.backupDatabases.test = {}; + …
treefmt-check:
 
           machines.machine = {
             clan.core.postgresql.enable = true;
-            clan.core.postgresql.backupDatabases.test = {};
+            clan.core.postgresql.backupDatabases.test = { };
 
             services.postgresql.ensureDatabases = [ "test" ];
             services.postgresql.ensureUsers = [
31 succeeded ⚠ 5
succeeded attributes
status attribute duration
succeeded checks.aarch64-linux.all-packages
  • stdenv.isDarwin is deprecated, use stdenv.hostPlatform.isDarwin instead
2m 54s
succeeded checks.aarch64-linux.matrix-synapse
  • Database 'matrix-synapse' configured for backup in clan.core.postgresql.backupDatabases.matrix-synapse is not listed in services.postgresql.ensureDatabases. This is fine when the database is provisioned by its service (e.g. because it requires custom collation).
6m 31s
succeeded checks.x86_64-linux.all-packages
  • stdenv.isDarwin is deprecated, use stdenv.hostPlatform.isDarwin instead
3m 29s
succeeded checks.x86_64-linux.matrix-synapse
  • Database 'matrix-synapse' configured for backup in clan.core.postgresql.backupDatabases.matrix-synapse is not listed in services.postgresql.ensureDatabases. This is fine when the database is provisioned by its service (e.g. because it requires custom collation).
4m 32s
succeeded checks.x86_64-linux.postgresql
3m 45s
succeeded checks.aarch64-darwin.clan-pytest-with-core 6m 13s
succeeded checks.aarch64-darwin.devShell-clan-site 54s
succeeded checks.aarch64-darwin.eval-tests 2m 58s
succeeded checks.aarch64-linux.clan-pytest-with-core 2m 43s
succeeded checks.aarch64-linux.clan-site-lint 2m 41s
succeeded checks.aarch64-linux.clan-test-iso 8m 29s
succeeded checks.aarch64-linux.devShell-clan-site 27s
succeeded checks.aarch64-linux.devShell-docs 25s
succeeded checks.aarch64-linux.eval-tests 3m 8s
succeeded checks.aarch64-linux.nixos-documentation 3m 11s
succeeded checks.aarch64-linux.service-dummy-test-from-flake 3m 27s
succeeded checks.x86_64-linux.clan-pytest-with-core 2m 25s
succeeded checks.x86_64-linux.clan-site-lint 3m 12s
succeeded checks.x86_64-linux.clan-test-iso 7m 30s
succeeded checks.x86_64-linux.clan-test-update 12m 35s
succeeded checks.x86_64-linux.devShell-clan-site 1m 32s
succeeded checks.x86_64-linux.devShell-docs 1m 24s
succeeded checks.x86_64-linux.eval-tests 3m 9s
succeeded checks.x86_64-linux.machine-id 17s
succeeded checks.x86_64-linux.nixos-documentation 2m 54s
succeeded checks.x86_64-linux.nixos-test-flash 5m 43s
succeeded checks.x86_64-linux.nixos-test-installation 6m 42s
succeeded checks.x86_64-linux.nixos-test-installation-age 6m 26s
succeeded checks.x86_64-linux.nixos-test-installation-password-store 6m 41s
succeeded checks.x86_64-linux.nixos-test-update-hardware-configuration 3m 16s
succeeded checks.x86_64-linux.service-dummy-test-from-flake 3m 26s
102 already built
skipped attributes
status attribute duration
loading…