nixbot

builds

clan/clan-core build #772 failed

branch 26.05 · PR #8138 · commit 17fbe75608 · · took 14m 53s · eval 5m 12s

eval warnings 7 kinds · 664 occurrences
  • error unable to download 'https://cache.clan.lol/…': HTTP error 503 ×56
  • error unable to download 'https://cache.geninf.io/…': HTTP error 503 ×30
  • warn unable to download 'https://cache-local.geninf.io/…': HTTP error 500 ×31
  • warn unable to download 'https://cache-local.geninf.io/…': SSL connect error (35) Recv failure: Connection reset by peer ×1
  • warn unable to download 'https://cache-local.geninf.io/…': SSL connect error (35) TLS connect error: error:0A000126:SSL routines::unexpected eof while reading ×1
  • warn unable to download 'https://cache.clan.lol/…': HTTP error 503 ×333
  • warn unable to download 'https://cache.geninf.io/…': HTTP error 503 ×212

112 failed
failed attributes
status attribute duration
failed checks.aarch64-darwin.all-packages 7m 38s
setup: don't know how to build these paths: /nix/store/6jw2qxm0apwf0azw8r4x79788j2li3kr-all-packages.drv warning: ignoring the client-specified setting 'store …
setup:
don't know how to build these paths:
  /nix/store/6jw2qxm0apwf0azw8r4x79788j2li3kr-all-packages.drv
warning: ignoring the client-specified setting 'store', because it is a restricted setting and you are not a trusted user
error: gRPC QueryValidPaths on 'nix-store.geninf.io:50051' failed: error: unable to download 'https://cache.geninf.io/f2lv99gr7xz4kdkn5bxdrsrsqlkkc6fv.narinfo': HTTP error 503

              response body:

              <?xml version="1.0" encoding="UTF-8" standalone="yes"?>
              <Error>
                  <Code>SlowDown</Code>
                  <Message>Your account has made too many requests; try again later.</Message>
              </Error>
failed checks.aarch64-darwin.clan-app-ui-lint 1m 57s
setup: /nix/store/476zsjqic4kbjk43p27m165b5flfqr8l-zlib-1.3.2 /nix/store/nc18xhxz6k4svwsz72nmh2w3nrwqar7v-zlib-1.3.2-dev /nix/store/600wx4h47gwbfm2j59v33w …
setup:
  /nix/store/476zsjqic4kbjk43p27m165b5flfqr8l-zlib-1.3.2
  /nix/store/nc18xhxz6k4svwsz72nmh2w3nrwqar7v-zlib-1.3.2-dev
  /nix/store/600wx4h47gwbfm2j59v33wj0xy3ni6qz-zlib-1.3.2-static
  /nix/store/mxajghyzvi968fzv2vcwq368mxi92niw-zstd-1.5.7
  /nix/store/sj5gmvy8rr4r60sdfic9w426addgjpq3-zstd-1.5.7-bin
  /nix/store/jjlwnz5xzkxgql1v0dbbj611j6b4m469-zstd-1.5.7-dev
warning: ignoring the client-specified setting 'store', because it is a restricted setting and you are not a trusted user
error: gRPC QueryValidPaths on 'nix-store.geninf.io:50051' failed: error: unable to download 'https://cache.clan.lol/av2ny8h9mmlq581wzxry822gcqh819ib.narinfo': HTTP error 503

              response body:

              <?xml version="1.0" encoding="UTF-8" standalone="yes"?>
              <Error>
                  <Code>SlowDown</Code>
                  <Message>Your account has made too many requests; try again later.</Message>
              </Error>
failed checks.aarch64-darwin.clan-app-ui-unit-tests 1m 57s
setup: /nix/store/476zsjqic4kbjk43p27m165b5flfqr8l-zlib-1.3.2 /nix/store/nc18xhxz6k4svwsz72nmh2w3nrwqar7v-zlib-1.3.2-dev /nix/store/600wx4h47gwbfm2j59v33w …
setup:
  /nix/store/476zsjqic4kbjk43p27m165b5flfqr8l-zlib-1.3.2
  /nix/store/nc18xhxz6k4svwsz72nmh2w3nrwqar7v-zlib-1.3.2-dev
  /nix/store/600wx4h47gwbfm2j59v33wj0xy3ni6qz-zlib-1.3.2-static
  /nix/store/mxajghyzvi968fzv2vcwq368mxi92niw-zstd-1.5.7
  /nix/store/sj5gmvy8rr4r60sdfic9w426addgjpq3-zstd-1.5.7-bin
  /nix/store/jjlwnz5xzkxgql1v0dbbj611j6b4m469-zstd-1.5.7-dev
warning: ignoring the client-specified setting 'store', because it is a restricted setting and you are not a trusted user
error: gRPC QueryValidPaths on 'nix-store.geninf.io:50051' failed: error: unable to download 'https://cache.clan.lol/jai2fa5cq0q4rklzxlq32qm7kgqnd7fl.narinfo': HTTP error 503

              response body:

              <?xml version="1.0" encoding="UTF-8" standalone="yes"?>
              <Error>
                  <Code>SlowDown</Code>
                  <Message>Your account has made too many requests; try again later.</Message>
              </Error>
failed checks.aarch64-darwin.clan-deps 1m 28s
setup: don't know how to build these paths: /nix/store/ijxdd4bpbfzj9i50nsl508358fqnp966-clan-deps.drv warning: ignoring the client-specified setting 'store', …
setup:
don't know how to build these paths:
  /nix/store/ijxdd4bpbfzj9i50nsl508358fqnp966-clan-deps.drv
warning: ignoring the client-specified setting 'store', because it is a restricted setting and you are not a trusted user
error: gRPC QueryValidPaths on 'nix-store.geninf.io:50051' failed: error: unable to download 'https://cache.clan.lol/b18zl6v7dbd63ybcsh5kdpi71pvj90df.narinfo': HTTP error 503

              response body:

              <?xml version="1.0" encoding="UTF-8" standalone="yes"?>
              <Error>
                  <Code>SlowDown</Code>
                  <Message>Your account has made too many requests; try again later.</Message>
              </Error>
failed checks.aarch64-darwin.clan-pytest-with-core 42s
setup: don't know how to build these paths: /nix/store/a4n82cgy0cpjskw7plf6fypp0973q81k-clan-pytest-with-core.drv warning: ignoring the client-specified setti …
setup:
don't know how to build these paths:
  /nix/store/a4n82cgy0cpjskw7plf6fypp0973q81k-clan-pytest-with-core.drv
warning: ignoring the client-specified setting 'store', because it is a restricted setting and you are not a trusted user
error: gRPC QueryValidPaths on 'nix-store.geninf.io:50051' failed: error: unable to download 'https://cache.clan.lol/pk17bp9giqi3i1wdas12qgdfs9gjkq61.narinfo': HTTP error 503

              response body:

              <?xml version="1.0" encoding="UTF-8" standalone="yes"?>
              <Error>
                  <Code>SlowDown</Code>
                  <Message>Your account has made too many requests; try again later.</Message>
              </Error>
failed checks.aarch64-darwin.clan-pytest-without-core 2m 31s
setup: these 2 paths will be fetched (0.0 KiB download, 5.2 MiB unpacked): /nix/store/9fm74mbn9cy21lkl1bwxv78liwhxqyb5-clan-pytest-without-core /nix/store/k …
setup:
these 2 paths will be fetched (0.0 KiB download, 5.2 MiB unpacked):
  /nix/store/9fm74mbn9cy21lkl1bwxv78liwhxqyb5-clan-pytest-without-core
  /nix/store/kknw77v6hb84zz5hlzbg58xgb2x23x65-clan-runtime
warning: ignoring the client-specified setting 'store', because it is a restricted setting and you are not a trusted user
0byblbwasf6hvw7wxjigs5i681lxplcx-clan-pytest-without-core.drv: error: gRPC QueryValidPaths on 'nix-store.geninf.io:50051' failed: error: substituter 'https://cache.geninf.io' is disabled
error: error: gRPC QueryValidPaths on 'nix-store.geninf.io:50051' failed: error: substituter 'https://cache.geninf.io' is disabled
failed checks.aarch64-darwin.darwin-test-darwin-machine 9m 24s
setup: don't know how to build these paths: /nix/store/30s2h5rahc5lpqixa852igy5xfwrr5n5-darwin-system-26.05.c3e90c8.drv warning: ignoring the client-specified …
setup:
don't know how to build these paths:
  /nix/store/30s2h5rahc5lpqixa852igy5xfwrr5n5-darwin-system-26.05.c3e90c8.drv
warning: ignoring the client-specified setting 'store', because it is a restricted setting and you are not a trusted user
error: gRPC QueryValidPaths on 'nix-store.geninf.io:50051' failed: error: unable to download 'https://cache.clan.lol/hjwdssx1v2pzr56qk7isb6drpj2355a4.narinfo': HTTP error 503

              response body:

              <?xml version="1.0" encoding="UTF-8" standalone="yes"?>
              <Error>
                  <Code>SlowDown</Code>
                  <Message>Your account has made too many requests; try again later.</Message>
              </Error>
failed checks.aarch64-darwin.devshell 8m 33s
setup: don't know how to build these paths: /nix/store/j91g9c4rzag1c4rspq8c6b8y8rmac04d-check-devshell-not-depends-on-clan-cli.drv warning: ignoring the clien …
setup:
don't know how to build these paths:
  /nix/store/j91g9c4rzag1c4rspq8c6b8y8rmac04d-check-devshell-not-depends-on-clan-cli.drv
warning: ignoring the client-specified setting 'store', because it is a restricted setting and you are not a trusted user
error: gRPC QueryValidPaths on 'nix-store.geninf.io:50051' failed: error: unable to download 'https://cache.clan.lol/2n7gyzlcfb3c19pzm9x4j1a3w6j29p8m.narinfo': HTTP error 503

              response body:

              <?xml version="1.0" encoding="UTF-8" standalone="yes"?>
              <Error>
                  <Code>SlowDown</Code>
                  <Message>Your account has made too many requests; try again later.</Message>
              </Error>
failed checks.aarch64-darwin.devShell-clan-app 7m 15s
setup: don't know how to build these paths: /nix/store/3d3dx23hhdcfpdxgndaqb69c079nlnda-ui.drv warning: ignoring the client-specified setting 'store', because …
setup:
don't know how to build these paths:
  /nix/store/3d3dx23hhdcfpdxgndaqb69c079nlnda-ui.drv
warning: ignoring the client-specified setting 'store', because it is a restricted setting and you are not a trusted user
error: gRPC QueryValidPaths on 'nix-store.geninf.io:50051' failed: error: unable to download 'https://cache.clan.lol/s2rchyvmrj8s2cs6m9qj1dssp93a1dzw.narinfo': HTTP error 503

              response body:

              <?xml version="1.0" encoding="UTF-8" standalone="yes"?>
              <Error>
                  <Code>SlowDown</Code>
                  <Message>Your account has made too many requests; try again later.</Message>
              </Error>
failed checks.aarch64-darwin.devShell-clan-cli 41s
setup: don't know how to build these paths: /nix/store/gz692xnrv16a0d0xq1akx6k512v35w9w-clan-cli.drv warning: ignoring the client-specified setting 'store', b …
setup:
don't know how to build these paths:
  /nix/store/gz692xnrv16a0d0xq1akx6k512v35w9w-clan-cli.drv
warning: ignoring the client-specified setting 'store', because it is a restricted setting and you are not a trusted user
error: gRPC QueryValidPaths on 'nix-store.geninf.io:50051' failed: error: unable to download 'https://cache.clan.lol/6r1cr6gzlnm6mhjisl1v3nxrp4wca27c.narinfo': HTTP error 503

              response body:

              <?xml version="1.0" encoding="UTF-8" standalone="yes"?>
              <Error>
                  <Code>SlowDown</Code>
                  <Message>Your account has made too many requests; try again later.</Message>
              </Error>
failed checks.aarch64-darwin.devShell-clan-site 9m 32s
setup: don't know how to build these paths: /nix/store/c4mmnxc8w584bjkb7vxwv75spkaz7vp1-nix-shell.drv warning: ignoring the client-specified setting 'store', …
setup:
don't know how to build these paths:
  /nix/store/c4mmnxc8w584bjkb7vxwv75spkaz7vp1-nix-shell.drv
warning: ignoring the client-specified setting 'store', because it is a restricted setting and you are not a trusted user
error: gRPC QueryValidPaths on 'nix-store.geninf.io:50051' failed: error: substituter 'https://cache.clan.lol' is disabled
failed checks.aarch64-darwin.devShell-default 11m 16s
setup: don't know how to build these paths: /nix/store/ll0zjb2s04x10cpdq7rqw95076rdrjik-clan.drv warning: ignoring the client-specified setting 'store', becau …
setup:
don't know how to build these paths:
  /nix/store/ll0zjb2s04x10cpdq7rqw95076rdrjik-clan.drv
warning: ignoring the client-specified setting 'store', because it is a restricted setting and you are not a trusted user
error: gRPC QueryValidPaths on 'nix-store.geninf.io:50051' failed: error: substituter 'https://cache.clan.lol' is disabled
failed checks.aarch64-darwin.devShell-inventory-schema 30s
setup: don't know how to build these paths: /nix/store/z4p4js1zi81pi47g1y87n57vl6lbcwly-clan-inventory-schema.drv warning: ignoring the client-specified setti …
setup:
don't know how to build these paths:
  /nix/store/z4p4js1zi81pi47g1y87n57vl6lbcwly-clan-inventory-schema.drv
warning: ignoring the client-specified setting 'store', because it is a restricted setting and you are not a trusted user
error: gRPC QueryValidPaths on 'nix-store.geninf.io:50051' failed: error: unable to download 'https://cache.clan.lol/4cqnyavhfbg71md0kvmjhf153syszw4z.narinfo': HTTP error 503

              response body:

              <?xml version="1.0" encoding="UTF-8" standalone="yes"?>
              <Error>
                  <Code>SlowDown</Code>
                  <Message>Your account has made too many requests; try again later.</Message>
              </Error>
failed checks.aarch64-darwin.eval-tests 2m 20s
setup: don't know how to build these paths: /nix/store/dxwwmy44l7gqjvkwl2kjjqxrs1l8gjpd-eval-tests-aarch64-darwin.drv warning: ignoring the client-specified s …
setup:
don't know how to build these paths:
  /nix/store/dxwwmy44l7gqjvkwl2kjjqxrs1l8gjpd-eval-tests-aarch64-darwin.drv
warning: ignoring the client-specified setting 'store', because it is a restricted setting and you are not a trusted user
error: gRPC QueryValidPaths on 'nix-store.geninf.io:50051' failed: error: unable to download 'https://cache.clan.lol/ghvbr5b75agvr3dqlzlfdcvii5fiamd1.narinfo': HTTP error 503

              response body:

              <?xml version="1.0" encoding="UTF-8" standalone="yes"?>
              <Error>
                  <Code>SlowDown</Code>
                  <Message>Your account has made too many requests; try again later.</Message>
              </Error>
failed checks.aarch64-darwin.inventory-classes-up-to-date 1m 4s
setup: don't know how to build these paths: /nix/store/g06yn485pmlzq7irq3mii7clvwmrhxc7-inventory-classes-up-to-date.drv warning: ignoring the client-specifie …
setup:
don't know how to build these paths:
  /nix/store/g06yn485pmlzq7irq3mii7clvwmrhxc7-inventory-classes-up-to-date.drv
warning: ignoring the client-specified setting 'store', because it is a restricted setting and you are not a trusted user
error: gRPC QueryValidPaths on 'nix-store.geninf.io:50051' failed: error: unable to download 'https://cache.geninf.io/aialkr590qbk7580xmkf9jsshp03l3m3.narinfo': HTTP error 503

              response body:

              <?xml version="1.0" encoding="UTF-8" standalone="yes"?>
              <Error>
                  <Code>SlowDown</Code>
                  <Message>Your account has made too many requests; try again later.</Message>
              </Error>
failed checks.aarch64-darwin.nixos-flash-installer 8m 13s
setup: /nix/store/0fffrvkgxw464q8k7s34b6y6br5zf3dy-zd1211-firmware-1.5-zstd /nix/store/abrrrl7zvd4wn9d1p9jpzyfzq70zaflg-zfs-kernel-2.4.4-7.2.6 /nix/store/ …
setup:
  /nix/store/0fffrvkgxw464q8k7s34b6y6br5zf3dy-zd1211-firmware-1.5-zstd
  /nix/store/abrrrl7zvd4wn9d1p9jpzyfzq70zaflg-zfs-kernel-2.4.4-7.2.6
  /nix/store/wy280k76jdkk18nrsm6j9vxs0clv6dff-zfs-user-2.4.4-man
  /nix/store/wd9imm5ajha4c1g45nsy83bm36fhny0c-zfstools-0.3.6
  /nix/store/2lcv072r5dxb99qfsi0id9ak8s1g1zrw-zip-3.0
  /nix/store/pjw0gfl1i83a03a6jnqcbms4kcv0yakg-zstd-1.5.7-man
warning: ignoring the client-specified setting 'store', because it is a restricted setting and you are not a trusted user
error: gRPC QueryValidPaths on 'nix-store.geninf.io:50051' failed: error: unable to download 'https://cache.clan.lol/23gvl1kn24gi7pb1n65mzlijbw3bx3hk.narinfo': HTTP error 503

              response body:

              <?xml version="1.0" encoding="UTF-8" standalone="yes"?>
              <Error>
                  <Code>SlowDown</Code>
                  <Message>Your account has made too many requests; try again later.</Message>
              </Error>
failed checks.aarch64-darwin.treefmt 3m 16s
setup: don't know how to build these paths: /nix/store/5z31gwdqvsh6w6w4xmf5m6bj711gc98z-treefmt-check.drv warning: ignoring the client-specified setting 'stor …
setup:
don't know how to build these paths:
  /nix/store/5z31gwdqvsh6w6w4xmf5m6bj711gc98z-treefmt-check.drv
warning: ignoring the client-specified setting 'store', because it is a restricted setting and you are not a trusted user
error: gRPC QueryValidPaths on 'nix-store.geninf.io:50051' failed: error: unable to download 'https://cache.clan.lol/3pppb6bsgjr0697nhn8c6m0v4hlvp386.narinfo': HTTP error 503

              response body:

              <?xml version="1.0" encoding="UTF-8" standalone="yes"?>
              <Error>
                  <Code>SlowDown</Code>
                  <Message>Your account has made too many requests; try again later.</Message>
              </Error>
failed checks.aarch64-darwin.zerotier-tools-pytest 54s
setup: don't know how to build these paths: /nix/store/y0k57dwx98i4valrs472p32a4262yvn7-zerotier-tools-pytest.drv warning: ignoring the client-specified setti …
setup:
don't know how to build these paths:
  /nix/store/y0k57dwx98i4valrs472p32a4262yvn7-zerotier-tools-pytest.drv
warning: ignoring the client-specified setting 'store', because it is a restricted setting and you are not a trusted user
error: gRPC QueryValidPaths on 'nix-store.geninf.io:50051' failed: error: unable to download 'https://cache.clan.lol/czm2fp08ppz17p9887w4mz301n1y9c9j.narinfo': HTTP error 503

              response body:

              <?xml version="1.0" encoding="UTF-8" standalone="yes"?>
              <Error>
                  <Code>SlowDown</Code>
                  <Message>Your account has made too many requests; try again later.</Message>
              </Error>
failed checks.aarch64-linux.admin 29s
setup: don't know how to build these paths: /nix/store/3g28wqhrq6aa2j931r7ila0pwrps9w7q-container-test-run-admin.drv warning: ignoring the client-specified se …
setup:
don't know how to build these paths:
  /nix/store/3g28wqhrq6aa2j931r7ila0pwrps9w7q-container-test-run-admin.drv
warning: ignoring the client-specified setting 'store', because it is a restricted setting and you are not a trusted user
error: gRPC QueryValidPaths on 'nix-store.geninf.io:50051' failed: error: unable to download 'https://cache.clan.lol/qb3vgr5lx25s90sj2sxf9533295qds8v.narinfo': HTTP error 503

              response body:

              <?xml version="1.0" encoding="UTF-8" standalone="yes"?>
              <Error>
                  <Code>SlowDown</Code>
                  <Message>Your account has made too many requests; try again later.</Message>
              </Error>
failed checks.aarch64-linux.all-packages 7m 54s
setup: don't know how to build these paths: /nix/store/pjnsa2m6b9k85nnnkjnglz6qilhmxpgw-all-packages.drv warning: ignoring the client-specified setting 'store …
setup:
don't know how to build these paths:
  /nix/store/pjnsa2m6b9k85nnnkjnglz6qilhmxpgw-all-packages.drv
warning: ignoring the client-specified setting 'store', because it is a restricted setting and you are not a trusted user
error: gRPC QueryValidPaths on 'nix-store.geninf.io:50051' failed: error: substituter 'https://cache.clan.lol' is disabled
failed checks.aarch64-linux.borgbackup 1m 26s
setup: don't know how to build these paths: /nix/store/jikmgwgcgk40mrzn2jqrcmqliavvdpvx-container-test-run-borgbackup.drv warning: ignoring the client-specifi …
setup:
don't know how to build these paths:
  /nix/store/jikmgwgcgk40mrzn2jqrcmqliavvdpvx-container-test-run-borgbackup.drv
warning: ignoring the client-specified setting 'store', because it is a restricted setting and you are not a trusted user
error: gRPC QueryValidPaths on 'nix-store.geninf.io:50051' failed: error: unable to download 'https://cache.geninf.io/1a0krn25p2n5brpaa7q4gj4pdh37c0in.narinfo': HTTP error 503

              response body:

              <?xml version="1.0" encoding="UTF-8" standalone="yes"?>
              <Error>
                  <Code>SlowDown</Code>
                  <Message>Your account has made too many requests; try again later.</Message>
              </Error>
failed checks.aarch64-linux.certificates 53s
setup: don't know how to build these paths: /nix/store/ifkjii7h9dqc28i0dfyznsh906g40k4s-container-test-run-certificates.drv warning: ignoring the client-speci …
setup:
don't know how to build these paths:
  /nix/store/ifkjii7h9dqc28i0dfyznsh906g40k4s-container-test-run-certificates.drv
warning: ignoring the client-specified setting 'store', because it is a restricted setting and you are not a trusted user
error: gRPC QueryValidPaths on 'nix-store.geninf.io:50051' failed: error: unable to download 'https://cache.clan.lol/q2y6nh6hamips4xy37aylcd6v0sg96pn.narinfo': HTTP error 503

              response body:

              <?xml version="1.0" encoding="UTF-8" standalone="yes"?>
              <Error>
                  <Code>SlowDown</Code>
                  <Message>Your account has made too many requests; try again later.</Message>
              </Error>
failed checks.aarch64-linux.clan-deps 2m 40s
setup: don't know how to build these paths: /nix/store/nkd9qk05w4rsn89352j3vwsijfqfna0l-clan-deps.drv warning: ignoring the client-specified setting 'store', …
setup:
don't know how to build these paths:
  /nix/store/nkd9qk05w4rsn89352j3vwsijfqfna0l-clan-deps.drv
warning: ignoring the client-specified setting 'store', because it is a restricted setting and you are not a trusted user
error: gRPC QueryValidPaths on 'nix-store.geninf.io:50051' failed: error: unable to download 'https://cache.clan.lol/f17w668cyinxbbg8slynf2plhyl174y2.narinfo': HTTP error 503

              response body:

              <?xml version="1.0" encoding="UTF-8" standalone="yes"?>
              <Error>
                  <Code>SlowDown</Code>
                  <Message>Your account has made too many requests; try again later.</Message>
              </Error>
failed checks.aarch64-linux.clan-pytest-without-core 1m 57s
setup: don't know how to build these paths: /nix/store/500i4z8sjhra5rihsyxnz5x8icwkbgn0-clan-pytest-without-core.drv warning: ignoring the client-specified se …
setup:
don't know how to build these paths:
  /nix/store/500i4z8sjhra5rihsyxnz5x8icwkbgn0-clan-pytest-without-core.drv
warning: ignoring the client-specified setting 'store', because it is a restricted setting and you are not a trusted user
500i4z8sjhra5rihsyxnz5x8icwkbgn0-clan-pytest-without-core.drv: error: gRPC QueryValidPaths on 'nix-store.geninf.io:50051' failed: error: substituter 'https://cache.clan.lol' is disabled
error: error: gRPC QueryValidPaths on 'nix-store.geninf.io:50051' failed: error: substituter 'https://cache.clan.lol' is disabled
failed checks.aarch64-linux.clan-test-iso 2m 18s
setup: this path will be fetched (0.0 KiB download, 0.1 KiB unpacked): /nix/store/5jy2i32cw4lf3gc95027dz1xiyy2r3m7-container-test-run-clan-test-iso warning: i …
setup:
this path will be fetched (0.0 KiB download, 0.1 KiB unpacked):
  /nix/store/5jy2i32cw4lf3gc95027dz1xiyy2r3m7-container-test-run-clan-test-iso
warning: ignoring the client-specified setting 'store', because it is a restricted setting and you are not a trusted user
error: gRPC QueryValidPaths on 'nix-store.geninf.io:50051' failed: error: substituter 'https://cache.clan.lol' is disabled
failed checks.aarch64-linux.darwin-test-darwin-machine 45s
setup: don't know how to build these paths: /nix/store/30s2h5rahc5lpqixa852igy5xfwrr5n5-darwin-system-26.05.c3e90c8.drv warning: ignoring the client-specified …
setup:
don't know how to build these paths:
  /nix/store/30s2h5rahc5lpqixa852igy5xfwrr5n5-darwin-system-26.05.c3e90c8.drv
warning: ignoring the client-specified setting 'store', because it is a restricted setting and you are not a trusted user
error: gRPC QueryValidPaths on 'nix-store.geninf.io:50051' failed: error: unable to download 'https://cache.clan.lol/qsyc9ayifgc304lgnqjfgnf5n6y5z6wj.narinfo': HTTP error 503

              response body:

              <?xml version="1.0" encoding="UTF-8" standalone="yes"?>
              <Error>
                  <Code>SlowDown</Code>
                  <Message>Your account has made too many requests; try again later.</Message>
              </Error>
failed checks.aarch64-linux.data-mesher 15s
setup: don't know how to build these paths: /nix/store/lwrd9qbz9d09j01165dsdmyqyrff0i90-container-test-run-data-mesher.drv warning: ignoring the client-specif …
setup:
don't know how to build these paths:
  /nix/store/lwrd9qbz9d09j01165dsdmyqyrff0i90-container-test-run-data-mesher.drv
warning: ignoring the client-specified setting 'store', because it is a restricted setting and you are not a trusted user
error: gRPC QueryValidPaths on 'nix-store.geninf.io:50051' failed: error: unable to download 'https://cache.clan.lol/71fgn3kws786aq2r9znxppyci8w07xsp.narinfo': HTTP error 503

              response body:

              <?xml version="1.0" encoding="UTF-8" standalone="yes"?>
              <Error>
                  <Code>SlowDown</Code>
                  <Message>Your account has made too many requests; try again later.</Message>
              </Error>
failed checks.aarch64-linux.devshell 2m 13s
setup: this path will be fetched (0.0 KiB download, 0.1 KiB unpacked): /nix/store/52snlcw99n5r3vikqs8bwnql2ighvalj-check-devshell-not-depends-on-clan-cli warn …
setup:
this path will be fetched (0.0 KiB download, 0.1 KiB unpacked):
  /nix/store/52snlcw99n5r3vikqs8bwnql2ighvalj-check-devshell-not-depends-on-clan-cli
warning: ignoring the client-specified setting 'store', because it is a restricted setting and you are not a trusted user
error: gRPC QueryValidPaths on 'nix-store.geninf.io:50051' failed: error: substituter 'https://cache.clan.lol' is disabled
failed checks.aarch64-linux.devShell-clan-app 1m 28s
setup: don't know how to build these paths: /nix/store/vb8rmcgny2fxqzzbglx6268ylkbwlkmh-ui.drv warning: ignoring the client-specified setting 'store', because …
setup:
don't know how to build these paths:
  /nix/store/vb8rmcgny2fxqzzbglx6268ylkbwlkmh-ui.drv
warning: ignoring the client-specified setting 'store', because it is a restricted setting and you are not a trusted user
error: gRPC QueryValidPaths on 'nix-store.geninf.io:50051' failed: error: unable to download 'https://cache.clan.lol/0wi08ibx92rvzc6868f0bx3kavcas3gw.narinfo': HTTP error 503

              response body:

              <?xml version="1.0" encoding="UTF-8" standalone="yes"?>
              <Error>
                  <Code>SlowDown</Code>
                  <Message>Your account has made too many requests; try again later.</Message>
              </Error>
failed checks.aarch64-linux.devShell-clan-cli 8m 13s
setup: don't know how to build these paths: /nix/store/6spf7gn3b5lk5hihfhj6sc3b79lgk63z-clan-cli.drv warning: ignoring the client-specified setting 'store', b …
setup:
don't know how to build these paths:
  /nix/store/6spf7gn3b5lk5hihfhj6sc3b79lgk63z-clan-cli.drv
warning: ignoring the client-specified setting 'store', because it is a restricted setting and you are not a trusted user
error: gRPC QueryValidPaths on 'nix-store.geninf.io:50051' failed: error: substituter 'https://cache.clan.lol' is disabled
failed checks.aarch64-linux.devShell-clan-site 2m 28s
setup: /nix/store/1fi2g4hr5rmllzml6f68bq3yrjjijj0j-zlib-1.3.2-dev /nix/store/pwwpmwjdmk34smyfkf61ksyp7h5kdv45-zlib-1.3.2-static /nix/store/6fhxdm9f25c7h86 …
setup:
  /nix/store/1fi2g4hr5rmllzml6f68bq3yrjjijj0j-zlib-1.3.2-dev
  /nix/store/pwwpmwjdmk34smyfkf61ksyp7h5kdv45-zlib-1.3.2-static
  /nix/store/6fhxdm9f25c7h86nadfy8qim4h9hq04d-zlib-ng-2.3.3
  /nix/store/i8f26lwk8i93hmiyrmsy752m6nwi4pmk-zstd-1.5.7
  /nix/store/01623a8kcyp04gbqsal6fys34yfigd02-zstd-1.5.7-bin
  /nix/store/3y8mdshg1hkwpcnzhhd1q71p2wps47d4-zstd-1.5.7-dev
warning: ignoring the client-specified setting 'store', because it is a restricted setting and you are not a trusted user
error: gRPC QueryValidPaths on 'nix-store.geninf.io:50051' failed: error: substituter 'https://cache.clan.lol' is disabled
failed checks.aarch64-linux.devShell-default 8m 29s
setup: don't know how to build these paths: /nix/store/18dd8vgi5w3zw1li602gm2mdh0l5yh9x-clan.drv warning: ignoring the client-specified setting 'store', becau …
setup:
don't know how to build these paths:
  /nix/store/18dd8vgi5w3zw1li602gm2mdh0l5yh9x-clan.drv
warning: ignoring the client-specified setting 'store', because it is a restricted setting and you are not a trusted user
az6210y6ds6zl7mbx437b89vb1sssl92-vale-styles.drv: build01: not scheduled here: az6210y6ds6zl7mbx437b89vb1sssl92-vale-styles.drv, asking the scheduler again
az6210y6ds6zl7mbx437b89vb1sssl92-vale-styles.drv: error: end of string reached
error: dependency '58bjz4z5smx2dd7fdy6hlf2ldqq2j7qn-treefmt.drv' failed
failed checks.aarch64-linux.devShell-inventory-schema 2m 14s
setup: don't know how to build these paths: /nix/store/3bxkq1z48pj5nvd6fq06k8xaf1b0y2rd-clan-inventory-schema.drv warning: ignoring the client-specified setti …
setup:
don't know how to build these paths:
  /nix/store/3bxkq1z48pj5nvd6fq06k8xaf1b0y2rd-clan-inventory-schema.drv
warning: ignoring the client-specified setting 'store', because it is a restricted setting and you are not a trusted user
error: gRPC QueryValidPaths on 'nix-store.geninf.io:50051' failed: error: substituter 'https://cache.clan.lol' is disabled
failed checks.aarch64-linux.devShell-network-status 2m 45s
setup: don't know how to build these paths: /nix/store/1iyilni0kc2ykw5cigiihy6iclwrcl2d-network-status.drv warning: ignoring the client-specified setting 'sto …
setup:
don't know how to build these paths:
  /nix/store/1iyilni0kc2ykw5cigiihy6iclwrcl2d-network-status.drv
warning: ignoring the client-specified setting 'store', because it is a restricted setting and you are not a trusted user
error: gRPC QueryValidPaths on 'nix-store.geninf.io:50051' failed: error: unable to download 'https://cache.clan.lol/kys6b3cpm6waw55b8xk1i4ps2c7jcrar.narinfo': HTTP error 503

              response body:

              <?xml version="1.0" encoding="UTF-8" standalone="yes"?>
              <Error>
                  <Code>SlowDown</Code>
                  <Message>Your account has made too many requests; try again later.</Message>
              </Error>
failed checks.aarch64-linux.dm-dns 1m 18s
setup: don't know how to build these paths: /nix/store/iakvhkhh4mma82add85d1l6i4g78cqdg-container-test-run-dm-dns.drv warning: ignoring the client-specified s …
setup:
don't know how to build these paths:
  /nix/store/iakvhkhh4mma82add85d1l6i4g78cqdg-container-test-run-dm-dns.drv
warning: ignoring the client-specified setting 'store', because it is a restricted setting and you are not a trusted user
error: gRPC QueryValidPaths on 'nix-store.geninf.io:50051' failed: error: unable to download 'https://cache.geninf.io/7z2m4szfp863y9bp1vsffflk22dyw1ci.narinfo': HTTP error 503

              response body:

              <?xml version="1.0" encoding="UTF-8" standalone="yes"?>
              <Error>
                  <Code>SlowDown</Code>
                  <Message>Your account has made too many requests; try again later.</Message>
              </Error>
failed checks.aarch64-linux.dyndns 3m 52s
setup: don't know how to build these paths: /nix/store/jjynij268rqd0660gpn3igl8cswxvfnq-container-test-run-dyndns.drv warning: ignoring the client-specified s …
setup:
don't know how to build these paths:
  /nix/store/jjynij268rqd0660gpn3igl8cswxvfnq-container-test-run-dyndns.drv
warning: ignoring the client-specified setting 'store', because it is a restricted setting and you are not a trusted user
error: gRPC QueryValidPaths on 'nix-store.geninf.io:50051' failed: error: unable to download 'https://cache.clan.lol/8vcisiy4j8apy3hqaxbfz27yc9xny716.narinfo': HTTP error 503

              response body:

              <?xml version="1.0" encoding="UTF-8" standalone="yes"?>
              <Error>
                  <Code>SlowDown</Code>
                  <Message>Your account has made too many requests; try again later.</Message>
              </Error>
failed checks.aarch64-linux.eval-tests 37s
setup: don't know how to build these paths: /nix/store/f44f6440jb4i79rin4ipaln9qkk9yxx0-eval-tests-aarch64-linux.drv warning: ignoring the client-specified se …
setup:
don't know how to build these paths:
  /nix/store/f44f6440jb4i79rin4ipaln9qkk9yxx0-eval-tests-aarch64-linux.drv
warning: ignoring the client-specified setting 'store', because it is a restricted setting and you are not a trusted user
error: gRPC QueryValidPaths on 'nix-store.geninf.io:50051' failed: error: unable to download 'https://cache.clan.lol/sssh7sjp0v659z3gqivcf3myw14abvzb.narinfo': HTTP error 503

              response body:

              <?xml version="1.0" encoding="UTF-8" standalone="yes"?>
              <Error>
                  <Code>SlowDown</Code>
                  <Message>Your account has made too many requests; try again later.</Message>
              </Error>
failed checks.aarch64-linux.garage 1m 10s
setup: don't know how to build these paths: /nix/store/nsnl8wsxqf3f6v4245kbb1wwixibsy3g-container-test-run-garage.drv warning: ignoring the client-specified s …
setup:
don't know how to build these paths:
  /nix/store/nsnl8wsxqf3f6v4245kbb1wwixibsy3g-container-test-run-garage.drv
warning: ignoring the client-specified setting 'store', because it is a restricted setting and you are not a trusted user
error: gRPC QueryValidPaths on 'nix-store.geninf.io:50051' failed: error: unable to download 'https://cache.geninf.io/pj4kh2zlq9alaz8bvfpcvjk75ka0lgl0.narinfo': HTTP error 503

              response body:

              <?xml version="1.0" encoding="UTF-8" standalone="yes"?>
              <Error>
                  <Code>SlowDown</Code>
                  <Message>Your account has made too many requests; try again later.</Message>
              </Error>
failed checks.aarch64-linux.kde 1m 12s
setup: don't know how to build these paths: /nix/store/hqkj562ilknhsh7ixp7bb79b15908cq5-container-test-run-kde.drv warning: ignoring the client-specified sett …
setup:
don't know how to build these paths:
  /nix/store/hqkj562ilknhsh7ixp7bb79b15908cq5-container-test-run-kde.drv
warning: ignoring the client-specified setting 'store', because it is a restricted setting and you are not a trusted user
error: gRPC QueryValidPaths on 'nix-store.geninf.io:50051' failed: error: unable to download 'https://cache.geninf.io/71sslc4n5m33rkw2jz4q62zdiz9f8jg1.narinfo': HTTP error 503

              response body:

              <?xml version="1.0" encoding="UTF-8" standalone="yes"?>
              <Error>
                  <Code>SlowDown</Code>
                  <Message>Your account has made too many requests; try again later.</Message>
              </Error>
failed checks.aarch64-linux.lib-jsonschema-example-valid 5m 59s
setup: don't know how to build these paths: /nix/store/w54xwmxi8mrbbfhcsrav08p87zkbssh8-lib-jsonschema-example-valid.drv warning: ignoring the client-specifie …
setup:
don't know how to build these paths:
  /nix/store/w54xwmxi8mrbbfhcsrav08p87zkbssh8-lib-jsonschema-example-valid.drv
warning: ignoring the client-specified setting 'store', because it is a restricted setting and you are not a trusted user
error: gRPC QueryValidPaths on 'nix-store.geninf.io:50051' failed: error: unable to download 'https://cache.geninf.io/1hvic7qjwbxx5ghc8cr51n1zz0y0mx8j.narinfo': HTTP error 503

              response body:

              <?xml version="1.0" encoding="UTF-8" standalone="yes"?>
              <Error>
                  <Code>SlowDown</Code>
                  <Message>Your account has made too many requests; try again later.</Message>
              </Error>
failed checks.aarch64-linux.localbackup 8m 39s
setup: don't know how to build these paths: /nix/store/v8555pndyp0mii09psg1bwx6h6160i46-container-test-run-localbackup.drv warning: ignoring the client-specif …
setup:
don't know how to build these paths:
  /nix/store/v8555pndyp0mii09psg1bwx6h6160i46-container-test-run-localbackup.drv
warning: ignoring the client-specified setting 'store', because it is a restricted setting and you are not a trusted user
error: gRPC QueryValidPaths on 'nix-store.geninf.io:50051' failed: error: unable to download 'https://cache.geninf.io/84qvdy0n1qbb3bgs35x7s2kx2nrh8n7s.narinfo': HTTP error 503

              response body:

              <?xml version="1.0" encoding="UTF-8" standalone="yes"?>
              <Error>
                  <Code>SlowDown</Code>
                  <Message>Your account has made too many requests; try again later.</Message>
              </Error>
failed checks.aarch64-linux.matrix-synapse 5m 10s
setup: don't know how to build these paths: /nix/store/alh6y5jh7pri2jwybij7qbw6lpb2qqfl-container-test-run-matrix-synapse.drv warning: ignoring the client-spe …
setup:
don't know how to build these paths:
  /nix/store/alh6y5jh7pri2jwybij7qbw6lpb2qqfl-container-test-run-matrix-synapse.drv
warning: ignoring the client-specified setting 'store', because it is a restricted setting and you are not a trusted user
error: gRPC QueryValidPaths on 'nix-store.geninf.io:50051' failed: error: unable to download 'https://cache.clan.lol/iyp85bgm5a42gbn06pa2yvs10wfjkhgr.narinfo': HTTP error 503

              response body:

              <?xml version="1.0" encoding="UTF-8" standalone="yes"?>
              <Error>
                  <Code>SlowDown</Code>
                  <Message>Your account has made too many requests; try again later.</Message>
              </Error>
failed checks.aarch64-linux.monitoring 2m 30s
setup: don't know how to build these paths: /nix/store/zy2igmm173zi6z92nc78n9iwsi44l8aw-container-test-run-monitoring.drv warning: ignoring the client-specifi …
setup:
don't know how to build these paths:
  /nix/store/zy2igmm173zi6z92nc78n9iwsi44l8aw-container-test-run-monitoring.drv
warning: ignoring the client-specified setting 'store', because it is a restricted setting and you are not a trusted user
error: gRPC QueryValidPaths on 'nix-store.geninf.io:50051' failed: error: substituter 'https://cache.clan.lol' is disabled
failed checks.aarch64-linux.mycelium 1m 8s
setup: don't know how to build these paths: /nix/store/18sji0ckq8lsda97425mqxm4rq9xw83l-vm-test-run-mycelium.drv warning: ignoring the client-specified settin …
setup:
don't know how to build these paths:
  /nix/store/18sji0ckq8lsda97425mqxm4rq9xw83l-vm-test-run-mycelium.drv
warning: ignoring the client-specified setting 'store', because it is a restricted setting and you are not a trusted user
error: gRPC QueryValidPaths on 'nix-store.geninf.io:50051' failed: error: unable to download 'https://cache.geninf.io/gjhgz0mhd5wf3hmxq3jhwhjhpxib3ala.narinfo': HTTP error 503

              response body:

              <?xml version="1.0" encoding="UTF-8" standalone="yes"?>
              <Error>
                  <Code>SlowDown</Code>
                  <Message>Your account has made too many requests; try again later.</Message>
              </Error>
failed checks.aarch64-linux.ncps 7m 1s
setup: don't know how to build these paths: /nix/store/xhc5ml4ynxynaxfl6i8p5n8s73ijbgh2-container-test-run-ncps.drv warning: ignoring the client-specified set …
setup:
don't know how to build these paths:
  /nix/store/xhc5ml4ynxynaxfl6i8p5n8s73ijbgh2-container-test-run-ncps.drv
warning: ignoring the client-specified setting 'store', because it is a restricted setting and you are not a trusted user
error: gRPC QueryValidPaths on 'nix-store.geninf.io:50051' failed: error: substituter 'https://cache.clan.lol' is disabled
failed checks.aarch64-linux.nixos-documentation 10m 6s
setup: 4s4q83c354xsc800pvhishzj95nw6cg1-system-path.drv: build-x86-01: build-x86-01: input not substitutable: error: path '/nix/store/mgnnfwf5bsjq2yjwnlinkrllr3 …
setup:
4s4q83c354xsc800pvhishzj95nw6cg1-system-path.drv: build-x86-01: build-x86-01: input not substitutable: error: path '/nix/store/mgnnfwf5bsjq2yjwnlinkrllr3msyjql-nixos-version' is required, but there is no substituter that can build it, asking the scheduler again
4s4q83c354xsc800pvhishzj95nw6cg1-system-path.drv: build-x86-01: build-x86-01: input not substitutable: error: path '/nix/store/mgnnfwf5bsjq2yjwnlinkrllr3msyjql-nixos-version' is required, but there is no substituter that can build it, asking the scheduler again
4s4q83c354xsc800pvhishzj95nw6cg1-system-path.drv: build-x86-01: build-x86-01: input not substitutable: error: path '/nix/store/mgnnfwf5bsjq2yjwnlinkrllr3msyjql-nixos-version' is required, but there is no substituter that can build it, asking the scheduler again
4s4q83c354xsc800pvhishzj95nw6cg1-system-path.drv: build-x86-01: build-x86-01: input not substitutable: error: path '/nix/store/mgnnfwf5bsjq2yjwnlinkrllr3msyjql-nixos-version' is required, but there is no substituter that can build it, asking the scheduler again
4s4q83c354xsc800pvhishzj95nw6cg1-system-path.drv: build-x86-01: build-x86-01: input not substitutable: error: path '/nix/store/mgnnfwf5bsjq2yjwnlinkrllr3msyjql-nixos-version' is required, but there is no substituter that can build it, asking the scheduler again
4s4q83c354xsc800pvhishzj95nw6cg1-system-path.drv: build-x86-01: build-x86-01: input not substitutable: error: path '/nix/store/mgnnfwf5bsjq2yjwnlinkrllr3msyjql-nixos-version' is required, but there is no substituter that can build it, asking the scheduler again
4s4q83c354xsc800pvhishzj95nw6cg1-system-path.drv: build-x86-01: build-x86-01: input not substitutable: error: path '/nix/store/mgnnfwf5bsjq2yjwnlinkrllr3msyjql-nixos-version' is required, but there is no substituter that can build it, asking the scheduler again
error: dependency '4s4q83c354xsc800pvhishzj95nw6cg1-system-path.drv' failed
failed checks.aarch64-linux.nixos-flash-installer 10m 34s
setup: 8yr1gpa7r6qmj6nr1jx5fs51lx9b75f1-system-path.drv: build-x86-01: build-x86-01: input not substitutable: error: path '/nix/store/mgnnfwf5bsjq2yjwnlinkrllr3 …
setup:
8yr1gpa7r6qmj6nr1jx5fs51lx9b75f1-system-path.drv: build-x86-01: build-x86-01: input not substitutable: error: path '/nix/store/mgnnfwf5bsjq2yjwnlinkrllr3msyjql-nixos-version' is required, but there is no substituter that can build it, asking the scheduler again
m37byma39dgnsd6517g5x89r4446iwpz-etc-nix-registry.json.drv: build-x86-01: build-x86-01: input not substitutable: error: path '/nix/store/hq6cx345rcflxnadj955s1pgrmq7mr9m-nixos-26.05.20260921.1e8bc65' is required, but there is no substituter that can build it, asking the scheduler again
8yr1gpa7r6qmj6nr1jx5fs51lx9b75f1-system-path.drv: build-x86-01: build-x86-01: input not substitutable: error: path '/nix/store/mgnnfwf5bsjq2yjwnlinkrllr3msyjql-nixos-version' is required, but there is no substituter that can build it, asking the scheduler again
m37byma39dgnsd6517g5x89r4446iwpz-etc-nix-registry.json.drv: build-x86-01: build-x86-01: input not substitutable: error: path '/nix/store/hq6cx345rcflxnadj955s1pgrmq7mr9m-nixos-26.05.20260921.1e8bc65' is required, but there is no substituter that can build it, asking the scheduler again
8yr1gpa7r6qmj6nr1jx5fs51lx9b75f1-system-path.drv: build-x86-01: build-x86-01: input not substitutable: error: path '/nix/store/mgnnfwf5bsjq2yjwnlinkrllr3msyjql-nixos-version' is required, but there is no substituter that can build it, asking the scheduler again
m37byma39dgnsd6517g5x89r4446iwpz-etc-nix-registry.json.drv: build-x86-01: build-x86-01: input not substitutable: error: path '/nix/store/hq6cx345rcflxnadj955s1pgrmq7mr9m-nixos-26.05.20260921.1e8bc65' is required, but there is no substituter that can build it, asking the scheduler again
m37byma39dgnsd6517g5x89r4446iwpz-etc-nix-registry.json.drv: build-x86-01: build-x86-01: input not substitutable: error: path '/nix/store/hq6cx345rcflxnadj955s1pgrmq7mr9m-nixos-26.05.20260921.1e8bc65' is required, but there is no substituter that can build it, asking the scheduler again
error: dependency '8yr1gpa7r6qmj6nr1jx5fs51lx9b75f1-system-path.drv' failed
failed checks.aarch64-linux.nixos-systemd-abstraction 1m 37s
setup: this path will be fetched (0.0 KiB download, 0.1 KiB unpacked): /nix/store/a8c62n0yxd9g0swcsv0sm8znabisq090-container-test-run-systemd-abstraction warn …
setup:
this path will be fetched (0.0 KiB download, 0.1 KiB unpacked):
  /nix/store/a8c62n0yxd9g0swcsv0sm8znabisq090-container-test-run-systemd-abstraction
warning: ignoring the client-specified setting 'store', because it is a restricted setting and you are not a trusted user
error: gRPC QueryValidPaths on 'nix-store.geninf.io:50051' failed: error: unable to download 'https://cache.geninf.io/1zv57m21z5l8njg920s4cnpkwk724bqb.narinfo': HTTP error 503

              response body:

              <?xml version="1.0" encoding="UTF-8" standalone="yes"?>
              <Error>
                  <Code>SlowDown</Code>
                  <Message>Your account has made too many requests; try again later.</Message>
              </Error>
failed checks.aarch64-linux.nixos-test-age-backend 2s
setup: don't know how to build these paths: /nix/store/s14razrsh1n8wzzhzqv1fnng7w5sgifj-vm-test-run-nixos-test-age-backend.drv warning: ignoring the client-sp …
setup:
don't know how to build these paths:
  /nix/store/s14razrsh1n8wzzhzqv1fnng7w5sgifj-vm-test-run-nixos-test-age-backend.drv
warning: ignoring the client-specified setting 'store', because it is a restricted setting and you are not a trusted user
error: gRPC QueryValidPaths on 'nix-store.geninf.io:50051' failed: error: substituter 'https://cache.clan.lol' is disabled
failed checks.aarch64-linux.nixos-test-container 4m 10s
setup: don't know how to build these paths: /nix/store/wirjv5qxd3pwb694a3wd3qxzfsx2hia4-container-test-run-container.drv warning: ignoring the client-specifie …
setup:
don't know how to build these paths:
  /nix/store/wirjv5qxd3pwb694a3wd3qxzfsx2hia4-container-test-run-container.drv
warning: ignoring the client-specified setting 'store', because it is a restricted setting and you are not a trusted user
error: gRPC QueryValidPaths on 'nix-store.geninf.io:50051' failed: error: unable to download 'https://cache.clan.lol/gb5s74lbmav72wdadiwbkhzc6haccp85.narinfo': HTTP error 503

              response body:

              <?xml version="1.0" encoding="UTF-8" standalone="yes"?>
              <Error>
                  <Code>SlowDown</Code>
                  <Message>Your account has made too many requests; try again later.</Message>
              </Error>
failed checks.aarch64-linux.nixos-test-extra-python-packages 2m 42s
setup: don't know how to build these paths: /nix/store/zqfhv68vjnk6jnrjpncfd2bkbgjfbrcg-container-test-run-test-extra-python-packages.drv warning: ignoring th …
setup:
don't know how to build these paths:
  /nix/store/zqfhv68vjnk6jnrjpncfd2bkbgjfbrcg-container-test-run-test-extra-python-packages.drv
warning: ignoring the client-specified setting 'store', because it is a restricted setting and you are not a trusted user
error: gRPC QueryValidPaths on 'nix-store.geninf.io:50051' failed: error: unable to download 'https://cache.geninf.io/3inglj4r4ks4b8rw1xl8slzr21gpm26g.narinfo': HTTP error 503

              response body:

              <?xml version="1.0" encoding="UTF-8" standalone="yes"?>
              <Error>
                  <Code>SlowDown</Code>
                  <Message>Your account has made too many requests; try again later.</Message>
              </Error>
failed checks.aarch64-linux.nixos-test-password-store-mounts 5m 51s
setup: /nix/store/sgqvbvps31hbb0x9pp6xbyvi693d1gvm-vm-test-run-nixos-test-password-store-mounts warning: ignoring the client-specified setting 'store', becaus …
setup:
  /nix/store/sgqvbvps31hbb0x9pp6xbyvi693d1gvm-vm-test-run-nixos-test-password-store-mounts
warning: ignoring the client-specified setting 'store', because it is a restricted setting and you are not a trusted user
0b7kl1r1wy4hkvr5adab8c88r1qaw3dk-test-script.drv: error: gRPC QueryValidPaths on 'nix-store.geninf.io:50051' failed: error: substituter 'https://cache.clan.lol' is disabled
qv7lf6a9rnn3fxs1vjvrgfhbvq024q16-install-secret-tarball.drv: error: gRPC QueryValidPaths on 'nix-store.geninf.io:50051' failed: error: substituter 'https://cache.clan.lol' is disabled
nwdwy3xdb93bwwpq1kblpr4x8ajfr5d4-generator-test-secret.drv: error: gRPC QueryValidPaths on 'nix-store.geninf.io:50051' failed: error: substituter 'https://cache.clan.lol' is disabled
damnv9xj1axy3w0z0rxp5alji3s2m4jk-mock-secrets-tarball.drv: error: gRPC QueryValidPaths on 'nix-store.geninf.io:50051' failed: error: substituter 'https://cache.clan.lol' is disabled
9xz6f8s3v6ha9cw4n9ppwlgk5g4cdrjw-nixos-tmpfiles.d.drv: error: gRPC QueryValidPaths on 'nix-store.geninf.io:50051' failed: error: substituter 'https://cache.clan.lol' is disabled
error: dependency 'wkjhmqr3x8sac8pp72f9rfqkw2zpa80z-nixos-test-driver-nixos-test-password-store-mounts.drv' failed
failed checks.aarch64-linux.nixos-test-secrets 8m 36s
setup: 5gg3avkwj4my96rxsdsar4mpicqs637z-sops-install-secrets-0.0.1.drv: build01: build01: input not substitutable: error: path '/nix/store/hn9wcixixbixw05zyvc9i …
setup:
5gg3avkwj4my96rxsdsar4mpicqs637z-sops-install-secrets-0.0.1.drv: build01: build01: input not substitutable: error: path '/nix/store/hn9wcixixbixw05zyvc9iaqr0lnq9bpv-sops-install-secrets-0.0.1-go-modules' is required, but there is no substituter that can build it, asking the scheduler again
5gg3avkwj4my96rxsdsar4mpicqs637z-sops-install-secrets-0.0.1.drv: build01: build01: input not substitutable: error: path '/nix/store/hn9wcixixbixw05zyvc9iaqr0lnq9bpv-sops-install-secrets-0.0.1-go-modules' is required, but there is no substituter that can build it, asking the scheduler again
5gg3avkwj4my96rxsdsar4mpicqs637z-sops-install-secrets-0.0.1.drv: build01: build01: input not substitutable: error: path '/nix/store/hn9wcixixbixw05zyvc9iaqr0lnq9bpv-sops-install-secrets-0.0.1-go-modules' is required, but there is no substituter that can build it, asking the scheduler again
5gg3avkwj4my96rxsdsar4mpicqs637z-sops-install-secrets-0.0.1.drv: build01: build01: input not substitutable: error: path '/nix/store/hn9wcixixbixw05zyvc9iaqr0lnq9bpv-sops-install-secrets-0.0.1-go-modules' is required, but there is no substituter that can build it, asking the scheduler again
5gg3avkwj4my96rxsdsar4mpicqs637z-sops-install-secrets-0.0.1.drv: build01: build01: input not substitutable: error: path '/nix/store/hn9wcixixbixw05zyvc9iaqr0lnq9bpv-sops-install-secrets-0.0.1-go-modules' is required, but there is no substituter that can build it, asking the scheduler again
5gg3avkwj4my96rxsdsar4mpicqs637z-sops-install-secrets-0.0.1.drv: build01: build01: input not substitutable: error: path '/nix/store/hn9wcixixbixw05zyvc9iaqr0lnq9bpv-sops-install-secrets-0.0.1-go-modules' is required, but there is no substituter that can build it, asking the scheduler again
5gg3avkwj4my96rxsdsar4mpicqs637z-sops-install-secrets-0.0.1.drv: build01: build01: input not substitutable: error: path '/nix/store/hn9wcixixbixw05zyvc9iaqr0lnq9bpv-sops-install-secrets-0.0.1-go-modules' is required, but there is no substituter that can build it, asking the scheduler again
error: dependency 'ihnlfr3qf9xwfpj0iddx2j68srlcyr3v-nixos-test-driver-secrets.drv' failed
failed checks.aarch64-linux.nixos-test-user-firewall-iptables 1m 39s
setup: this path will be fetched (0.0 KiB download, 0.1 KiB unpacked): /nix/store/wb21ikxnhday8kjwxxw2rwk100vr0vp3-container-test-run-user-firewall-iptables w …
setup:
this path will be fetched (0.0 KiB download, 0.1 KiB unpacked):
  /nix/store/wb21ikxnhday8kjwxxw2rwk100vr0vp3-container-test-run-user-firewall-iptables
warning: ignoring the client-specified setting 'store', because it is a restricted setting and you are not a trusted user
error: gRPC QueryValidPaths on 'nix-store.geninf.io:50051' failed: error: unable to download 'https://cache.clan.lol/6alj6pqqm6b6v2lxrwlpasafkb34xmg4.narinfo': HTTP error 503

              response body:

              <?xml version="1.0" encoding="UTF-8" standalone="yes"?>
              <Error>
                  <Code>SlowDown</Code>
                  <Message>Your account has made too many requests; try again later.</Message>
              </Error>
failed checks.aarch64-linux.nixos-test-user-firewall-nftables 3s
setup: this path will be fetched (0.0 KiB download, 0.1 KiB unpacked): /nix/store/g4k19rg6bw2bx1anl7yibd983q0faxvm-container-test-run-user-firewall-nftables w …
setup:
this path will be fetched (0.0 KiB download, 0.1 KiB unpacked):
  /nix/store/g4k19rg6bw2bx1anl7yibd983q0faxvm-container-test-run-user-firewall-nftables
warning: ignoring the client-specified setting 'store', because it is a restricted setting and you are not a trusted user
error: gRPC QueryValidPaths on 'nix-store.geninf.io:50051' failed: error: substituter 'https://cache.clan.lol' is disabled
failed checks.aarch64-linux.nixos-test-wayland-proxy-virtwl 2m 22s
setup: /nix/store/mvy0ihx0bp8wrs5jv274i0qqvbr4szxa-vm-test-run-wayland-proxy-virtwl warning: ignoring the client-specified setting 'store', because it is a re …
setup:
  /nix/store/mvy0ihx0bp8wrs5jv274i0qqvbr4szxa-vm-test-run-wayland-proxy-virtwl
warning: ignoring the client-specified setting 'store', because it is a restricted setting and you are not a trusted user
b72qb2yrd7jkfpn1ni80yixy3nvf734l-set-environment.drv: error: gRPC QueryValidPaths on 'nix-store.geninf.io:50051' failed: error: substituter 'https://cache.clan.lol' is disabled
vrvh2hbgfdcq77cbffr1wxfglyrvk14i-test-script.drv: error: gRPC QueryValidPaths on 'nix-store.geninf.io:50051' failed: error: substituter 'https://cache.clan.lol' is disabled
gik854d5xqi1qgp22dsyycqymhpg2l3w-system-path.drv: error: gRPC QueryValidPaths on 'nix-store.geninf.io:50051' failed: error: substituter 'https://cache.clan.lol' is disabled
s7qcw899rfn728lgykhk4kc17m0y9bwm-etc-pam-environment.drv: error: gRPC QueryValidPaths on 'nix-store.geninf.io:50051' failed: error: substituter 'https://cache.clan.lol' is disabled
7hml64817dw3a8s7xm6rz7593i48y19i-unit-wayland-proxy-virtwl.service.drv: error: gRPC QueryValidPaths on 'nix-store.geninf.io:50051' failed: error: substituter 'https://cache.clan.lol' is disabled
error: dependency 'm87ji5hn2zknibic95z697gp75rsa3rb-nixos-test-driver-wayland-proxy-virtwl.drv' failed
failed checks.aarch64-linux.p2p-ssh-iroh 7m 1s
setup: don't know how to build these paths: /nix/store/xn04vqg4xkvpbpc77vnbwllqay6qw2c7-container-test-run-clan-test-p2p-ssh-iroh.drv warning: ignoring the cl …
setup:
don't know how to build these paths:
  /nix/store/xn04vqg4xkvpbpc77vnbwllqay6qw2c7-container-test-run-clan-test-p2p-ssh-iroh.drv
warning: ignoring the client-specified setting 'store', because it is a restricted setting and you are not a trusted user
error: gRPC QueryValidPaths on 'nix-store.geninf.io:50051' failed: error: substituter 'https://cache.clan.lol' is disabled
failed checks.aarch64-linux.packages 5m 37s
setup: don't know how to build these paths: /nix/store/xv5h4iqypcmw17d64lalvb0rfdb23fpn-container-test-run-packages.drv warning: ignoring the client-specified …
setup:
don't know how to build these paths:
  /nix/store/xv5h4iqypcmw17d64lalvb0rfdb23fpn-container-test-run-packages.drv
warning: ignoring the client-specified setting 'store', because it is a restricted setting and you are not a trusted user
error: gRPC QueryValidPaths on 'nix-store.geninf.io:50051' failed: error: unable to download 'https://cache.clan.lol/0phkjh43kr2siwxwwg0wlhbvgaz479ix.narinfo': HTTP error 503

              response body:

              <?xml version="1.0" encoding="UTF-8" standalone="yes"?>
              <Error>
                  <Code>SlowDown</Code>
                  <Message>Your account has made too many requests; try again later.</Message>
              </Error>
failed checks.aarch64-linux.pytest 25s
setup: this path will be fetched (0.0 KiB download, 0.1 KiB unpacked): /nix/store/phgsd2nklm6pb50v65mz7ib7f2z5mca7-network-status-pytest warning: ignoring the …
setup:
this path will be fetched (0.0 KiB download, 0.1 KiB unpacked):
  /nix/store/phgsd2nklm6pb50v65mz7ib7f2z5mca7-network-status-pytest
warning: ignoring the client-specified setting 'store', because it is a restricted setting and you are not a trusted user
error: gRPC QueryValidPaths on 'nix-store.geninf.io:50051' failed: error: unable to download 'https://cache.clan.lol/8drf59bz1mhakhb0pc1xpljkkp27la1p.narinfo': HTTP error 503

              response body:

              <?xml version="1.0" encoding="UTF-8" standalone="yes"?>
              <Error>
                  <Code>SlowDown</Code>
                  <Message>Your account has made too many requests; try again later.</Message>
              </Error>
failed checks.aarch64-linux.service-dummy-test 1m 49s
setup: this path will be fetched (0.0 KiB download, 0.1 KiB unpacked): /nix/store/lrjc0s4zhjdrgwarff4l0k9r7m9i4k4q-container-test-run-service-dummy-test warni …
setup:
this path will be fetched (0.0 KiB download, 0.1 KiB unpacked):
  /nix/store/lrjc0s4zhjdrgwarff4l0k9r7m9i4k4q-container-test-run-service-dummy-test
warning: ignoring the client-specified setting 'store', because it is a restricted setting and you are not a trusted user
error: gRPC QueryValidPaths on 'nix-store.geninf.io:50051' failed: error: unable to download 'https://cache.clan.lol/cbbiq0xgzlq0hrxhl03204f3jrq15jh4.narinfo': HTTP error 503

              response body:

              <?xml version="1.0" encoding="UTF-8" standalone="yes"?>
              <Error>
                  <Code>SlowDown</Code>
                  <Message>Your account has made too many requests; try again later.</Message>
              </Error>
failed checks.aarch64-linux.sshd 3m 49s
setup: don't know how to build these paths: /nix/store/j5ili3655h5pqb5ysjiz90drxy58kkw9-container-test-run-sshd.drv warning: ignoring the client-specified set …
setup:
don't know how to build these paths:
  /nix/store/j5ili3655h5pqb5ysjiz90drxy58kkw9-container-test-run-sshd.drv
warning: ignoring the client-specified setting 'store', because it is a restricted setting and you are not a trusted user
error: gRPC QueryValidPaths on 'nix-store.geninf.io:50051' failed: error: unable to download 'https://cache.clan.lol/zjbl30s1z0f54q6hk0m5h1m5v1f8l6b2.narinfo': HTTP error 503

              response body:

              <?xml version="1.0" encoding="UTF-8" standalone="yes"?>
              <Error>
                  <Code>SlowDown</Code>
                  <Message>Your account has made too many requests; try again later.</Message>
              </Error>
failed checks.aarch64-linux.sshd-no-ca 3m 55s
setup: don't know how to build these paths: /nix/store/4qjrxwiwf371m8yh5d1nhwkk7g3s6xkm-container-test-run-sshd.drv warning: ignoring the client-specified set …
setup:
don't know how to build these paths:
  /nix/store/4qjrxwiwf371m8yh5d1nhwkk7g3s6xkm-container-test-run-sshd.drv
warning: ignoring the client-specified setting 'store', because it is a restricted setting and you are not a trusted user
error: gRPC QueryValidPaths on 'nix-store.geninf.io:50051' failed: error: unable to download 'https://cache.clan.lol/wi2zs4s17as2z1bgmvg8swds1jfqi3g1.narinfo': HTTP error 503

              response body:

              <?xml version="1.0" encoding="UTF-8" standalone="yes"?>
              <Error>
                  <Code>SlowDown</Code>
                  <Message>Your account has made too many requests; try again later.</Message>
              </Error>
failed checks.aarch64-linux.state-version 5m 37s
setup: don't know how to build these paths: /nix/store/xpbr0rm7rln22kvsinfx7lkpgyq6l6zx-container-test-run-service-state-version.drv warning: ignoring the cli …
setup:
don't know how to build these paths:
  /nix/store/xpbr0rm7rln22kvsinfx7lkpgyq6l6zx-container-test-run-service-state-version.drv
warning: ignoring the client-specified setting 'store', because it is a restricted setting and you are not a trusted user
error: gRPC QueryValidPaths on 'nix-store.geninf.io:50051' failed: error: substituter 'https://cache.clan.lol' is disabled
failed checks.aarch64-linux.treefmt 5m 33s
setup: az6210y6ds6zl7mbx437b89vb1sssl92-vale-styles.drv: build01: build01: input not substitutable: error: path '/nix/store/k5db0kllrqjdm96gingfmy178zg79iks-sou …
setup:
az6210y6ds6zl7mbx437b89vb1sssl92-vale-styles.drv: build01: build01: input not substitutable: error: path '/nix/store/k5db0kllrqjdm96gingfmy178zg79iks-source' is required, but there is no substituter that can build it, asking the scheduler again
az6210y6ds6zl7mbx437b89vb1sssl92-vale-styles.drv: build01: build01: input not substitutable: error: path '/nix/store/k5db0kllrqjdm96gingfmy178zg79iks-source' is required, but there is no substituter that can build it, asking the scheduler again
az6210y6ds6zl7mbx437b89vb1sssl92-vale-styles.drv: build01: build01: input not substitutable: error: path '/nix/store/k5db0kllrqjdm96gingfmy178zg79iks-source' is required, but there is no substituter that can build it, asking the scheduler again
az6210y6ds6zl7mbx437b89vb1sssl92-vale-styles.drv: build01: build01: input not substitutable: error: path '/nix/store/k5db0kllrqjdm96gingfmy178zg79iks-source' is required, but there is no substituter that can build it, asking the scheduler again
az6210y6ds6zl7mbx437b89vb1sssl92-vale-styles.drv: build01: build01: input not substitutable: error: path '/nix/store/k5db0kllrqjdm96gingfmy178zg79iks-source' is required, but there is no substituter that can build it, asking the scheduler again
az6210y6ds6zl7mbx437b89vb1sssl92-vale-styles.drv: build01: build01: input not substitutable: error: path '/nix/store/k5db0kllrqjdm96gingfmy178zg79iks-source' is required, but there is no substituter that can build it, asking the scheduler again
az6210y6ds6zl7mbx437b89vb1sssl92-vale-styles.drv: build01: build01: input not substitutable: error: path '/nix/store/k5db0kllrqjdm96gingfmy178zg79iks-source' is required, but there is no substituter that can build it, asking the scheduler again
error: dependency '58bjz4z5smx2dd7fdy6hlf2ldqq2j7qn-treefmt.drv' failed
failed checks.aarch64-linux.trusted-nix-caches 4m 31s
setup: don't know how to build these paths: /nix/store/6llx3v8rnwl0snxd0n8lxb5d3yi3jk1m-container-test-run-trusted-nix-caches.drv warning: ignoring the client …
setup:
don't know how to build these paths:
  /nix/store/6llx3v8rnwl0snxd0n8lxb5d3yi3jk1m-container-test-run-trusted-nix-caches.drv
warning: ignoring the client-specified setting 'store', because it is a restricted setting and you are not a trusted user
error: gRPC QueryValidPaths on 'nix-store.geninf.io:50051' failed: error: unable to download 'https://cache.clan.lol/2rmg9nsak7znj3z24pcdvf3jmwwgp54a.narinfo': HTTP error 503

              response body:

              <?xml version="1.0" encoding="UTF-8" standalone="yes"?>
              <Error>
                  <Code>SlowDown</Code>
                  <Message>Your account has made too many requests; try again later.</Message>
              </Error>
failed checks.aarch64-linux.users 26s
setup: don't know how to build these paths: /nix/store/p4l44z2h6qmmwymi1d2w1c2k68w90kkq-container-test-run-users.drv warning: ignoring the client-specified se …
setup:
don't know how to build these paths:
  /nix/store/p4l44z2h6qmmwymi1d2w1c2k68w90kkq-container-test-run-users.drv
warning: ignoring the client-specified setting 'store', because it is a restricted setting and you are not a trusted user
error: gRPC QueryValidPaths on 'nix-store.geninf.io:50051' failed: error: substituter 'https://cache.clan.lol' is disabled
failed checks.aarch64-linux.wifi 1m 22s
setup: don't know how to build these paths: /nix/store/0w1c1kyx2vx7231d2nl5j2l33p9z87mi-vm-test-run-wifi.drv warning: ignoring the client-specified setting 's …
setup:
don't know how to build these paths:
  /nix/store/0w1c1kyx2vx7231d2nl5j2l33p9z87mi-vm-test-run-wifi.drv
warning: ignoring the client-specified setting 'store', because it is a restricted setting and you are not a trusted user
error: gRPC QueryValidPaths on 'nix-store.geninf.io:50051' failed: error: unable to download 'https://cache.geninf.io/6p015gqzdsz05pmq4y8m1n550myg73vf.narinfo': HTTP error 503

              response body:

              <?xml version="1.0" encoding="UTF-8" standalone="yes"?>
              <Error>
                  <Code>SlowDown</Code>
                  <Message>Your account has made too many requests; try again later.</Message>
              </Error>
failed checks.aarch64-linux.yggdrasil 6m 32s
setup: /nix/store/6fhxdm9f25c7h86nadfy8qim4h9hq04d-zlib-ng-2.3.3 /nix/store/i8f26lwk8i93hmiyrmsy752m6nwi4pmk-zstd-1.5.7 /nix/store/01623a8kcyp04gbqsal6fys …
setup:
  /nix/store/6fhxdm9f25c7h86nadfy8qim4h9hq04d-zlib-ng-2.3.3
  /nix/store/i8f26lwk8i93hmiyrmsy752m6nwi4pmk-zstd-1.5.7
  /nix/store/01623a8kcyp04gbqsal6fys34yfigd02-zstd-1.5.7-bin
  /nix/store/9h8n7h5kayw8i7800jxjgm53q5jgdxpw-zstd-1.5.7-man
  /nix/store/kbyzf7czqp88hpjlli71fvsqz8s9zsb2-zt-local.conf
  /nix/store/lx4a7hdjz8xp4zligmp5wz1hzkfy3ih9-zt-local.conf
warning: ignoring the client-specified setting 'store', because it is a restricted setting and you are not a trusted user
error: gRPC QueryValidPaths on 'nix-store.geninf.io:50051' failed: error: substituter 'https://cache.clan.lol' is disabled
failed checks.x86_64-linux.all-packages 3m 35s
setup: /nix/store/i3rx44x5k79k2svp2zmafkgbb6rw3r4q-zerotier-tools-0.1.0 /nix/store/6r5ij86g944db3sqsq9vbnsqh2i73cfg-zerotierone-1.16.0 /nix/store/48jfmhrh …
setup:
  /nix/store/i3rx44x5k79k2svp2zmafkgbb6rw3r4q-zerotier-tools-0.1.0
  /nix/store/6r5ij86g944db3sqsq9vbnsqh2i73cfg-zerotierone-1.16.0
  /nix/store/48jfmhrhilsknqv3pxryd79j8cbd3q1l-zimg-3.0.6
  /nix/store/l2fbmdv9v89aqddaapf5gbrr04s0qrb7-zix-0.6.2
  /nix/store/909c542jrcgmqah0m7r1vxd80nxs5nhk-zvbi-0.2.45
  /nix/store/w5jdmbhx2m4rmp5b3xv4af07yaian6bc-zxing-cpp-2.3.0
warning: ignoring the client-specified setting 'store', because it is a restricted setting and you are not a trusted user
error: gRPC QueryValidPaths on 'nix-store.geninf.io:50051' failed: error: unable to download 'https://cache.clan.lol/nd4iw0gspx55xihsc658vy56v47xc78v.narinfo': HTTP error 503

              response body:

              <?xml version="1.0" encoding="UTF-8" standalone="yes"?>
              <Error>
                  <Code>SlowDown</Code>
                  <Message>Your account has made too many requests; try again later.</Message>
              </Error>
failed checks.x86_64-linux.certificates 2m 21s
setup: this path will be fetched (0.0 KiB download, 0.1 KiB unpacked): /nix/store/4jbyv2423kjzn5lix7xv7c5ah3xkrnqr-container-test-run-certificates warning: ig …
setup:
this path will be fetched (0.0 KiB download, 0.1 KiB unpacked):
  /nix/store/4jbyv2423kjzn5lix7xv7c5ah3xkrnqr-container-test-run-certificates
warning: ignoring the client-specified setting 'store', because it is a restricted setting and you are not a trusted user
error: gRPC QueryValidPaths on 'nix-store.geninf.io:50051' failed: error: unable to download 'https://cache.clan.lol/yw9p4qf72rc5mp8s35ngp707fbqfafy3.narinfo': HTTP error 503

              response body:

              <?xml version="1.0" encoding="UTF-8" standalone="yes"?>
              <Error>
                  <Code>SlowDown</Code>
                  <Message>Your account has made too many requests; try again later.</Message>
              </Error>
failed checks.x86_64-linux.clan-app-pytest 5s
setup: this path will be fetched (0.0 KiB download, 0.1 KiB unpacked): /nix/store/7k819dv9fr2ayamff9w2qailb5wwrdfa-clan-app-pytest warning: ignoring the clien …
setup:
this path will be fetched (0.0 KiB download, 0.1 KiB unpacked):
  /nix/store/7k819dv9fr2ayamff9w2qailb5wwrdfa-clan-app-pytest
warning: ignoring the client-specified setting 'store', because it is a restricted setting and you are not a trusted user
error: gRPC QueryValidPaths on 'nix-store.geninf.io:50051' failed: error: substituter 'https://cache.clan.lol' is disabled
failed checks.x86_64-linux.clan-app-ui-lint 3m 29s
setup: don't know how to build these paths: /nix/store/34m06j46s1f3pvsg7rgmgh6xfpjwhfy6-clan-app-ui-lint.drv warning: ignoring the client-specified setting 's …
setup:
don't know how to build these paths:
  /nix/store/34m06j46s1f3pvsg7rgmgh6xfpjwhfy6-clan-app-ui-lint.drv
warning: ignoring the client-specified setting 'store', because it is a restricted setting and you are not a trusted user
error: gRPC QueryValidPaths on 'nix-store.geninf.io:50051' failed: error: unable to download 'https://cache.clan.lol/d3gh8y8k0y5kq8pxd8hmjsall6rzympc.narinfo': HTTP error 503

              response body:

              <?xml version="1.0" encoding="UTF-8" standalone="yes"?>
              <Error>
                  <Code>SlowDown</Code>
                  <Message>Your account has made too many requests; try again later.</Message>
              </Error>
failed checks.x86_64-linux.clan-app-ui-unit-tests 2m 26s
setup: this path will be fetched (0.0 KiB download, 86.0 MiB unpacked): /nix/store/w5j39j0aks2l862y045z1pwshq7729w4-clan-app-ui-unit-tests warning: ignoring t …
setup:
this path will be fetched (0.0 KiB download, 86.0 MiB unpacked):
  /nix/store/w5j39j0aks2l862y045z1pwshq7729w4-clan-app-ui-unit-tests
warning: ignoring the client-specified setting 'store', because it is a restricted setting and you are not a trusted user
error: gRPC QueryValidPaths on 'nix-store.geninf.io:50051' failed: error: substituter 'https://cache.clan.lol' is disabled
failed checks.x86_64-linux.clan-pytest-with-core 8m 56s
setup: this path will be fetched (0.0 KiB download, 5.1 MiB unpacked): /nix/store/pyfzmvb2z9bs41y763r5wvpx0had61pm-clan-pytest-with-core warning: ignoring the …
setup:
this path will be fetched (0.0 KiB download, 5.1 MiB unpacked):
  /nix/store/pyfzmvb2z9bs41y763r5wvpx0had61pm-clan-pytest-with-core
warning: ignoring the client-specified setting 'store', because it is a restricted setting and you are not a trusted user
error: gRPC QueryValidPaths on 'nix-store.geninf.io:50051' failed: error: substituter 'https://cache.clan.lol' is disabled
failed checks.x86_64-linux.clan-site-lint 4m 38s
setup: don't know how to build these paths: /nix/store/zlwngyhbslcsgsjycxwqqrpniljlyw8y-clan-site-lint.drv warning: ignoring the client-specified setting 'sto …
setup:
don't know how to build these paths:
  /nix/store/zlwngyhbslcsgsjycxwqqrpniljlyw8y-clan-site-lint.drv
warning: ignoring the client-specified setting 'store', because it is a restricted setting and you are not a trusted user
error: gRPC QueryValidPaths on 'nix-store.geninf.io:50051' failed: error: unable to download 'https://cache.clan.lol/mq49is9n8laman4rcix706ff0x0pz65b.narinfo': HTTP error 503

              response body:

              <?xml version="1.0" encoding="UTF-8" standalone="yes"?>
              <Error>
                  <Code>SlowDown</Code>
                  <Message>Your account has made too many requests; try again later.</Message>
              </Error>
failed checks.x86_64-linux.clan-test-iso 1m 43s
setup: don't know how to build these paths: /nix/store/k4bzgp7iz351hx3rgy0yvv9gm45ayh4a-container-test-run-clan-test-iso.drv warning: ignoring the client-spec …
setup:
don't know how to build these paths:
  /nix/store/k4bzgp7iz351hx3rgy0yvv9gm45ayh4a-container-test-run-clan-test-iso.drv
warning: ignoring the client-specified setting 'store', because it is a restricted setting and you are not a trusted user
error: gRPC QueryValidPaths on 'nix-store.geninf.io:50051' failed: error: unable to download 'https://cache.geninf.io/9iq927xi1mpr5kcf7hhcnp9xgccjq7yw.narinfo': HTTP error 503

              response body:

              <?xml version="1.0" encoding="UTF-8" standalone="yes"?>
              <Error>
                  <Code>SlowDown</Code>
                  <Message>Your account has made too many requests; try again later.</Message>
              </Error>
failed checks.x86_64-linux.clan-test-update 32s
setup: don't know how to build these paths: /nix/store/p3kahkmiml70xk10zymva97yqpgb26lr-container-test-run-clan-test-update.drv warning: ignoring the client-s …
setup:
don't know how to build these paths:
  /nix/store/p3kahkmiml70xk10zymva97yqpgb26lr-container-test-run-clan-test-update.drv
warning: ignoring the client-specified setting 'store', because it is a restricted setting and you are not a trusted user
error: gRPC QueryValidPaths on 'nix-store.geninf.io:50051' failed: error: unable to download 'https://cache.clan.lol/26z6w2pjfgfqz2g8npq0c3qfkvfahrcr.narinfo': HTTP error 503

              response body:

              <?xml version="1.0" encoding="UTF-8" standalone="yes"?>
              <Error>
                  <Code>SlowDown</Code>
                  <Message>Your account has made too many requests; try again later.</Message>
              </Error>
failed checks.x86_64-linux.darwin-test-darwin-machine 3m 11s
setup: don't know how to build these paths: /nix/store/30s2h5rahc5lpqixa852igy5xfwrr5n5-darwin-system-26.05.c3e90c8.drv warning: ignoring the client-specified …
setup:
don't know how to build these paths:
  /nix/store/30s2h5rahc5lpqixa852igy5xfwrr5n5-darwin-system-26.05.c3e90c8.drv
warning: ignoring the client-specified setting 'store', because it is a restricted setting and you are not a trusted user
error: gRPC QueryValidPaths on 'nix-store.geninf.io:50051' failed: error: unable to download 'https://cache.clan.lol/39dkng69niwh776mbp9fm435bqb5yygi.narinfo': HTTP error 503

              response body:

              <?xml version="1.0" encoding="UTF-8" standalone="yes"?>
              <Error>
                  <Code>SlowDown</Code>
                  <Message>Your account has made too many requests; try again later.</Message>
              </Error>
failed checks.x86_64-linux.devShell-clan-app 2m 51s
setup: /nix/store/4wpk4zqxl1gqfzy9y9nxnggqqnga93mz-xorgproto-2025.1 /nix/store/lzzzsjb4j2kpkb7lxm9agfx1s1sxwx46-xvidcore-1.3.7 /nix/store/48jfmhrhilsknqv3 …
setup:
  /nix/store/4wpk4zqxl1gqfzy9y9nxnggqqnga93mz-xorgproto-2025.1
  /nix/store/lzzzsjb4j2kpkb7lxm9agfx1s1sxwx46-xvidcore-1.3.7
  /nix/store/48jfmhrhilsknqv3pxryd79j8cbd3q1l-zimg-3.0.6
  /nix/store/l2fbmdv9v89aqddaapf5gbrr04s0qrb7-zix-0.6.2
  /nix/store/909c542jrcgmqah0m7r1vxd80nxs5nhk-zvbi-0.2.45
  /nix/store/w5jdmbhx2m4rmp5b3xv4af07yaian6bc-zxing-cpp-2.3.0
warning: ignoring the client-specified setting 'store', because it is a restricted setting and you are not a trusted user
error: gRPC QueryValidPaths on 'nix-store.geninf.io:50051' failed: error: unable to download 'https://cache.geninf.io/2538xjxnxbnmgbq2cnz51d0da86p1k73.narinfo': HTTP error 503

              response body:

              <?xml version="1.0" encoding="UTF-8" standalone="yes"?>
              <Error>
                  <Code>SlowDown</Code>
                  <Message>Your account has made too many requests; try again later.</Message>
              </Error>
failed checks.x86_64-linux.devShell-clan-cli 5m 36s
setup: don't know how to build these paths: /nix/store/wjcnbkpfcxik06g6jrwm4iq6dybbqaiv-clan-cli.drv warning: ignoring the client-specified setting 'store', b …
setup:
don't know how to build these paths:
  /nix/store/wjcnbkpfcxik06g6jrwm4iq6dybbqaiv-clan-cli.drv
warning: ignoring the client-specified setting 'store', because it is a restricted setting and you are not a trusted user
error: gRPC QueryValidPaths on 'nix-store.geninf.io:50051' failed: error: substituter 'https://cache.clan.lol' is disabled
failed checks.x86_64-linux.devShell-icon-update 2m 26s
setup: don't know how to build these paths: /nix/store/m57qhz4qqvx081cljfdpjhdd1bfj3r09-clan-icon-update.drv warning: ignoring the client-specified setting 's …
setup:
don't know how to build these paths:
  /nix/store/m57qhz4qqvx081cljfdpjhdd1bfj3r09-clan-icon-update.drv
warning: ignoring the client-specified setting 'store', because it is a restricted setting and you are not a trusted user
error: gRPC QueryValidPaths on 'nix-store.geninf.io:50051' failed: error: substituter 'https://cache.clan.lol' is disabled
failed checks.x86_64-linux.devShell-inventory-schema 6m 7s
setup: don't know how to build these paths: /nix/store/2qqi9blw8jhr76lwhnx6q7dvx9ni89zy-clan-inventory-schema.drv warning: ignoring the client-specified setti …
setup:
don't know how to build these paths:
  /nix/store/2qqi9blw8jhr76lwhnx6q7dvx9ni89zy-clan-inventory-schema.drv
warning: ignoring the client-specified setting 'store', because it is a restricted setting and you are not a trusted user
error: gRPC QueryValidPaths on 'nix-store.geninf.io:50051' failed: error: unable to download 'https://cache.geninf.io/3f41nmrswaf4vln24a73fpij81z9sqvp.narinfo': HTTP error 503

              response body:

              <?xml version="1.0" encoding="UTF-8" standalone="yes"?>
              <Error>
                  <Code>SlowDown</Code>
                  <Message>Your account has made too many requests; try again later.</Message>
              </Error>
failed checks.x86_64-linux.dm-dns 2m 37s
setup: this path will be fetched (0.0 KiB download, 0.1 KiB unpacked): /nix/store/f1qdl1lik7lxycfiqadkaqgkr7hm8zjj-container-test-run-dm-dns warning: ignoring …
setup:
this path will be fetched (0.0 KiB download, 0.1 KiB unpacked):
  /nix/store/f1qdl1lik7lxycfiqadkaqgkr7hm8zjj-container-test-run-dm-dns
warning: ignoring the client-specified setting 'store', because it is a restricted setting and you are not a trusted user
error: gRPC QueryValidPaths on 'nix-store.geninf.io:50051' failed: error: unable to download 'https://cache.clan.lol/ndzq0d6rbdxj85z6abclb004l07l84li.narinfo': HTTP error 503

              response body:

              <?xml version="1.0" encoding="UTF-8" standalone="yes"?>
              <Error>
                  <Code>SlowDown</Code>
                  <Message>Your account has made too many requests; try again later.</Message>
              </Error>
failed checks.x86_64-linux.dyndns 3m 15s
setup: don't know how to build these paths: /nix/store/a740l5dbfafcvvwzqjfv934i049d9pwv-container-test-run-dyndns.drv warning: ignoring the client-specified s …
setup:
don't know how to build these paths:
  /nix/store/a740l5dbfafcvvwzqjfv934i049d9pwv-container-test-run-dyndns.drv
warning: ignoring the client-specified setting 'store', because it is a restricted setting and you are not a trusted user
error: gRPC QueryValidPaths on 'nix-store.geninf.io:50051' failed: error: unable to download 'https://cache.clan.lol/rsas096x8rvbwqfcszay1glxyk0pvcp3.narinfo': HTTP error 503

              response body:

              <?xml version="1.0" encoding="UTF-8" standalone="yes"?>
              <Error>
                  <Code>SlowDown</Code>
                  <Message>Your account has made too many requests; try again later.</Message>
              </Error>
failed checks.x86_64-linux.hello-service 4s
setup: this path will be fetched (0.0 KiB download, 0.1 KiB unpacked): /nix/store/5xbpk4gbbr49nvg37ybmc7sj7yadwfqc-container-test-run-hello-service warning: i …
setup:
this path will be fetched (0.0 KiB download, 0.1 KiB unpacked):
  /nix/store/5xbpk4gbbr49nvg37ybmc7sj7yadwfqc-container-test-run-hello-service
warning: ignoring the client-specified setting 'store', because it is a restricted setting and you are not a trusted user
error: gRPC QueryValidPaths on 'nix-store.geninf.io:50051' failed: error: substituter 'https://cache.clan.lol' is disabled
failed checks.x86_64-linux.kde 53s
setup: this path will be fetched (0.0 KiB download, 0.1 KiB unpacked): /nix/store/8a1kfn3225ds0iwrr8d8yzxy71i3845z-container-test-run-kde warning: ignoring th …
setup:
this path will be fetched (0.0 KiB download, 0.1 KiB unpacked):
  /nix/store/8a1kfn3225ds0iwrr8d8yzxy71i3845z-container-test-run-kde
warning: ignoring the client-specified setting 'store', because it is a restricted setting and you are not a trusted user
error: gRPC QueryValidPaths on 'nix-store.geninf.io:50051' failed: error: unable to download 'https://cache.geninf.io/4p4n1pilj1x70sicfrl10gdxi503dkac.narinfo': HTTP error 503

              response body:

              <?xml version="1.0" encoding="UTF-8" standalone="yes"?>
              <Error>
                  <Code>SlowDown</Code>
                  <Message>Your account has made too many requests; try again later.</Message>
              </Error>
failed checks.x86_64-linux.lib-jsonschema-example-valid 2m 5s
setup: don't know how to build these paths: /nix/store/g1gyqzkdp6p65jgh48qzsia38radzfz9-lib-jsonschema-example-valid.drv warning: ignoring the client-specifie …
setup:
don't know how to build these paths:
  /nix/store/g1gyqzkdp6p65jgh48qzsia38radzfz9-lib-jsonschema-example-valid.drv
warning: ignoring the client-specified setting 'store', because it is a restricted setting and you are not a trusted user
error: gRPC QueryValidPaths on 'nix-store.geninf.io:50051' failed: error: unable to download 'https://cache.geninf.io/syjsskxlnwslg5aj5a8scqp7xg3cj4sg.narinfo': HTTP error 503

              response body:

              <?xml version="1.0" encoding="UTF-8" standalone="yes"?>
              <Error>
                  <Code>SlowDown</Code>
                  <Message>Your account has made too many requests; try again later.</Message>
              </Error>
failed checks.x86_64-linux.mycelium 1m 16s
setup: don't know how to build these paths: /nix/store/kif0rpqkkflbil5nb8fp68fqczyhawsg-vm-test-run-mycelium.drv warning: ignoring the client-specified settin …
setup:
don't know how to build these paths:
  /nix/store/kif0rpqkkflbil5nb8fp68fqczyhawsg-vm-test-run-mycelium.drv
warning: ignoring the client-specified setting 'store', because it is a restricted setting and you are not a trusted user
error: gRPC QueryValidPaths on 'nix-store.geninf.io:50051' failed: error: unable to download 'https://cache.clan.lol/kdllb92lcl4ib57x65mzxm0ay47ihsld.narinfo': HTTP error 503

              response body:

              <?xml version="1.0" encoding="UTF-8" standalone="yes"?>
              <Error>
                  <Code>SlowDown</Code>
                  <Message>Your account has made too many requests; try again later.</Message>
              </Error>
failed checks.x86_64-linux.nixos-documentation 2m 16s
setup: don't know how to build these paths: /nix/store/cza30yfhfd7qx9l8q20dpxgv9ijab8b2-nixos-system-test-documentation-26.05.20260921.1e8bc65.drv warning: ig …
setup:
don't know how to build these paths:
  /nix/store/cza30yfhfd7qx9l8q20dpxgv9ijab8b2-nixos-system-test-documentation-26.05.20260921.1e8bc65.drv
warning: ignoring the client-specified setting 'store', because it is a restricted setting and you are not a trusted user
error: gRPC QueryValidPaths on 'nix-store.geninf.io:50051' failed: error: unable to download 'https://cache.clan.lol/lq9b4jacgij6wdkz5bg85ljkg2qjcwph.narinfo': HTTP error 503

              response body:

              <?xml version="1.0" encoding="UTF-8" standalone="yes"?>
              <Error>
                  <Code>SlowDown</Code>
                  <Message>Your account has made too many requests; try again later.</Message>
              </Error>
failed checks.x86_64-linux.nixos-flash-installer 9m 23s
setup: 8yr1gpa7r6qmj6nr1jx5fs51lx9b75f1-system-path.drv: build-x86-01: build-x86-01: input not substitutable: error: path '/nix/store/mgnnfwf5bsjq2yjwnlinkrllr3 …
setup:
8yr1gpa7r6qmj6nr1jx5fs51lx9b75f1-system-path.drv: build-x86-01: build-x86-01: input not substitutable: error: path '/nix/store/mgnnfwf5bsjq2yjwnlinkrllr3msyjql-nixos-version' is required, but there is no substituter that can build it, asking the scheduler again
c6vsiscbn6h4hrswab2rj13j9i7ndr67-unit-script-nix-channel-init-start.drv: build-x86-01: build-x86-01: input not substitutable: error: path '/nix/store/hq6cx345rcflxnadj955s1pgrmq7mr9m-nixos-26.05.20260921.1e8bc65' is required, but there is no substituter that can build it, asking the scheduler again
8yr1gpa7r6qmj6nr1jx5fs51lx9b75f1-system-path.drv: build-x86-01: build-x86-01: input not substitutable: error: path '/nix/store/mgnnfwf5bsjq2yjwnlinkrllr3msyjql-nixos-version' is required, but there is no substituter that can build it, asking the scheduler again
c6vsiscbn6h4hrswab2rj13j9i7ndr67-unit-script-nix-channel-init-start.drv: build-x86-01: build-x86-01: input not substitutable: error: path '/nix/store/hq6cx345rcflxnadj955s1pgrmq7mr9m-nixos-26.05.20260921.1e8bc65' is required, but there is no substituter that can build it, asking the scheduler again
8yr1gpa7r6qmj6nr1jx5fs51lx9b75f1-system-path.drv: build-x86-01: build-x86-01: input not substitutable: error: path '/nix/store/mgnnfwf5bsjq2yjwnlinkrllr3msyjql-nixos-version' is required, but there is no substituter that can build it, asking the scheduler again
c6vsiscbn6h4hrswab2rj13j9i7ndr67-unit-script-nix-channel-init-start.drv: build-x86-01: build-x86-01: input not substitutable: error: path '/nix/store/hq6cx345rcflxnadj955s1pgrmq7mr9m-nixos-26.05.20260921.1e8bc65' is required, but there is no substituter that can build it, asking the scheduler again
8yr1gpa7r6qmj6nr1jx5fs51lx9b75f1-system-path.drv: build-x86-01: build-x86-01: input not substitutable: error: path '/nix/store/mgnnfwf5bsjq2yjwnlinkrllr3msyjql-nixos-version' is required, but there is no substituter that can build it, asking the scheduler again
error: dependency '8yr1gpa7r6qmj6nr1jx5fs51lx9b75f1-system-path.drv' failed
failed checks.x86_64-linux.nixos-systemd-abstraction 3m 40s
setup: this path will be fetched (0.0 KiB download, 0.1 KiB unpacked): /nix/store/gl8z3xvjygr926z4g7zgz2sjc09nhk3v-container-test-run-systemd-abstraction warn …
setup:
this path will be fetched (0.0 KiB download, 0.1 KiB unpacked):
  /nix/store/gl8z3xvjygr926z4g7zgz2sjc09nhk3v-container-test-run-systemd-abstraction
warning: ignoring the client-specified setting 'store', because it is a restricted setting and you are not a trusted user
error: gRPC QueryValidPaths on 'nix-store.geninf.io:50051' failed: error: unable to download 'https://cache.geninf.io/6k6c24kd69si8zcashcpz9pc7l0c3f22.narinfo': HTTP error 503

              response body:

              <?xml version="1.0" encoding="UTF-8" standalone="yes"?>
              <Error>
                  <Code>SlowDown</Code>
                  <Message>Your account has made too many requests; try again later.</Message>
              </Error>
failed checks.x86_64-linux.nixos-test-container 5m 0s
setup: don't know how to build these paths: /nix/store/1vp7iygydv1g5vmmh5hp7km23zqgaxza-container-test-run-container.drv warning: ignoring the client-specifie …
setup:
don't know how to build these paths:
  /nix/store/1vp7iygydv1g5vmmh5hp7km23zqgaxza-container-test-run-container.drv
warning: ignoring the client-specified setting 'store', because it is a restricted setting and you are not a trusted user
error: gRPC QueryValidPaths on 'nix-store.geninf.io:50051' failed: error: unable to download 'https://cache.clan.lol/s5b54q1if2nn7i3894nd0ipgr2a7gff5.narinfo': HTTP error 503

              response body:

              <?xml version="1.0" encoding="UTF-8" standalone="yes"?>
              <Error>
                  <Code>SlowDown</Code>
                  <Message>Your account has made too many requests; try again later.</Message>
              </Error>
failed checks.x86_64-linux.nixos-test-flash 8m 49s
setup: don't know how to build these paths: /nix/store/ndj867xygfgnaj3py8pavj7vrl4bs1gf-vm-test-run-flash.drv warning: ignoring the client-specified setting ' …
setup:
don't know how to build these paths:
  /nix/store/ndj867xygfgnaj3py8pavj7vrl4bs1gf-vm-test-run-flash.drv
warning: ignoring the client-specified setting 'store', because it is a restricted setting and you are not a trusted user
error: gRPC QueryValidPaths on 'nix-store.geninf.io:50051' failed: error: unable to download 'https://cache.clan.lol/42wdz0zb549jgs0vi79mb3ax514ii9fd.narinfo': HTTP error 503

              response body:

              <?xml version="1.0" encoding="UTF-8" standalone="yes"?>
              <Error>
                  <Code>SlowDown</Code>
                  <Message>Your account has made too many requests; try again later.</Message>
              </Error>
failed checks.x86_64-linux.nixos-test-flash-installer-boot 5s
setup: this path will be fetched (0.0 KiB download, 0.1 KiB unpacked): /nix/store/gds47h6maj6w4pxsng51lk00yvryr3d0-vm-test-run-flash-installer-boot warning: i …
setup:
this path will be fetched (0.0 KiB download, 0.1 KiB unpacked):
  /nix/store/gds47h6maj6w4pxsng51lk00yvryr3d0-vm-test-run-flash-installer-boot
warning: ignoring the client-specified setting 'store', because it is a restricted setting and you are not a trusted user
error: gRPC QueryValidPaths on 'nix-store.geninf.io:50051' failed: error: substituter 'https://cache.clan.lol' is disabled
failed checks.x86_64-linux.nixos-test-installation 5m 49s
setup: don't know how to build these paths: /nix/store/7z0qqydaxpb59m4il2ilwgilrqb6yz8q-vm-test-run-installation.drv warning: ignoring the client-specified se …
setup:
don't know how to build these paths:
  /nix/store/7z0qqydaxpb59m4il2ilwgilrqb6yz8q-vm-test-run-installation.drv
warning: ignoring the client-specified setting 'store', because it is a restricted setting and you are not a trusted user
error: gRPC QueryValidPaths on 'nix-store.geninf.io:50051' failed: error: unable to download 'https://cache.clan.lol/nd4iw0gspx55xihsc658vy56v47xc78v.narinfo': HTTP error 503

              response body:

              <?xml version="1.0" encoding="UTF-8" standalone="yes"?>
              <Error>
                  <Code>SlowDown</Code>
                  <Message>Your account has made too many requests; try again later.</Message>
              </Error>
failed checks.x86_64-linux.nixos-test-installation-age 6s
setup: this path will be fetched (0.0 KiB download, 0.1 KiB unpacked): /nix/store/izvjs9svfmmnshcc0wc0wzjii8wqxbix-vm-test-run-installation warning: ignoring …
setup:
this path will be fetched (0.0 KiB download, 0.1 KiB unpacked):
  /nix/store/izvjs9svfmmnshcc0wc0wzjii8wqxbix-vm-test-run-installation
warning: ignoring the client-specified setting 'store', because it is a restricted setting and you are not a trusted user
error: gRPC QueryValidPaths on 'nix-store.geninf.io:50051' failed: error: substituter 'https://cache.clan.lol' is disabled
failed checks.x86_64-linux.nixos-test-installation-password-store 5m 40s
setup: don't know how to build these paths: /nix/store/hmb0r8xhal8s452hjkdl70mff5ikg3gx-vm-test-run-installation.drv warning: ignoring the client-specified se …
setup:
don't know how to build these paths:
  /nix/store/hmb0r8xhal8s452hjkdl70mff5ikg3gx-vm-test-run-installation.drv
warning: ignoring the client-specified setting 'store', because it is a restricted setting and you are not a trusted user
error: gRPC QueryValidPaths on 'nix-store.geninf.io:50051' failed: error: unable to download 'https://cache.geninf.io/42h0jjdz8ncmpjfn92dy6d7y7p765fwn.narinfo': HTTP error 503

              response body:

              <?xml version="1.0" encoding="UTF-8" standalone="yes"?>
              <Error>
                  <Code>SlowDown</Code>
                  <Message>Your account has made too many requests; try again later.</Message>
              </Error>
failed checks.x86_64-linux.nixos-test-password-store-mounts 3m 0s
setup: this path will be fetched (0.0 KiB download, 0.1 KiB unpacked): /nix/store/w5k8fczkhdrm9fm6r8mz8ickrjq83yiq-vm-test-run-nixos-test-password-store-mount …
setup:
this path will be fetched (0.0 KiB download, 0.1 KiB unpacked):
  /nix/store/w5k8fczkhdrm9fm6r8mz8ickrjq83yiq-vm-test-run-nixos-test-password-store-mounts
warning: ignoring the client-specified setting 'store', because it is a restricted setting and you are not a trusted user
error: gRPC QueryValidPaths on 'nix-store.geninf.io:50051' failed: error: unable to download 'https://cache.geninf.io/705hfmrq6nnyczgfvsygj7hmjl6ipsvh.narinfo': HTTP error 503

              response body:

              <?xml version="1.0" encoding="UTF-8" standalone="yes"?>
              <Error>
                  <Code>SlowDown</Code>
                  <Message>Your account has made too many requests; try again later.</Message>
              </Error>
failed checks.x86_64-linux.nixos-test-secrets 7m 2s
setup: don't know how to build these paths: /nix/store/hkpsx6ks3abjp7wywhrbnh5fp1zm4x66-vm-test-run-secrets.drv warning: ignoring the client-specified setting …
setup:
don't know how to build these paths:
  /nix/store/hkpsx6ks3abjp7wywhrbnh5fp1zm4x66-vm-test-run-secrets.drv
warning: ignoring the client-specified setting 'store', because it is a restricted setting and you are not a trusted user
error: gRPC QueryValidPaths on 'nix-store.geninf.io:50051' failed: error: substituter 'https://cache.clan.lol' is disabled
failed checks.x86_64-linux.nixos-test-update-hardware-configuration 2m 14s
setup: don't know how to build these paths: /nix/store/kkdh37m4kj6kh4cs7bvznjkw9s3n49an-vm-test-run-update-hardware-configuration.drv warning: ignoring the cl …
setup:
don't know how to build these paths:
  /nix/store/kkdh37m4kj6kh4cs7bvznjkw9s3n49an-vm-test-run-update-hardware-configuration.drv
warning: ignoring the client-specified setting 'store', because it is a restricted setting and you are not a trusted user
error: gRPC QueryValidPaths on 'nix-store.geninf.io:50051' failed: error: unable to download 'https://cache.geninf.io/3jiihwjx1mk06h89hsxnahhhxl4pzw2x.narinfo': HTTP error 503

              response body:

              <?xml version="1.0" encoding="UTF-8" standalone="yes"?>
              <Error>
                  <Code>SlowDown</Code>
                  <Message>Your account has made too many requests; try again later.</Message>
              </Error>
failed checks.x86_64-linux.nixos-test-wayland-proxy-virtwl 3m 12s
setup: this path will be fetched (0.0 KiB download, 0.1 KiB unpacked): /nix/store/b2ijaf0jhj4aqajy03j525ba7ipbzgf7-vm-test-run-wayland-proxy-virtwl warning: i …
setup:
this path will be fetched (0.0 KiB download, 0.1 KiB unpacked):
  /nix/store/b2ijaf0jhj4aqajy03j525ba7ipbzgf7-vm-test-run-wayland-proxy-virtwl
warning: ignoring the client-specified setting 'store', because it is a restricted setting and you are not a trusted user
error: gRPC QueryValidPaths on 'nix-store.geninf.io:50051' failed: error: unable to download 'https://cache.geninf.io/6s142rc0wg3aqlq1rz8fr46q52msr4r9.narinfo': HTTP error 503

              response body:

              <?xml version="1.0" encoding="UTF-8" standalone="yes"?>
              <Error>
                  <Code>SlowDown</Code>
                  <Message>Your account has made too many requests; try again later.</Message>
              </Error>
failed checks.x86_64-linux.packages 1m 5s
setup: don't know how to build these paths: /nix/store/nwizlj4dhk2hgs705mf0vbzfrl5k5khj-container-test-run-packages.drv warning: ignoring the client-specified …
setup:
don't know how to build these paths:
  /nix/store/nwizlj4dhk2hgs705mf0vbzfrl5k5khj-container-test-run-packages.drv
warning: ignoring the client-specified setting 'store', because it is a restricted setting and you are not a trusted user
error: gRPC QueryValidPaths on 'nix-store.geninf.io:50051' failed: error: unable to download 'https://cache.geninf.io/bzl6pk7ip0k33rf709d2lnp11rf2shw2.narinfo': HTTP error 503

              response body:

              <?xml version="1.0" encoding="UTF-8" standalone="yes"?>
              <Error>
                  <Code>SlowDown</Code>
                  <Message>Your account has made too many requests; try again later.</Message>
              </Error>
failed checks.x86_64-linux.postgresql 3m 32s
setup: don't know how to build these paths: /nix/store/i6fj6f0gjna88dh6qsr24w3a0bzn41qc-container-test-run-service-postgresql.drv warning: ignoring the client …
setup:
don't know how to build these paths:
  /nix/store/i6fj6f0gjna88dh6qsr24w3a0bzn41qc-container-test-run-service-postgresql.drv
warning: ignoring the client-specified setting 'store', because it is a restricted setting and you are not a trusted user
error: gRPC QueryValidPaths on 'nix-store.geninf.io:50051' failed: error: unable to download 'https://cache.geninf.io/4jbhr3q0zgbvwrij7kqprk82xh1f6cwv.narinfo': HTTP error 503

              response body:

              <?xml version="1.0" encoding="UTF-8" standalone="yes"?>
              <Error>
                  <Code>SlowDown</Code>
                  <Message>Your account has made too many requests; try again later.</Message>
              </Error>
failed checks.x86_64-linux.sshd-no-ca 6m 26s
setup: /nix/store/flyrzbl30j6f1a4nj1j8c3y2k4hfx6kp-users-groups.json /nix/store/b6xhhk68m8npikbj3s7yp5n6xdphkk3h-util-linux-2.42.3-man /nix/store/93yf2hf7 …
setup:
  /nix/store/flyrzbl30j6f1a4nj1j8c3y2k4hfx6kp-users-groups.json
  /nix/store/b6xhhk68m8npikbj3s7yp5n6xdphkk3h-util-linux-2.42.3-man
  /nix/store/93yf2hf7b679h3g0l08rfj800m0wj303-vars-check-sshd
  /nix/store/2x69y3ij21w460lzmflyjylwbpaiamaj-which-2.23-man
  /nix/store/0qxnwnzy6wr9sn96ld299ikwfi9nnjyl-xz-5.8.4-man
  /nix/store/pjw0gfl1i83a03a6jnqcbms4kcv0yakg-zstd-1.5.7-man
warning: ignoring the client-specified setting 'store', because it is a restricted setting and you are not a trusted user
error: gRPC QueryValidPaths on 'nix-store.geninf.io:50051' failed: error: substituter 'https://cache.clan.lol' is disabled
failed checks.x86_64-linux.state-version 1m 24s
setup: this path will be fetched (0.0 KiB download, 0.1 KiB unpacked): /nix/store/d3df43kq7hpbz8v6v7i58hgbsckvcvwg-container-test-run-service-state-version wa …
setup:
this path will be fetched (0.0 KiB download, 0.1 KiB unpacked):
  /nix/store/d3df43kq7hpbz8v6v7i58hgbsckvcvwg-container-test-run-service-state-version
warning: ignoring the client-specified setting 'store', because it is a restricted setting and you are not a trusted user
error: gRPC QueryValidPaths on 'nix-store.geninf.io:50051' failed: error: unable to download 'https://cache.clan.lol/3ysj3f366wfp1c34gy7arknymyx7mcnd.narinfo': HTTP error 503

              response body:

              <?xml version="1.0" encoding="UTF-8" standalone="yes"?>
              <Error>
                  <Code>SlowDown</Code>
                  <Message>Your account has made too many requests; try again later.</Message>
              </Error>
failed checks.x86_64-linux.template-minimal 2m 11s
setup: don't know how to build these paths: /nix/store/ka70823ig95lma3d4dq276lrzkwwd3vw-nixos-system-testmachine-26.05.20260921.1e8bc65.drv warning: ignoring …
setup:
don't know how to build these paths:
  /nix/store/ka70823ig95lma3d4dq276lrzkwwd3vw-nixos-system-testmachine-26.05.20260921.1e8bc65.drv
warning: ignoring the client-specified setting 'store', because it is a restricted setting and you are not a trusted user
error: gRPC QueryValidPaths on 'nix-store.geninf.io:50051' failed: error: unable to download 'https://cache.clan.lol/jvjwmpx6mpss4j4df812m4w20mh5d79a.narinfo': HTTP error 503

              response body:

              <?xml version="1.0" encoding="UTF-8" standalone="yes"?>
              <Error>
                  <Code>SlowDown</Code>
                  <Message>Your account has made too many requests; try again later.</Message>
              </Error>
failed checks.x86_64-linux.treefmt 7m 3s
setup: this derivation will be built: /nix/store/2zn5kvmbf7l173kgac31p2w1c1s5y6sh-treefmt-check.drv this path will be fetched (0.0 KiB download, 12.9 MiB unpa …
setup:
this derivation will be built:
  /nix/store/2zn5kvmbf7l173kgac31p2w1c1s5y6sh-treefmt-check.drv
this path will be fetched (0.0 KiB download, 12.9 MiB unpacked):
  /nix/store/dw25h9lhrb4lxa7gsp4v1h2xb9pp8dri-git-lfs-3.7.1
warning: ignoring the client-specified setting 'store', because it is a restricted setting and you are not a trusted user
error: gRPC QueryValidPaths on 'nix-store.geninf.io:50051' failed: error: substituter 'https://cache.clan.lol' is disabled
failed checks.x86_64-linux.users 5m 12s
setup: this path will be fetched (0.0 KiB download, 0.1 KiB unpacked): /nix/store/c7l64rw0wgcjrq1k98yh0gcyah04yy48-container-test-run-users warning: ignoring …
setup:
this path will be fetched (0.0 KiB download, 0.1 KiB unpacked):
  /nix/store/c7l64rw0wgcjrq1k98yh0gcyah04yy48-container-test-run-users
warning: ignoring the client-specified setting 'store', because it is a restricted setting and you are not a trusted user
error: gRPC QueryValidPaths on 'nix-store.geninf.io:50051' failed: error: substituter 'https://cache.clan.lol' is disabled
failed checks.x86_64-linux.wifi 1m 13s
setup: this path will be fetched (0.0 KiB download, 0.1 KiB unpacked): /nix/store/05025ggiwx4lxd4xqnp7kzwjxk0s5yp3-vm-test-run-wifi warning: ignoring the clie …
setup:
this path will be fetched (0.0 KiB download, 0.1 KiB unpacked):
  /nix/store/05025ggiwx4lxd4xqnp7kzwjxk0s5yp3-vm-test-run-wifi
warning: ignoring the client-specified setting 'store', because it is a restricted setting and you are not a trusted user
error: gRPC QueryValidPaths on 'nix-store.geninf.io:50051' failed: error: unable to download 'https://cache.clan.lol/vrq8s1xf93b7q66xayh8yilpq52819k9.narinfo': HTTP error 503

              response body:

              <?xml version="1.0" encoding="UTF-8" standalone="yes"?>
              <Error>
                  <Code>SlowDown</Code>
                  <Message>Your account has made too many requests; try again later.</Message>
              </Error>
failed checks.x86_64-linux.yggdrasil 8m 14s
setup: swb9n2lq4hh73r9mlvxjl72386gzicf3-firewall-start.drv: error: gRPC QueryValidPaths on 'nix-store.geninf.io:50051' failed: error: substituter 'https://cache …
setup:
swb9n2lq4hh73r9mlvxjl72386gzicf3-firewall-start.drv: error: gRPC QueryValidPaths on 'nix-store.geninf.io:50051' failed: error: substituter 'https://cache.clan.lol' is disabled
yddxpfq9ijigrrdrh648ixawg7y8x49q-whitelist-controller-zerotier.drv: error: gRPC QueryValidPaths on 'nix-store.geninf.io:50051' failed: error: substituter 'https://cache.clan.lol' is disabled
74swgqvsj1i3ry8hknnq0r85nrc72rvy-yggdrasil.conf.drv: error: gRPC QueryValidPaths on 'nix-store.geninf.io:50051' failed: error: substituter 'https://cache.clan.lol' is disabled
wvwczqqp78pn5qypffmmvqqswq8p69ch-net.json.drv: error: gRPC QueryValidPaths on 'nix-store.geninf.io:50051' failed: error: substituter 'https://cache.clan.lol' is disabled
isx0ng8v49c4dv949dc7l871z17zl2bs-firewall-start.drv: build-x86-01: not scheduled here: isx0ng8v49c4dv949dc7l871z17zl2bs-firewall-start.drv, asking the scheduler again
92yhyyc3armqphwlgw0bny7jvci9ycjc-firewall-start.drv: build-x86-01: not scheduled here: 92yhyyc3armqphwlgw0bny7jvci9ycjc-firewall-start.drv, asking the scheduler again
dvgg85qvzzfzm5dk58gq8qpa4fcfj5z6-unit-40-wireguard.netdev.drv: build-x86-01: not scheduled here: dvgg85qvzzfzm5dk58gq8qpa4fcfj5z6-unit-40-wireguard.netdev.drv, asking the scheduler again
error: dependency '4z5b2nf3r0xjljchljlhjvq0wa8mds8b-nixos-test-driver-yggdrasil.drv' failed
failed checks.x86_64-linux.zerotier 7m 24s
setup: don't know how to build these paths: /nix/store/k2fpn7xza2wvg3vb7ywm31hhg796rq8m-vm-test-run-zerotier.drv warning: ignoring the client-specified settin …
setup:
don't know how to build these paths:
  /nix/store/k2fpn7xza2wvg3vb7ywm31hhg796rq8m-vm-test-run-zerotier.drv
warning: ignoring the client-specified setting 'store', because it is a restricted setting and you are not a trusted user
error: gRPC QueryValidPaths on 'nix-store.geninf.io:50051' failed: error: unable to download 'https://cache.clan.lol/s0mh3bmij91h1fpj11jrbai0cbcsw3nm.narinfo': HTTP error 503

              response body:

              <?xml version="1.0" encoding="UTF-8" standalone="yes"?>
              <Error>
                  <Code>SlowDown</Code>
                  <Message>Your account has made too many requests; try again later.</Message>
              </Error>
failed checks.x86_64-linux.zerotier-multi-instance 5m 2s
setup: don't know how to build these paths: /nix/store/clji03h3hzvy2f00c0a2hhwjb9k39rmb-vm-test-run-zerotier-multi-instance.drv warning: ignoring the client-s …
setup:
don't know how to build these paths:
  /nix/store/clji03h3hzvy2f00c0a2hhwjb9k39rmb-vm-test-run-zerotier-multi-instance.drv
warning: ignoring the client-specified setting 'store', because it is a restricted setting and you are not a trusted user
error: gRPC QueryValidPaths on 'nix-store.geninf.io:50051' failed: error: unable to download 'https://cache.clan.lol/jqnbhnw6pbfz05kr2p88f6r8zbgs4a09.narinfo': HTTP error 503

              response body:

              <?xml version="1.0" encoding="UTF-8" standalone="yes"?>
              <Error>
                  <Code>SlowDown</Code>
                  <Message>Your account has made too many requests; try again later.</Message>
              </Error>
52 succeeded
succeeded attributes
status attribute duration
loading…
1 already built
skipped attributes
status attribute duration
loading…