clan/clan-core build #773 failed ← #772 #774 →
7 failed
| status | attribute | duration |
|---|---|---|
checks.aarch64-darwin.clan-pytest-without-core
|
11s | |
clan-pytest-without-core: 0.29s call clan_cli/vars/upload_test.py::test_upload_command_no_flake 0.29s call clan_cli/vars/get_test.py::test_get_command_n …clan-pytest-without-core: 0.29s call clan_cli/vars/upload_test.py::test_upload_command_no_flake 0.29s call clan_cli/vars/get_test.py::test_get_command_no_flake 0.24s call clan_cli/vars/generate_test.py::test_generate_command_no_flake 0.23s call clan_cli/vars/list_test.py::test_list_command_no_flake 0.23s call clan_lib/persist/migrations/test_services.py::test_run_inventory_migrations_writes_file =========================== short test summary info ============================ FAILED clan_cli/machines/build_test.py::test_build_machine_skips_injection_for_format_without_add_files_script - AssertionError: assert PosixPath('/nix/var/nix/builds/nix-4461-2564415957/s... ================== 1 failed, 349 passed, 15 skipped in 4.17s =================== |
||
checks.aarch64-linux.clan-pytest-without-core
|
11s | |
clan-pytest-without-core: 0.56s setup clan_lib/ssh/remote_test.py::test_run 0.56s setup clan_lib/ssh/remote_test.py::test_sudo_ask_proxy 0.26s setup cl …clan-pytest-without-core: 0.56s setup clan_lib/ssh/remote_test.py::test_run 0.56s setup clan_lib/ssh/remote_test.py::test_sudo_ask_proxy 0.26s setup clan_lib/ssh/remote_test.py::test_run_exception 0.26s setup clan_lib/ssh/remote_test.py::test_run_environment 0.26s setup clan_lib/ssh/remote_test.py::test_run_no_shell =========================== short test summary info ============================ FAILED clan_cli/machines/build_test.py::test_build_machine_skips_injection_for_format_without_add_files_script - AssertionError: assert PosixPath('/build/store/build/pytest-of-nixbld/pytes... =================== 1 failed, 381 passed, 1 skipped in 4.65s =================== |
||
checks.x86_64-linux.clan-pytest-without-core
|
7s | |
clan-pytest-without-core: 0.40s setup clan_lib/ssh/remote_test.py::test_run_exception 0.40s setup clan_lib/ssh/remote_test.py::test_run_environment 0.40s …clan-pytest-without-core: 0.40s setup clan_lib/ssh/remote_test.py::test_run_exception 0.40s setup clan_lib/ssh/remote_test.py::test_run_environment 0.40s setup clan_lib/ssh/remote_test.py::test_run 0.22s setup clan_lib/ssh/remote_test.py::test_sudo_ask_proxy 0.22s setup clan_lib/ssh/remote_test.py::test_run_no_shell =========================== short test summary info ============================ FAILED clan_cli/machines/build_test.py::test_build_machine_skips_injection_for_format_without_add_files_script - AssertionError: assert PosixPath('/build/store/build/pytest-of-nixbld/pytes... =================== 1 failed, 381 passed, 1 skipped in 2.87s =================== |
||
checks.x86_64-linux.sshd
|
14s | |
container-test-run-sshd: !!! !!! RequestedAssertionFailed: command `ssh -i /tmp/generated-key root@server 'echo GENERATED_KEY_SUCCESS'` failed (exit code 255) …container-test-run-sshd: !!! !!! RequestedAssertionFailed: command `ssh -i /tmp/generated-key root@server 'echo GENERATED_KEY_SUCCESS'` failed (exit code 255) cleanup kill NspawnMachine (pid 52) kill NspawnMachine (pid 53) Container client terminated by signal KILL. Container server terminated by signal KILL. (finished: cleanup, in 0.23 seconds) |
||
checks.x86_64-linux.wireguard
|
15m 29s | |
container-test-run-wireguard: kill NspawnMachine (pid 59) Container ctrl2 terminated by signal KILL. Container peer1 terminated by signal KILL. kill NspawnMachi …container-test-run-wireguard: kill NspawnMachine (pid 59) Container ctrl2 terminated by signal KILL. Container peer1 terminated by signal KILL. kill NspawnMachine (pid 57) kill NspawnMachine (pid 61) Container peer2 terminated by signal KILL. Container peer3 terminated by signal KILL. (finished: cleanup, in 0.47 seconds) |
||
checks.x86_64-linux.yggdrasil
|
26s | |
vm-test-run-yggdrasil: File "/nix/store/dfqkqnafwd5cfzvqwzq1sfwyyx0lhrr4-nixos-test-driver-1.1/lib/python3.14/site-packages/test_driver/driver.py", line 437, …vm-test-run-yggdrasil: File "/nix/store/dfqkqnafwd5cfzvqwzq1sfwyyx0lhrr4-nixos-test-driver-1.1/lib/python3.14/site-packages/test_driver/driver.py", line 437, in run_tests self.test_script() ~~~~~~~~~~~~~~~~^^ File "/nix/store/dfqkqnafwd5cfzvqwzq1sfwyyx0lhrr4-nixos-test-driver-1.1/lib/python3.14/site-packages/test_driver/driver.py", line 395, in test_script exec(self.tests, symbols, None) ~~~~^^^^^^^^^^^^^^^^^^^^^^^^^^^ File "<string>", line 53, in <module> AssertionError: peer1 runtime IP 201:ca1:e6e3:8ffa:f6be:418e:1c6c:9ad4 != expected IP 205:c773:49ba:efef:1756:a797:4de0:a8b4 |
||
checks.x86_64-linux.zerotier
|
2m 21s | |
vm-test-run-zerotier: peer1 # [2026-09-27T17:09:45Z INFO virtiofsd] Client disconnected, shutting down peer1 # [2026-09-27T17:09:45Z INFO virtiofsd] Client di …vm-test-run-zerotier: peer1 # [2026-09-27T17:09:45Z INFO virtiofsd] Client disconnected, shutting down peer1 # [2026-09-27T17:09:45Z INFO virtiofsd] Client disconnected, shutting down kill QemuMachine (pid 52) peer2 # qemu-system-x86_64: terminating on signal 15 from pid 39 (/nix/store/d64q19q1xjdwfhqx6czvrjgrhq0n3lcc-python3-3.14.7/bin/python3.14) peer2 # [2026-09-27T17:09:45Z INFO virtiofsd] Client disconnected, shutting down peer2 # [2026-09-27T17:09:45Z INFO virtiofsd] Client disconnected, shutting down peer2 # [2026-09-27T17:09:45Z INFO virtiofsd] Client disconnected, shutting down (finished: cleanup, in 0.28 seconds) |
||