nixbot

builds

clan/clan-core build #777 failed

branch main · PR #8136 · commit d790244940 · · took 3h 0m · eval 36s

eval warnings 5 kinds · 162 occurrences
  • error gRPC Connect on 'nix-store.geninf.io:50051' failed: role 'write' may not call Connect ×24
  • error ×68
  • error cannot open connection to remote store 'grpc://nix-store.geninf.io:50051': error: Nix daemon disconnected unexpectedly (maybe it crashed?) ×24
  • error opening a connection to remote store 'grpc://nix-store.geninf.io:50051' previously failed ×44
  • warn stdenv.isDarwin is deprecated, use stdenv.hostPlatform.isDarwin instead ×2

102 failed ⚠ 2
failed attributes
status attribute duration
failed checks.aarch64-linux.all-packages
  • stdenv.isDarwin is deprecated, use stdenv.hostPlatform.isDarwin instead
3h 0m
setup: don't know how to build these paths: /nix/store/16249c1s84xbzymywghbp34fnva3lj9j-all-packages.drv warning: ignoring the client-specified setting 'store …
setup:
don't know how to build these paths:
  /nix/store/16249c1s84xbzymywghbp34fnva3lj9j-all-packages.drv
warning: ignoring the client-specified setting 'store', because it is a restricted setting and you are not a trusted user
3c2vikmqj2zzzdidcwrpj43brda6ldn9-nixos-install-tools-26.11pre1079672.79b6d20e5559.drv: build01: not scheduled here: 3c2vikmqj2zzzdidcwrpj43brda6ldn9-nixos-install-tools-26.11pre1079672.79b6d20e5559.drv, asking the scheduler again
failed checks.x86_64-linux.all-packages
  • stdenv.isDarwin is deprecated, use stdenv.hostPlatform.isDarwin instead
3h 0m
setup: don't know how to build these paths: /nix/store/qhirsgl2l8b1pjrqxi9fk3yjaxnn5b9d-all-packages.drv warning: ignoring the client-specified setting 'store …
setup:
don't know how to build these paths:
  /nix/store/qhirsgl2l8b1pjrqxi9fk3yjaxnn5b9d-all-packages.drv
warning: ignoring the client-specified setting 'store', because it is a restricted setting and you are not a trusted user
s6hmzjxvbl9r8h4d9fi9lphklb93qp82-clan-core-flake.drv: gi-build-x86-02: not scheduled here: s6hmzjxvbl9r8h4d9fi9lphklb93qp82-clan-core-flake.drv, asking the scheduler again
gca47a3f0cng2wq80v18rmvdxkxk50rw-disko.drv: gi-build-x86-01: not scheduled here: gca47a3f0cng2wq80v18rmvdxkxk50rw-disko.drv, asking the scheduler again
s6hmzjxvbl9r8h4d9fi9lphklb93qp82-clan-core-flake.drv: build-x86-01: not scheduled here: s6hmzjxvbl9r8h4d9fi9lphklb93qp82-clan-core-flake.drv, asking the scheduler again
gca47a3f0cng2wq80v18rmvdxkxk50rw-disko.drv: build-x86-01: not scheduled here: gca47a3f0cng2wq80v18rmvdxkxk50rw-disko.drv, asking the scheduler again
failed checks.aarch64-darwin.all-packages 3h 0m
setup: don't know how to build these paths: /nix/store/ri7zp88c9b37s183rxkha75h671zzn13-all-packages.drv warning: ignoring the client-specified setting 'store …
setup:
don't know how to build these paths:
  /nix/store/ri7zp88c9b37s183rxkha75h671zzn13-all-packages.drv
warning: ignoring the client-specified setting 'store', because it is a restricted setting and you are not a trusted user
failed checks.aarch64-darwin.clan-pytest-with-core 3h 0m
setup: don't know how to build these paths: /nix/store/ibgabydwvnnv6w1gwannks4ln7mjyn35-clan-pytest-with-core.drv warning: ignoring the client-specified setti …
setup:
don't know how to build these paths:
  /nix/store/ibgabydwvnnv6w1gwannks4ln7mjyn35-clan-pytest-with-core.drv
warning: ignoring the client-specified setting 'store', because it is a restricted setting and you are not a trusted user
failed checks.aarch64-darwin.clan-pytest-without-core 3h 0m
setup: don't know how to build these paths: /nix/store/psy53940wnri5rh5ghcc92mp3cf8qya3-clan-pytest-without-core.drv warning: ignoring the client-specified se …
setup:
don't know how to build these paths:
  /nix/store/psy53940wnri5rh5ghcc92mp3cf8qya3-clan-pytest-without-core.drv
warning: ignoring the client-specified setting 'store', because it is a restricted setting and you are not a trusted user
failed checks.aarch64-darwin.darwin-test-darwin-machine 3h 0m
setup: don't know how to build these paths: /nix/store/vpz9k6819c3vjhz96qcaryyfmcx0higb-darwin-system-26.11.4cff07d.drv warning: ignoring the client-specified …
setup:
don't know how to build these paths:
  /nix/store/vpz9k6819c3vjhz96qcaryyfmcx0higb-darwin-system-26.11.4cff07d.drv
warning: ignoring the client-specified setting 'store', because it is a restricted setting and you are not a trusted user
dependency failed checks.aarch64-darwin.devshell —
failed checks.aarch64-darwin.devShell-clan-cli 3h 0m
setup: don't know how to build these paths: /nix/store/xzg3splg1qp3h0cqdlsx9v89x0lndfbw-clan-cli.drv warning: ignoring the client-specified setting 'store', b …
setup:
don't know how to build these paths:
  /nix/store/xzg3splg1qp3h0cqdlsx9v89x0lndfbw-clan-cli.drv
warning: ignoring the client-specified setting 'store', because it is a restricted setting and you are not a trusted user
failed checks.aarch64-darwin.devShell-clan-site 3h 0m
setup: don't know how to build these paths: /nix/store/a84y0d5wdi4fhpk1dzf3s0g95706qj9m-nix-shell.drv warning: ignoring the client-specified setting 'store', …
setup:
don't know how to build these paths:
  /nix/store/a84y0d5wdi4fhpk1dzf3s0g95706qj9m-nix-shell.drv
warning: ignoring the client-specified setting 'store', because it is a restricted setting and you are not a trusted user
failed checks.aarch64-darwin.devShell-default 3h 0m
setup: these 2 derivations will be built: /nix/store/klj1h8b03ljyq909ajm8z5jplnsa9yi2-clan-runtime.drv /nix/store/jvbxpps1cnnlz57nirg7jlnf2hpd64n1-clan.drv …
setup:
these 2 derivations will be built:
  /nix/store/klj1h8b03ljyq909ajm8z5jplnsa9yi2-clan-runtime.drv
  /nix/store/jvbxpps1cnnlz57nirg7jlnf2hpd64n1-clan.drv
warning: ignoring the client-specified setting 'store', because it is a restricted setting and you are not a trusted user
failed checks.aarch64-darwin.devShell-inventory-schema 3h 0m
setup: don't know how to build these paths: /nix/store/zynd1ilpifhrdiw3wqz9p8wn0yxl8mzl-clan-inventory-schema.drv warning: ignoring the client-specified setti …
setup:
don't know how to build these paths:
  /nix/store/zynd1ilpifhrdiw3wqz9p8wn0yxl8mzl-clan-inventory-schema.drv
warning: ignoring the client-specified setting 'store', because it is a restricted setting and you are not a trusted user
failed checks.aarch64-darwin.eval-tests 3h 0m
setup: /nix/store/l5b4bxqxlif18ld1ypkbww03xn64cw6h-evalCheck-eval-age-source-path.drv /nix/store/lv93825wpbnrx7hpk5q8l7ax16jwi5sv-evalCheck-eval-generators- …
setup:
  /nix/store/l5b4bxqxlif18ld1ypkbww03xn64cw6h-evalCheck-eval-age-source-path.drv
  /nix/store/lv93825wpbnrx7hpk5q8l7ax16jwi5sv-evalCheck-eval-generators-to-sops.drv
  /nix/store/mlzyagnm8sym0mcldd9dvrp5yhiri5nw-evalCheck-eval-lib-build-clan.drv
  /nix/store/qw3j19y318pbb2hvsw5qy1d07mn3kjph-evalCheck-eval-lib-exports.drv
  /nix/store/vidsf94znk8xdkhzicy79cyii4afc7dp-evalCheck-eval-tests-installer.drv
  /nix/store/wmcxpskrdy2q08yjpparph6gc4bryvxb-evalCheck-eval-tests-hello-world.drv
  /nix/store/ilxisrc7b3sybzr17n6k33bnhmsv1l7b-eval-tests-aarch64-darwin.drv
warning: ignoring the client-specified setting 'store', because it is a restricted setting and you are not a trusted user
failed eval checks.aarch64-linux.admin —
error: … while evaluating the attribute 'drvPath' at «https://releases.nixos.org/nixpkgs/nixpkgs-26.11pre1079672.79b6d20e5559/nixexprs.tar.xz?na …
error:
       … while evaluating the attribute 'drvPath'
         at «https://releases.nixos.org/nixpkgs/nixpkgs-26.11pre1079672.79b6d20e5559/nixexprs.tar.xz?narHash=sha256-7dZDc7YUsLkMH2GAKunEeSV1Z32Zk3ssnwxV6ei575k%3D»/lib/customisation.nix:416:11:
          415|         // {
          416|           drvPath =
             |           ^
          417|             assert condition;

       … while calling the 'derivationStrict' builtin
         at «nix-internal»/derivation-internal.nix:37:12:
           36|
           37|   strict = derivationStrict drvAttrs;
             |            ^
           38|

       … while evaluating the option `driverConfiguration.vlans':

       … while evaluating definitions from `/nix/store/mqh8wsjzzvzpsnqyyh4klw0ph4a78cjl-source/nixos/lib/testing/driver-configuration.nix':

       … while evaluating the option `containers.client.networking.interfaces':

       … while evaluating definitions from `/nix/store/mqh8wsjzzvzpsnqyyh4klw0ph4a78cjl-source/nixos/modules/hardware/facter/networking':

       … while evaluating the option `containers.client.hardware.facter.enable':

       … while evaluating the option `containers.client.hardware.facter.report':

       … while evaluating the option `containers.client.hardware.facter.reportPath':

       … while evaluating definitions from `/nix/store/fdj7n8si088wabiyrmavsz9hi44n363z-source/nixosModules/clanCore/nixos-facter.nix':

       (stack trace truncated; use '--show-trace' to show the full, detailed trace)

       error: cannot open connection to remote store 'grpc://nix-store.geninf.io:50051': error: Nix daemon disconnected unexpectedly (maybe it crashed?)
failed eval checks.aarch64-linux.borgbackup —
error: … while evaluating the attribute 'drvPath' at «https://releases.nixos.org/nixpkgs/nixpkgs-26.11pre1079672.79b6d20e5559/nixexprs.tar.xz?na …
error:
       … while evaluating the attribute 'drvPath'
         at «https://releases.nixos.org/nixpkgs/nixpkgs-26.11pre1079672.79b6d20e5559/nixexprs.tar.xz?narHash=sha256-7dZDc7YUsLkMH2GAKunEeSV1Z32Zk3ssnwxV6ei575k%3D»/lib/customisation.nix:416:11:
          415|         // {
          416|           drvPath =
             |           ^
          417|             assert condition;

       … while calling the 'derivationStrict' builtin
         at «nix-internal»/derivation-internal.nix:37:12:
           36|
           37|   strict = derivationStrict drvAttrs;
             |            ^
           38|

       … while evaluating the option `driverConfiguration.vlans':

       … while evaluating definitions from `/nix/store/mqh8wsjzzvzpsnqyyh4klw0ph4a78cjl-source/nixos/lib/testing/driver-configuration.nix':

       … while evaluating the option `containers.clientone.networking.interfaces':

       … while evaluating definitions from `/nix/store/mqh8wsjzzvzpsnqyyh4klw0ph4a78cjl-source/nixos/modules/hardware/facter/networking':

       … while evaluating the option `containers.clientone.hardware.facter.enable':

       … while evaluating the option `containers.clientone.hardware.facter.report':

       … while evaluating the option `containers.clientone.hardware.facter.reportPath':

       … while evaluating definitions from `/nix/store/fdj7n8si088wabiyrmavsz9hi44n363z-source/nixosModules/clanCore/nixos-facter.nix':

       (stack trace truncated; use '--show-trace' to show the full, detailed trace)

       error: cannot open connection to remote store 'grpc://nix-store.geninf.io:50051': error: Nix daemon disconnected unexpectedly (maybe it crashed?)
failed eval checks.aarch64-linux.certificates —
error: … while evaluating the attribute 'drvPath' at «https://releases.nixos.org/nixpkgs/nixpkgs-26.11pre1079672.79b6d20e5559/nixexprs.tar.xz?na …
error:
       … while evaluating the attribute 'drvPath'
         at «https://releases.nixos.org/nixpkgs/nixpkgs-26.11pre1079672.79b6d20e5559/nixexprs.tar.xz?narHash=sha256-7dZDc7YUsLkMH2GAKunEeSV1Z32Zk3ssnwxV6ei575k%3D»/lib/customisation.nix:416:11:
          415|         // {
          416|           drvPath =
             |           ^
          417|             assert condition;

       … while calling the 'derivationStrict' builtin
         at «nix-internal»/derivation-internal.nix:37:12:
           36|
           37|   strict = derivationStrict drvAttrs;
             |            ^
           38|

       … while evaluating the option `driverConfiguration.vlans':

       … while evaluating definitions from `/nix/store/mqh8wsjzzvzpsnqyyh4klw0ph4a78cjl-source/nixos/lib/testing/driver-configuration.nix':

       … while evaluating the option `containers.ca.networking.interfaces':

       … while evaluating definitions from `/nix/store/mqh8wsjzzvzpsnqyyh4klw0ph4a78cjl-source/nixos/modules/hardware/facter/networking':

       … while evaluating the option `containers.ca.hardware.facter.enable':

       … while evaluating the option `containers.ca.hardware.facter.report':

       … while evaluating the option `containers.ca.hardware.facter.reportPath':

       … while evaluating definitions from `/nix/store/fdj7n8si088wabiyrmavsz9hi44n363z-source/nixosModules/clanCore/nixos-facter.nix':

       (stack trace truncated; use '--show-trace' to show the full, detailed trace)

       error: cannot open connection to remote store 'grpc://nix-store.geninf.io:50051': error: Nix daemon disconnected unexpectedly (maybe it crashed?)
failed checks.aarch64-linux.clan-pytest-with-core 3h 0m
setup: don't know how to build these paths: /nix/store/lpfxqz625phqqq086mi1max2lnxgxzfp-clan-pytest-with-core.drv warning: ignoring the client-specified setti …
setup:
don't know how to build these paths:
  /nix/store/lpfxqz625phqqq086mi1max2lnxgxzfp-clan-pytest-with-core.drv
warning: ignoring the client-specified setting 'store', because it is a restricted setting and you are not a trusted user
failed checks.aarch64-linux.clan-pytest-without-core 3h 0m
setup: don't know how to build these paths: /nix/store/yh56gg0phkjmr725h72qixwzyvij0x10-clan-pytest-without-core.drv warning: ignoring the client-specified se …
setup:
don't know how to build these paths:
  /nix/store/yh56gg0phkjmr725h72qixwzyvij0x10-clan-pytest-without-core.drv
warning: ignoring the client-specified setting 'store', because it is a restricted setting and you are not a trusted user
failed checks.aarch64-linux.clan-site-lint 3h 0m
setup: don't know how to build these paths: /nix/store/0gfyfa417m8d3zfnk2vxn2dzjh44zq16-clan-site-lint.drv warning: ignoring the client-specified setting 'sto …
setup:
don't know how to build these paths:
  /nix/store/0gfyfa417m8d3zfnk2vxn2dzjh44zq16-clan-site-lint.drv
warning: ignoring the client-specified setting 'store', because it is a restricted setting and you are not a trusted user
failed checks.aarch64-linux.clan-test-iso 3h 0m
setup: don't know how to build these paths: /nix/store/65nzbdqh1sadc4x7v37gpsr3x8q4rmb4--test-run-clan-test-iso.drv warning: ignoring the client-specified set …
setup:
don't know how to build these paths:
  /nix/store/65nzbdqh1sadc4x7v37gpsr3x8q4rmb4--test-run-clan-test-iso.drv
warning: ignoring the client-specified setting 'store', because it is a restricted setting and you are not a trusted user
6fz7q73vmrs8ip5l3lc5v02msxksp61d-system-path.drv: build01: not scheduled here: 6fz7q73vmrs8ip5l3lc5v02msxksp61d-system-path.drv, asking the scheduler again
failed checks.aarch64-linux.darwin-test-darwin-machine 3h 0m
setup: don't know how to build these paths: /nix/store/vpz9k6819c3vjhz96qcaryyfmcx0higb-darwin-system-26.11.4cff07d.drv warning: ignoring the client-specified …
setup:
don't know how to build these paths:
  /nix/store/vpz9k6819c3vjhz96qcaryyfmcx0higb-darwin-system-26.11.4cff07d.drv
warning: ignoring the client-specified setting 'store', because it is a restricted setting and you are not a trusted user
failed eval checks.aarch64-linux.data-mesher —
error: … while evaluating the attribute 'drvPath' at «https://releases.nixos.org/nixpkgs/nixpkgs-26.11pre1079672.79b6d20e5559/nixexprs.tar.xz?na …
error:
       … while evaluating the attribute 'drvPath'
         at «https://releases.nixos.org/nixpkgs/nixpkgs-26.11pre1079672.79b6d20e5559/nixexprs.tar.xz?narHash=sha256-7dZDc7YUsLkMH2GAKunEeSV1Z32Zk3ssnwxV6ei575k%3D»/lib/customisation.nix:416:11:
          415|         // {
          416|           drvPath =
             |           ^
          417|             assert condition;

       … while calling the 'derivationStrict' builtin
         at «nix-internal»/derivation-internal.nix:37:12:
           36|
           37|   strict = derivationStrict drvAttrs;
             |            ^
           38|

       … while evaluating the option `driverConfiguration.vlans':

       … while evaluating definitions from `/nix/store/mqh8wsjzzvzpsnqyyh4klw0ph4a78cjl-source/nixos/lib/testing/driver-configuration.nix':

       … while evaluating the option `containers.alpha.networking.interfaces':

       … while evaluating definitions from `/nix/store/mqh8wsjzzvzpsnqyyh4klw0ph4a78cjl-source/nixos/modules/hardware/facter/networking':

       … while evaluating the option `containers.alpha.hardware.facter.enable':

       … while evaluating the option `containers.alpha.hardware.facter.report':

       … while evaluating the option `containers.alpha.hardware.facter.reportPath':

       … while evaluating definitions from `/nix/store/fdj7n8si088wabiyrmavsz9hi44n363z-source/nixosModules/clanCore/nixos-facter.nix':

       (stack trace truncated; use '--show-trace' to show the full, detailed trace)

       error: cannot open connection to remote store 'grpc://nix-store.geninf.io:50051': error: Nix daemon disconnected unexpectedly (maybe it crashed?)
dependency failed checks.aarch64-linux.devshell —
failed checks.aarch64-linux.devShell-clan-cli 3h 0m
setup: don't know how to build these paths: /nix/store/dh3ik3fdxv8y1sv62iwfmaqlsqrwzqh4-clan-cli.drv warning: ignoring the client-specified setting 'store', b …
setup:
don't know how to build these paths:
  /nix/store/dh3ik3fdxv8y1sv62iwfmaqlsqrwzqh4-clan-cli.drv
warning: ignoring the client-specified setting 'store', because it is a restricted setting and you are not a trusted user
failed checks.aarch64-linux.devShell-clan-site 3h 0m
setup: don't know how to build these paths: /nix/store/yv61jzz515z0lblgbi9hvfc3c2yv93zj-nix-shell.drv warning: ignoring the client-specified setting 'store', …
setup:
don't know how to build these paths:
  /nix/store/yv61jzz515z0lblgbi9hvfc3c2yv93zj-nix-shell.drv
warning: ignoring the client-specified setting 'store', because it is a restricted setting and you are not a trusted user
failed checks.aarch64-linux.devShell-default 3h 0m
setup: these 2 derivations will be built: /nix/store/p9wv24x0mgzsni85ncrmrf9hx4wb7fhw-clan-runtime.drv /nix/store/vdkdkc1l3x8fm5n2k125q44k9qyjsh7c-clan.drv …
setup:
these 2 derivations will be built:
  /nix/store/p9wv24x0mgzsni85ncrmrf9hx4wb7fhw-clan-runtime.drv
  /nix/store/vdkdkc1l3x8fm5n2k125q44k9qyjsh7c-clan.drv
warning: ignoring the client-specified setting 'store', because it is a restricted setting and you are not a trusted user
failed checks.aarch64-linux.devShell-docs 3h 0m
setup: don't know how to build these paths: /nix/store/92s019pbfpwzy2msclp1qihxxyg6983a-nix-shell.drv warning: ignoring the client-specified setting 'store', …
setup:
don't know how to build these paths:
  /nix/store/92s019pbfpwzy2msclp1qihxxyg6983a-nix-shell.drv
warning: ignoring the client-specified setting 'store', because it is a restricted setting and you are not a trusted user
failed checks.aarch64-linux.devShell-inventory-schema 3h 0m
setup: don't know how to build these paths: /nix/store/j7l77pwpimaw5fvjbyrji350j3qqf23f-clan-inventory-schema.drv warning: ignoring the client-specified setti …
setup:
don't know how to build these paths:
  /nix/store/j7l77pwpimaw5fvjbyrji350j3qqf23f-clan-inventory-schema.drv
warning: ignoring the client-specified setting 'store', because it is a restricted setting and you are not a trusted user
failed eval checks.aarch64-linux.dm-dns —
error: … while evaluating the attribute 'drvPath' at «https://releases.nixos.org/nixpkgs/nixpkgs-26.11pre1079672.79b6d20e5559/nixexprs.tar.xz?na …
error:
       … while evaluating the attribute 'drvPath'
         at «https://releases.nixos.org/nixpkgs/nixpkgs-26.11pre1079672.79b6d20e5559/nixexprs.tar.xz?narHash=sha256-7dZDc7YUsLkMH2GAKunEeSV1Z32Zk3ssnwxV6ei575k%3D»/lib/customisation.nix:416:11:
          415|         // {
          416|           drvPath =
             |           ^
          417|             assert condition;

       … while calling the 'derivationStrict' builtin
         at «nix-internal»/derivation-internal.nix:37:12:
           36|
           37|   strict = derivationStrict drvAttrs;
             |            ^
           38|

       … while evaluating the option `driverConfiguration.vlans':

       … while evaluating definitions from `/nix/store/mqh8wsjzzvzpsnqyyh4klw0ph4a78cjl-source/nixos/lib/testing/driver-configuration.nix':

       … while evaluating the option `containers.client.networking.interfaces':

       … while evaluating definitions from `/nix/store/mqh8wsjzzvzpsnqyyh4klw0ph4a78cjl-source/nixos/modules/hardware/facter/networking':

       … while evaluating the option `containers.client.hardware.facter.enable':

       … while evaluating the option `containers.client.hardware.facter.report':

       … while evaluating the option `containers.client.hardware.facter.reportPath':

       … while evaluating definitions from `/nix/store/fdj7n8si088wabiyrmavsz9hi44n363z-source/nixosModules/clanCore/nixos-facter.nix':

       (stack trace truncated; use '--show-trace' to show the full, detailed trace)

       error: cannot open connection to remote store 'grpc://nix-store.geninf.io:50051': error: Nix daemon disconnected unexpectedly (maybe it crashed?)
failed eval checks.aarch64-linux.dyndns —
error: … while evaluating the attribute 'drvPath' at «https://releases.nixos.org/nixpkgs/nixpkgs-26.11pre1079672.79b6d20e5559/nixexprs.tar.xz?na …
error:
       … while evaluating the attribute 'drvPath'
         at «https://releases.nixos.org/nixpkgs/nixpkgs-26.11pre1079672.79b6d20e5559/nixexprs.tar.xz?narHash=sha256-7dZDc7YUsLkMH2GAKunEeSV1Z32Zk3ssnwxV6ei575k%3D»/lib/customisation.nix:416:11:
          415|         // {
          416|           drvPath =
             |           ^
          417|             assert condition;

       … while calling the 'derivationStrict' builtin
         at «nix-internal»/derivation-internal.nix:37:12:
           36|
           37|   strict = derivationStrict drvAttrs;
             |            ^
           38|

       … while evaluating the option `driverConfiguration.vlans':

       … while evaluating definitions from `/nix/store/mqh8wsjzzvzpsnqyyh4klw0ph4a78cjl-source/nixos/lib/testing/driver-configuration.nix':

       … while evaluating the option `containers.server.networking.interfaces':

       … while evaluating definitions from `/nix/store/mqh8wsjzzvzpsnqyyh4klw0ph4a78cjl-source/nixos/modules/hardware/facter/networking':

       … while evaluating the option `containers.server.hardware.facter.enable':

       … while evaluating the option `containers.server.hardware.facter.report':

       … while evaluating the option `containers.server.hardware.facter.reportPath':

       … while evaluating definitions from `/nix/store/fdj7n8si088wabiyrmavsz9hi44n363z-source/nixosModules/clanCore/nixos-facter.nix':

       (stack trace truncated; use '--show-trace' to show the full, detailed trace)

       error: cannot open connection to remote store 'grpc://nix-store.geninf.io:50051': error: Nix daemon disconnected unexpectedly (maybe it crashed?)
failed checks.aarch64-linux.eval-tests 3h 0m
setup: don't know how to build these paths: /nix/store/dcqbmfj6z8mhln05adic05r4dkpn6xpc-eval-tests-aarch64-linux.drv warning: ignoring the client-specified se …
setup:
don't know how to build these paths:
  /nix/store/dcqbmfj6z8mhln05adic05r4dkpn6xpc-eval-tests-aarch64-linux.drv
warning: ignoring the client-specified setting 'store', because it is a restricted setting and you are not a trusted user
failed eval checks.aarch64-linux.garage —
error: … while evaluating the attribute 'drvPath' at «https://releases.nixos.org/nixpkgs/nixpkgs-26.11pre1079672.79b6d20e5559/nixexprs.tar.xz?na …
error:
       … while evaluating the attribute 'drvPath'
         at «https://releases.nixos.org/nixpkgs/nixpkgs-26.11pre1079672.79b6d20e5559/nixexprs.tar.xz?narHash=sha256-7dZDc7YUsLkMH2GAKunEeSV1Z32Zk3ssnwxV6ei575k%3D»/lib/customisation.nix:416:11:
          415|         // {
          416|           drvPath =
             |           ^
          417|             assert condition;

       … while calling the 'derivationStrict' builtin
         at «nix-internal»/derivation-internal.nix:37:12:
           36|
           37|   strict = derivationStrict drvAttrs;
             |            ^
           38|

       … while evaluating the option `driverConfiguration.vlans':

       … while evaluating definitions from `/nix/store/mqh8wsjzzvzpsnqyyh4klw0ph4a78cjl-source/nixos/lib/testing/driver-configuration.nix':

       … while evaluating the option `containers.server.networking.interfaces':

       … while evaluating definitions from `/nix/store/mqh8wsjzzvzpsnqyyh4klw0ph4a78cjl-source/nixos/modules/hardware/facter/networking':

       … while evaluating the option `containers.server.hardware.facter.enable':

       … while evaluating the option `containers.server.hardware.facter.report':

       … while evaluating the option `containers.server.hardware.facter.reportPath':

       … while evaluating definitions from `/nix/store/fdj7n8si088wabiyrmavsz9hi44n363z-source/nixosModules/clanCore/nixos-facter.nix':

       (stack trace truncated; use '--show-trace' to show the full, detailed trace)

       error: cannot open connection to remote store 'grpc://nix-store.geninf.io:50051': error: Nix daemon disconnected unexpectedly (maybe it crashed?)
failed eval checks.aarch64-linux.hello-service —
error: … while evaluating the attribute 'drvPath' at «https://releases.nixos.org/nixpkgs/nixpkgs-26.11pre1079672.79b6d20e5559/nixexprs.tar.xz?na …
error:
       … while evaluating the attribute 'drvPath'
         at «https://releases.nixos.org/nixpkgs/nixpkgs-26.11pre1079672.79b6d20e5559/nixexprs.tar.xz?narHash=sha256-7dZDc7YUsLkMH2GAKunEeSV1Z32Zk3ssnwxV6ei575k%3D»/lib/customisation.nix:416:11:
          415|         // {
          416|           drvPath =
             |           ^
          417|             assert condition;

       … while calling the 'derivationStrict' builtin
         at «nix-internal»/derivation-internal.nix:37:12:
           36|
           37|   strict = derivationStrict drvAttrs;
             |            ^
           38|

       … while evaluating the option `driverConfiguration.vlans':

       … while evaluating definitions from `/nix/store/mqh8wsjzzvzpsnqyyh4klw0ph4a78cjl-source/nixos/lib/testing/driver-configuration.nix':

       … while evaluating the option `containers.peer1.networking.interfaces':

       … while evaluating definitions from `/nix/store/mqh8wsjzzvzpsnqyyh4klw0ph4a78cjl-source/nixos/modules/hardware/facter/networking':

       … while evaluating the option `containers.peer1.hardware.facter.enable':

       … while evaluating the option `containers.peer1.hardware.facter.report':

       … while evaluating the option `containers.peer1.hardware.facter.reportPath':

       … while evaluating definitions from `/nix/store/fdj7n8si088wabiyrmavsz9hi44n363z-source/nixosModules/clanCore/nixos-facter.nix':

       (stack trace truncated; use '--show-trace' to show the full, detailed trace)

       error: cannot open connection to remote store 'grpc://nix-store.geninf.io:50051': error: Nix daemon disconnected unexpectedly (maybe it crashed?)
failed eval checks.aarch64-linux.kde —
error: … while evaluating the attribute 'drvPath' at «https://releases.nixos.org/nixpkgs/nixpkgs-26.11pre1079672.79b6d20e5559/nixexprs.tar.xz?na …
error:
       … while evaluating the attribute 'drvPath'
         at «https://releases.nixos.org/nixpkgs/nixpkgs-26.11pre1079672.79b6d20e5559/nixexprs.tar.xz?narHash=sha256-7dZDc7YUsLkMH2GAKunEeSV1Z32Zk3ssnwxV6ei575k%3D»/lib/customisation.nix:416:11:
          415|         // {
          416|           drvPath =
             |           ^
          417|             assert condition;

       … while calling the 'derivationStrict' builtin
         at «nix-internal»/derivation-internal.nix:37:12:
           36|
           37|   strict = derivationStrict drvAttrs;
             |            ^
           38|

       … while evaluating the option `driverConfiguration.vlans':

       … while evaluating definitions from `/nix/store/mqh8wsjzzvzpsnqyyh4klw0ph4a78cjl-source/nixos/lib/testing/driver-configuration.nix':

       … while evaluating the option `containers.client.networking.interfaces':

       … while evaluating definitions from `/nix/store/mqh8wsjzzvzpsnqyyh4klw0ph4a78cjl-source/nixos/modules/hardware/facter/networking':

       … while evaluating the option `containers.client.hardware.facter.enable':

       … while evaluating the option `containers.client.hardware.facter.report':

       … while evaluating the option `containers.client.hardware.facter.reportPath':

       … while evaluating definitions from `/nix/store/fdj7n8si088wabiyrmavsz9hi44n363z-source/nixosModules/clanCore/nixos-facter.nix':

       (stack trace truncated; use '--show-trace' to show the full, detailed trace)

       error: opening a connection to remote store 'grpc://nix-store.geninf.io:50051' previously failed
failed eval checks.aarch64-linux.localbackup —
error: … while evaluating the attribute 'drvPath' at «https://releases.nixos.org/nixpkgs/nixpkgs-26.11pre1079672.79b6d20e5559/nixexprs.tar.xz?na …
error:
       … while evaluating the attribute 'drvPath'
         at «https://releases.nixos.org/nixpkgs/nixpkgs-26.11pre1079672.79b6d20e5559/nixexprs.tar.xz?narHash=sha256-7dZDc7YUsLkMH2GAKunEeSV1Z32Zk3ssnwxV6ei575k%3D»/lib/customisation.nix:416:11:
          415|         // {
          416|           drvPath =
             |           ^
          417|             assert condition;

       … while calling the 'derivationStrict' builtin
         at «nix-internal»/derivation-internal.nix:37:12:
           36|
           37|   strict = derivationStrict drvAttrs;
             |            ^
           38|

       … while evaluating the option `driverConfiguration.vlans':

       … while evaluating definitions from `/nix/store/mqh8wsjzzvzpsnqyyh4klw0ph4a78cjl-source/nixos/lib/testing/driver-configuration.nix':

       … while evaluating the option `containers.machine.networking.interfaces':

       … while evaluating definitions from `/nix/store/mqh8wsjzzvzpsnqyyh4klw0ph4a78cjl-source/nixos/modules/hardware/facter/networking':

       … while evaluating the option `containers.machine.hardware.facter.enable':

       … while evaluating the option `containers.machine.hardware.facter.report':

       … while evaluating the option `containers.machine.hardware.facter.reportPath':

       … while evaluating definitions from `/nix/store/fdj7n8si088wabiyrmavsz9hi44n363z-source/nixosModules/clanCore/nixos-facter.nix':

       (stack trace truncated; use '--show-trace' to show the full, detailed trace)

       error: cannot open connection to remote store 'grpc://nix-store.geninf.io:50051': error: Nix daemon disconnected unexpectedly (maybe it crashed?)
failed eval checks.aarch64-linux.machine-id —
error: … while evaluating the attribute 'drvPath' at «https://releases.nixos.org/nixpkgs/nixpkgs-26.11pre1079672.79b6d20e5559/nixexprs.tar.xz?na …
error:
       … while evaluating the attribute 'drvPath'
         at «https://releases.nixos.org/nixpkgs/nixpkgs-26.11pre1079672.79b6d20e5559/nixexprs.tar.xz?narHash=sha256-7dZDc7YUsLkMH2GAKunEeSV1Z32Zk3ssnwxV6ei575k%3D»/lib/customisation.nix:416:11:
          415|         // {
          416|           drvPath =
             |           ^
          417|             assert condition;

       … while calling the 'derivationStrict' builtin
         at «nix-internal»/derivation-internal.nix:37:12:
           36|
           37|   strict = derivationStrict drvAttrs;
             |            ^
           38|

       … while evaluating the option `driverConfiguration.vlans':

       … while evaluating definitions from `/nix/store/mqh8wsjzzvzpsnqyyh4klw0ph4a78cjl-source/nixos/lib/testing/driver-configuration.nix':

       … while evaluating the option `containers.server.networking.interfaces':

       … while evaluating definitions from `/nix/store/mqh8wsjzzvzpsnqyyh4klw0ph4a78cjl-source/nixos/modules/hardware/facter/networking':

       … while evaluating the option `containers.server.hardware.facter.enable':

       … while evaluating the option `containers.server.hardware.facter.report':

       … while evaluating the option `containers.server.hardware.facter.reportPath':

       … while evaluating definitions from `/nix/store/fdj7n8si088wabiyrmavsz9hi44n363z-source/nixosModules/clanCore/nixos-facter.nix':

       (stack trace truncated; use '--show-trace' to show the full, detailed trace)

       error: cannot open connection to remote store 'grpc://nix-store.geninf.io:50051': error: Nix daemon disconnected unexpectedly (maybe it crashed?)
failed eval checks.aarch64-linux.matrix-synapse —
error: … while evaluating the attribute 'drvPath' at «https://releases.nixos.org/nixpkgs/nixpkgs-26.11pre1079672.79b6d20e5559/nixexprs.tar.xz?na …
error:
       … while evaluating the attribute 'drvPath'
         at «https://releases.nixos.org/nixpkgs/nixpkgs-26.11pre1079672.79b6d20e5559/nixexprs.tar.xz?narHash=sha256-7dZDc7YUsLkMH2GAKunEeSV1Z32Zk3ssnwxV6ei575k%3D»/lib/customisation.nix:416:11:
          415|         // {
          416|           drvPath =
             |           ^
          417|             assert condition;

       … while calling the 'derivationStrict' builtin
         at «nix-internal»/derivation-internal.nix:37:12:
           36|
           37|   strict = derivationStrict drvAttrs;
             |            ^
           38|

       … while evaluating the option `driverConfiguration.vlans':

       … while evaluating definitions from `/nix/store/mqh8wsjzzvzpsnqyyh4klw0ph4a78cjl-source/nixos/lib/testing/driver-configuration.nix':

       … while evaluating the option `containers.machine.networking.interfaces':

       … while evaluating definitions from `/nix/store/mqh8wsjzzvzpsnqyyh4klw0ph4a78cjl-source/nixos/modules/hardware/facter/networking':

       … while evaluating the option `containers.machine.hardware.facter.enable':

       … while evaluating the option `containers.machine.hardware.facter.report':

       … while evaluating the option `containers.machine.hardware.facter.reportPath':

       … while evaluating definitions from `/nix/store/fdj7n8si088wabiyrmavsz9hi44n363z-source/nixosModules/clanCore/nixos-facter.nix':

       (stack trace truncated; use '--show-trace' to show the full, detailed trace)

       error: cannot open connection to remote store 'grpc://nix-store.geninf.io:50051': error: Nix daemon disconnected unexpectedly (maybe it crashed?)
failed eval checks.aarch64-linux.monitoring —
error: … while evaluating the attribute 'drvPath' at «https://releases.nixos.org/nixpkgs/nixpkgs-26.11pre1079672.79b6d20e5559/nixexprs.tar.xz?na …
error:
       … while evaluating the attribute 'drvPath'
         at «https://releases.nixos.org/nixpkgs/nixpkgs-26.11pre1079672.79b6d20e5559/nixexprs.tar.xz?narHash=sha256-7dZDc7YUsLkMH2GAKunEeSV1Z32Zk3ssnwxV6ei575k%3D»/lib/customisation.nix:416:11:
          415|         // {
          416|           drvPath =
             |           ^
          417|             assert condition;

       … while calling the 'derivationStrict' builtin
         at «nix-internal»/derivation-internal.nix:37:12:
           36|
           37|   strict = derivationStrict drvAttrs;
             |            ^
           38|

       … while evaluating the option `driverConfiguration.vlans':

       … while evaluating definitions from `/nix/store/mqh8wsjzzvzpsnqyyh4klw0ph4a78cjl-source/nixos/lib/testing/driver-configuration.nix':

       … while evaluating the option `containers.machine1.networking.interfaces':

       … while evaluating definitions from `/nix/store/mqh8wsjzzvzpsnqyyh4klw0ph4a78cjl-source/nixos/modules/hardware/facter/networking':

       … while evaluating the option `containers.machine1.hardware.facter.enable':

       … while evaluating the option `containers.machine1.hardware.facter.report':

       … while evaluating the option `containers.machine1.hardware.facter.reportPath':

       … while evaluating definitions from `/nix/store/fdj7n8si088wabiyrmavsz9hi44n363z-source/nixosModules/clanCore/nixos-facter.nix':

       (stack trace truncated; use '--show-trace' to show the full, detailed trace)

       error: opening a connection to remote store 'grpc://nix-store.geninf.io:50051' previously failed
failed eval checks.aarch64-linux.mycelium —
error: … while evaluating the attribute 'drvPath' at «https://releases.nixos.org/nixpkgs/nixpkgs-26.11pre1079672.79b6d20e5559/nixexprs.tar.xz?na …
error:
       … while evaluating the attribute 'drvPath'
         at «https://releases.nixos.org/nixpkgs/nixpkgs-26.11pre1079672.79b6d20e5559/nixexprs.tar.xz?narHash=sha256-7dZDc7YUsLkMH2GAKunEeSV1Z32Zk3ssnwxV6ei575k%3D»/lib/customisation.nix:416:11:
          415|         // {
          416|           drvPath =
             |           ^
          417|             assert condition;

       … while calling the 'derivationStrict' builtin
         at «nix-internal»/derivation-internal.nix:37:12:
           36|
           37|   strict = derivationStrict drvAttrs;
             |            ^
           38|

       … while evaluating the option `driverConfiguration.vlans':

       … while evaluating definitions from `/nix/store/mqh8wsjzzvzpsnqyyh4klw0ph4a78cjl-source/nixos/lib/testing/driver-configuration.nix':

       … while evaluating the option `nodes.server.networking.interfaces':

       … while evaluating definitions from `/nix/store/mqh8wsjzzvzpsnqyyh4klw0ph4a78cjl-source/nixos/modules/hardware/facter/networking':

       … while evaluating the option `nodes.server.hardware.facter.enable':

       … while evaluating the option `nodes.server.hardware.facter.report':

       … while evaluating the option `nodes.server.hardware.facter.reportPath':

       … while evaluating definitions from `/nix/store/fdj7n8si088wabiyrmavsz9hi44n363z-source/nixosModules/clanCore/nixos-facter.nix':

       (stack trace truncated; use '--show-trace' to show the full, detailed trace)

       error: opening a connection to remote store 'grpc://nix-store.geninf.io:50051' previously failed
failed eval checks.aarch64-linux.ncps —
error: … while evaluating the attribute 'drvPath' at «https://releases.nixos.org/nixpkgs/nixpkgs-26.11pre1079672.79b6d20e5559/nixexprs.tar.xz?na …
error:
       … while evaluating the attribute 'drvPath'
         at «https://releases.nixos.org/nixpkgs/nixpkgs-26.11pre1079672.79b6d20e5559/nixexprs.tar.xz?narHash=sha256-7dZDc7YUsLkMH2GAKunEeSV1Z32Zk3ssnwxV6ei575k%3D»/lib/customisation.nix:416:11:
          415|         // {
          416|           drvPath =
             |           ^
          417|             assert condition;

       … while calling the 'derivationStrict' builtin
         at «nix-internal»/derivation-internal.nix:37:12:
           36|
           37|   strict = derivationStrict drvAttrs;
             |            ^
           38|

       … while evaluating the option `driverConfiguration.vlans':

       … while evaluating definitions from `/nix/store/mqh8wsjzzvzpsnqyyh4klw0ph4a78cjl-source/nixos/lib/testing/driver-configuration.nix':

       … while evaluating the option `nodes.alice.networking.interfaces':

       … while evaluating definitions from `/nix/store/mqh8wsjzzvzpsnqyyh4klw0ph4a78cjl-source/nixos/modules/hardware/facter/networking':

       … while evaluating the option `nodes.alice.hardware.facter.enable':

       … while evaluating the option `nodes.alice.hardware.facter.report':

       … while evaluating the option `nodes.alice.hardware.facter.reportPath':

       … while evaluating definitions from `/nix/store/fdj7n8si088wabiyrmavsz9hi44n363z-source/nixosModules/clanCore/nixos-facter.nix':

       (stack trace truncated; use '--show-trace' to show the full, detailed trace)

       error: opening a connection to remote store 'grpc://nix-store.geninf.io:50051' previously failed
failed checks.aarch64-linux.nixos-documentation 3h 0m
setup: don't know how to build these paths: /nix/store/rrcncmybxwk5bpw4y514l3db09cxqg1y-nixos-system-test-documentation-26.11.20260925.79b6d20.drv warning: ig …
setup:
don't know how to build these paths:
  /nix/store/rrcncmybxwk5bpw4y514l3db09cxqg1y-nixos-system-test-documentation-26.11.20260925.79b6d20.drv
warning: ignoring the client-specified setting 'store', because it is a restricted setting and you are not a trusted user
g8z6q2bj55c67x32qhwmgcxd4dbmlmjz-etc-nix-registry.json.drv: gi-build-x86-02: not scheduled here: g8z6q2bj55c67x32qhwmgcxd4dbmlmjz-etc-nix-registry.json.drv, asking the scheduler again
failed eval checks.aarch64-linux.nixos-test-password-store-mounts —
error: … while evaluating the attribute 'drvPath' at «https://releases.nixos.org/nixpkgs/nixpkgs-26.11pre1079672.79b6d20e5559/nixexprs.tar.xz?na …
error:
       … while evaluating the attribute 'drvPath'
         at «https://releases.nixos.org/nixpkgs/nixpkgs-26.11pre1079672.79b6d20e5559/nixexprs.tar.xz?narHash=sha256-7dZDc7YUsLkMH2GAKunEeSV1Z32Zk3ssnwxV6ei575k%3D»/lib/customisation.nix:416:11:
          415|         // {
          416|           drvPath =
             |           ^
          417|             assert condition;

       … while calling the 'derivationStrict' builtin
         at «nix-internal»/derivation-internal.nix:37:12:
           36|
           37|   strict = derivationStrict drvAttrs;
             |            ^
           38|

       … while evaluating the option `driverConfiguration.vlans':

       … while evaluating definitions from `/nix/store/mqh8wsjzzvzpsnqyyh4klw0ph4a78cjl-source/nixos/lib/testing/driver-configuration.nix':

       … while evaluating the option `nodes.machine.networking.interfaces':

       … while evaluating definitions from `/nix/store/mqh8wsjzzvzpsnqyyh4klw0ph4a78cjl-source/nixos/modules/hardware/facter/networking':

       … while evaluating the option `nodes.machine.hardware.facter.enable':

       … while evaluating the option `nodes.machine.hardware.facter.report':

       … while evaluating the option `nodes.machine.hardware.facter.reportPath':

       … while evaluating definitions from `/nix/store/fdj7n8si088wabiyrmavsz9hi44n363z-source/nixosModules/clanCore/nixos-facter.nix':

       (stack trace truncated; use '--show-trace' to show the full, detailed trace)

       error: cannot open connection to remote store 'grpc://nix-store.geninf.io:50051': error: Nix daemon disconnected unexpectedly (maybe it crashed?)
failed eval checks.aarch64-linux.p2p-ssh-iroh —
error: … while evaluating the attribute 'drvPath' at «https://releases.nixos.org/nixpkgs/nixpkgs-26.11pre1079672.79b6d20e5559/nixexprs.tar.xz?na …
error:
       … while evaluating the attribute 'drvPath'
         at «https://releases.nixos.org/nixpkgs/nixpkgs-26.11pre1079672.79b6d20e5559/nixexprs.tar.xz?narHash=sha256-7dZDc7YUsLkMH2GAKunEeSV1Z32Zk3ssnwxV6ei575k%3D»/lib/customisation.nix:416:11:
          415|         // {
          416|           drvPath =
             |           ^
          417|             assert condition;

       … while calling the 'derivationStrict' builtin
         at «nix-internal»/derivation-internal.nix:37:12:
           36|
           37|   strict = derivationStrict drvAttrs;
             |            ^
           38|

       … while evaluating the option `driverConfiguration.vlans':

       … while evaluating definitions from `/nix/store/mqh8wsjzzvzpsnqyyh4klw0ph4a78cjl-source/nixos/lib/testing/driver-configuration.nix':

       … while evaluating the option `containers.client.networking.interfaces':

       … while evaluating definitions from `/nix/store/mqh8wsjzzvzpsnqyyh4klw0ph4a78cjl-source/nixos/modules/hardware/facter/networking':

       … while evaluating the option `containers.client.hardware.facter.enable':

       … while evaluating the option `containers.client.hardware.facter.report':

       … while evaluating the option `containers.client.hardware.facter.reportPath':

       … while evaluating definitions from `/nix/store/fdj7n8si088wabiyrmavsz9hi44n363z-source/nixosModules/clanCore/nixos-facter.nix':

       (stack trace truncated; use '--show-trace' to show the full, detailed trace)

       error: cannot open connection to remote store 'grpc://nix-store.geninf.io:50051': error: Nix daemon disconnected unexpectedly (maybe it crashed?)
failed eval checks.aarch64-linux.packages —
error: … while evaluating the attribute 'drvPath' at «https://releases.nixos.org/nixpkgs/nixpkgs-26.11pre1079672.79b6d20e5559/nixexprs.tar.xz?na …
error:
       … while evaluating the attribute 'drvPath'
         at «https://releases.nixos.org/nixpkgs/nixpkgs-26.11pre1079672.79b6d20e5559/nixexprs.tar.xz?narHash=sha256-7dZDc7YUsLkMH2GAKunEeSV1Z32Zk3ssnwxV6ei575k%3D»/lib/customisation.nix:416:11:
          415|         // {
          416|           drvPath =
             |           ^
          417|             assert condition;

       … while calling the 'derivationStrict' builtin
         at «nix-internal»/derivation-internal.nix:37:12:
           36|
           37|   strict = derivationStrict drvAttrs;
             |            ^
           38|

       … while evaluating the option `driverConfiguration.vlans':

       … while evaluating definitions from `/nix/store/mqh8wsjzzvzpsnqyyh4klw0ph4a78cjl-source/nixos/lib/testing/driver-configuration.nix':

       … while evaluating the option `containers.server.networking.interfaces':

       … while evaluating definitions from `/nix/store/mqh8wsjzzvzpsnqyyh4klw0ph4a78cjl-source/nixos/modules/hardware/facter/networking':

       … while evaluating the option `containers.server.hardware.facter.enable':

       … while evaluating the option `containers.server.hardware.facter.report':

       … while evaluating the option `containers.server.hardware.facter.reportPath':

       … while evaluating definitions from `/nix/store/fdj7n8si088wabiyrmavsz9hi44n363z-source/nixosModules/clanCore/nixos-facter.nix':

       (stack trace truncated; use '--show-trace' to show the full, detailed trace)

       error: opening a connection to remote store 'grpc://nix-store.geninf.io:50051' previously failed
failed eval checks.aarch64-linux.pki —
error: … while evaluating the attribute 'drvPath' at «https://releases.nixos.org/nixpkgs/nixpkgs-26.11pre1079672.79b6d20e5559/nixexprs.tar.xz?na …
error:
       … while evaluating the attribute 'drvPath'
         at «https://releases.nixos.org/nixpkgs/nixpkgs-26.11pre1079672.79b6d20e5559/nixexprs.tar.xz?narHash=sha256-7dZDc7YUsLkMH2GAKunEeSV1Z32Zk3ssnwxV6ei575k%3D»/lib/customisation.nix:416:11:
          415|         // {
          416|           drvPath =
             |           ^
          417|             assert condition;

       … while calling the 'derivationStrict' builtin
         at «nix-internal»/derivation-internal.nix:37:12:
           36|
           37|   strict = derivationStrict drvAttrs;
             |            ^
           38|

       … while evaluating the option `driverConfiguration.vlans':

       … while evaluating definitions from `/nix/store/mqh8wsjzzvzpsnqyyh4klw0ph4a78cjl-source/nixos/lib/testing/driver-configuration.nix':

       … while evaluating the option `nodes.caddy.networking.interfaces':

       … while evaluating definitions from `/nix/store/mqh8wsjzzvzpsnqyyh4klw0ph4a78cjl-source/nixos/modules/hardware/facter/networking':

       … while evaluating the option `nodes.caddy.hardware.facter.enable':

       … while evaluating the option `nodes.caddy.hardware.facter.report':

       … while evaluating the option `nodes.caddy.hardware.facter.reportPath':

       … while evaluating definitions from `/nix/store/fdj7n8si088wabiyrmavsz9hi44n363z-source/nixosModules/clanCore/nixos-facter.nix':

       (stack trace truncated; use '--show-trace' to show the full, detailed trace)

       error: opening a connection to remote store 'grpc://nix-store.geninf.io:50051' previously failed
failed eval checks.aarch64-linux.postgresql —
error: … while evaluating the attribute 'drvPath' at «https://releases.nixos.org/nixpkgs/nixpkgs-26.11pre1079672.79b6d20e5559/nixexprs.tar.xz?na …
error:
       … while evaluating the attribute 'drvPath'
         at «https://releases.nixos.org/nixpkgs/nixpkgs-26.11pre1079672.79b6d20e5559/nixexprs.tar.xz?narHash=sha256-7dZDc7YUsLkMH2GAKunEeSV1Z32Zk3ssnwxV6ei575k%3D»/lib/customisation.nix:416:11:
          415|         // {
          416|           drvPath =
             |           ^
          417|             assert condition;

       … while calling the 'derivationStrict' builtin
         at «nix-internal»/derivation-internal.nix:37:12:
           36|
           37|   strict = derivationStrict drvAttrs;
             |            ^
           38|

       … while evaluating the option `driverConfiguration.vlans':

       … while evaluating definitions from `/nix/store/mqh8wsjzzvzpsnqyyh4klw0ph4a78cjl-source/nixos/lib/testing/driver-configuration.nix':

       … while evaluating the option `containers.machine.networking.interfaces':

       … while evaluating definitions from `/nix/store/mqh8wsjzzvzpsnqyyh4klw0ph4a78cjl-source/nixos/modules/hardware/facter/networking':

       … while evaluating the option `containers.machine.hardware.facter.enable':

       … while evaluating the option `containers.machine.hardware.facter.report':

       … while evaluating the option `containers.machine.hardware.facter.reportPath':

       … while evaluating definitions from `/nix/store/fdj7n8si088wabiyrmavsz9hi44n363z-source/nixosModules/clanCore/nixos-facter.nix':

       (stack trace truncated; use '--show-trace' to show the full, detailed trace)

       error: opening a connection to remote store 'grpc://nix-store.geninf.io:50051' previously failed
failed eval checks.aarch64-linux.service-dummy-test —
error: … while evaluating the attribute 'drvPath' at «https://releases.nixos.org/nixpkgs/nixpkgs-26.11pre1079672.79b6d20e5559/nixexprs.tar.xz?na …
error:
       … while evaluating the attribute 'drvPath'
         at «https://releases.nixos.org/nixpkgs/nixpkgs-26.11pre1079672.79b6d20e5559/nixexprs.tar.xz?narHash=sha256-7dZDc7YUsLkMH2GAKunEeSV1Z32Zk3ssnwxV6ei575k%3D»/lib/customisation.nix:416:11:
          415|         // {
          416|           drvPath =
             |           ^
          417|             assert condition;

       … while calling the 'derivationStrict' builtin
         at «nix-internal»/derivation-internal.nix:37:12:
           36|
           37|   strict = derivationStrict drvAttrs;
             |            ^
           38|

       … while evaluating the option `driverConfiguration.vlans':

       … while evaluating definitions from `/nix/store/mqh8wsjzzvzpsnqyyh4klw0ph4a78cjl-source/nixos/lib/testing/driver-configuration.nix':

       … while evaluating the option `containers.admin1.networking.interfaces':

       … while evaluating definitions from `/nix/store/mqh8wsjzzvzpsnqyyh4klw0ph4a78cjl-source/nixos/modules/hardware/facter/networking':

       … while evaluating the option `containers.admin1.hardware.facter.enable':

       … while evaluating the option `containers.admin1.hardware.facter.report':

       … while evaluating the option `containers.admin1.hardware.facter.reportPath':

       … while evaluating definitions from `/nix/store/fdj7n8si088wabiyrmavsz9hi44n363z-source/nixosModules/clanCore/nixos-facter.nix':

       (stack trace truncated; use '--show-trace' to show the full, detailed trace)

       error: opening a connection to remote store 'grpc://nix-store.geninf.io:50051' previously failed
failed eval checks.aarch64-linux.service-dummy-test-from-flake —
error: … while evaluating the attribute 'drvPath' at «https://releases.nixos.org/nixpkgs/nixpkgs-26.11pre1079672.79b6d20e5559/nixexprs.tar.xz?na …
error:
       … while evaluating the attribute 'drvPath'
         at «https://releases.nixos.org/nixpkgs/nixpkgs-26.11pre1079672.79b6d20e5559/nixexprs.tar.xz?narHash=sha256-7dZDc7YUsLkMH2GAKunEeSV1Z32Zk3ssnwxV6ei575k%3D»/lib/customisation.nix:416:11:
          415|         // {
          416|           drvPath =
             |           ^
          417|             assert condition;

       … while calling the 'derivationStrict' builtin
         at «nix-internal»/derivation-internal.nix:37:12:
           36|
           37|   strict = derivationStrict drvAttrs;
             |            ^
           38|

       … while evaluating the option `driverConfiguration.vlans':

       … while evaluating definitions from `/nix/store/mqh8wsjzzvzpsnqyyh4klw0ph4a78cjl-source/nixos/lib/testing/driver-configuration.nix':

       … while evaluating the option `containers.admin1.networking.interfaces':

       … while evaluating definitions from `/nix/store/mqh8wsjzzvzpsnqyyh4klw0ph4a78cjl-source/nixos/modules/hardware/facter/networking':

       … while evaluating the option `containers.admin1.hardware.facter.enable':

       … while evaluating the option `containers.admin1.hardware.facter.report':

       … while evaluating the option `containers.admin1.hardware.facter.reportPath':

       … while evaluating definitions from `/nix/store/fdj7n8si088wabiyrmavsz9hi44n363z-source/nixosModules/clanCore/nixos-facter.nix':

       (stack trace truncated; use '--show-trace' to show the full, detailed trace)

       error: opening a connection to remote store 'grpc://nix-store.geninf.io:50051' previously failed
failed eval checks.aarch64-linux.sshd —
error: … while evaluating the attribute 'drvPath' at «https://releases.nixos.org/nixpkgs/nixpkgs-26.11pre1079672.79b6d20e5559/nixexprs.tar.xz?na …
error:
       … while evaluating the attribute 'drvPath'
         at «https://releases.nixos.org/nixpkgs/nixpkgs-26.11pre1079672.79b6d20e5559/nixexprs.tar.xz?narHash=sha256-7dZDc7YUsLkMH2GAKunEeSV1Z32Zk3ssnwxV6ei575k%3D»/lib/customisation.nix:416:11:
          415|         // {
          416|           drvPath =
             |           ^
          417|             assert condition;

       … while calling the 'derivationStrict' builtin
         at «nix-internal»/derivation-internal.nix:37:12:
           36|
           37|   strict = derivationStrict drvAttrs;
             |            ^
           38|

       … while evaluating the option `driverConfiguration.vlans':

       … while evaluating definitions from `/nix/store/mqh8wsjzzvzpsnqyyh4klw0ph4a78cjl-source/nixos/lib/testing/driver-configuration.nix':

       … while evaluating the option `containers.client.networking.interfaces':

       … while evaluating definitions from `/nix/store/mqh8wsjzzvzpsnqyyh4klw0ph4a78cjl-source/nixos/modules/hardware/facter/networking':

       … while evaluating the option `containers.client.hardware.facter.enable':

       … while evaluating the option `containers.client.hardware.facter.report':

       … while evaluating the option `containers.client.hardware.facter.reportPath':

       … while evaluating definitions from `/nix/store/fdj7n8si088wabiyrmavsz9hi44n363z-source/nixosModules/clanCore/nixos-facter.nix':

       (stack trace truncated; use '--show-trace' to show the full, detailed trace)

       error: cannot open connection to remote store 'grpc://nix-store.geninf.io:50051': error: Nix daemon disconnected unexpectedly (maybe it crashed?)
failed eval checks.aarch64-linux.sshd-no-ca —
error: … while evaluating the attribute 'drvPath' at «https://releases.nixos.org/nixpkgs/nixpkgs-26.11pre1079672.79b6d20e5559/nixexprs.tar.xz?na …
error:
       … while evaluating the attribute 'drvPath'
         at «https://releases.nixos.org/nixpkgs/nixpkgs-26.11pre1079672.79b6d20e5559/nixexprs.tar.xz?narHash=sha256-7dZDc7YUsLkMH2GAKunEeSV1Z32Zk3ssnwxV6ei575k%3D»/lib/customisation.nix:416:11:
          415|         // {
          416|           drvPath =
             |           ^
          417|             assert condition;

       … while calling the 'derivationStrict' builtin
         at «nix-internal»/derivation-internal.nix:37:12:
           36|
           37|   strict = derivationStrict drvAttrs;
             |            ^
           38|

       … while evaluating the option `driverConfiguration.vlans':

       … while evaluating definitions from `/nix/store/mqh8wsjzzvzpsnqyyh4klw0ph4a78cjl-source/nixos/lib/testing/driver-configuration.nix':

       … while evaluating the option `containers.client.networking.interfaces':

       … while evaluating definitions from `/nix/store/mqh8wsjzzvzpsnqyyh4klw0ph4a78cjl-source/nixos/modules/hardware/facter/networking':

       … while evaluating the option `containers.client.hardware.facter.enable':

       … while evaluating the option `containers.client.hardware.facter.report':

       … while evaluating the option `containers.client.hardware.facter.reportPath':

       … while evaluating definitions from `/nix/store/fdj7n8si088wabiyrmavsz9hi44n363z-source/nixosModules/clanCore/nixos-facter.nix':

       (stack trace truncated; use '--show-trace' to show the full, detailed trace)

       error: opening a connection to remote store 'grpc://nix-store.geninf.io:50051' previously failed
failed eval checks.aarch64-linux.state-version —
error: … while evaluating the attribute 'drvPath' at «https://releases.nixos.org/nixpkgs/nixpkgs-26.11pre1079672.79b6d20e5559/nixexprs.tar.xz?na …
error:
       … while evaluating the attribute 'drvPath'
         at «https://releases.nixos.org/nixpkgs/nixpkgs-26.11pre1079672.79b6d20e5559/nixexprs.tar.xz?narHash=sha256-7dZDc7YUsLkMH2GAKunEeSV1Z32Zk3ssnwxV6ei575k%3D»/lib/customisation.nix:416:11:
          415|         // {
          416|           drvPath =
             |           ^
          417|             assert condition;

       … while calling the 'derivationStrict' builtin
         at «nix-internal»/derivation-internal.nix:37:12:
           36|
           37|   strict = derivationStrict drvAttrs;
             |            ^
           38|

       … while evaluating the option `driverConfiguration.vlans':

       … while evaluating definitions from `/nix/store/mqh8wsjzzvzpsnqyyh4klw0ph4a78cjl-source/nixos/lib/testing/driver-configuration.nix':

       … while evaluating the option `containers.server.networking.interfaces':

       … while evaluating definitions from `/nix/store/mqh8wsjzzvzpsnqyyh4klw0ph4a78cjl-source/nixos/modules/hardware/facter/networking':

       … while evaluating the option `containers.server.hardware.facter.enable':

       … while evaluating the option `containers.server.hardware.facter.report':

       … while evaluating the option `containers.server.hardware.facter.reportPath':

       … while evaluating definitions from `/nix/store/fdj7n8si088wabiyrmavsz9hi44n363z-source/nixosModules/clanCore/nixos-facter.nix':

       (stack trace truncated; use '--show-trace' to show the full, detailed trace)

       error: opening a connection to remote store 'grpc://nix-store.geninf.io:50051' previously failed
failed eval checks.aarch64-linux.syncthing-service —
error: … while evaluating the attribute 'drvPath' at «https://releases.nixos.org/nixpkgs/nixpkgs-26.11pre1079672.79b6d20e5559/nixexprs.tar.xz?na …
error:
       … while evaluating the attribute 'drvPath'
         at «https://releases.nixos.org/nixpkgs/nixpkgs-26.11pre1079672.79b6d20e5559/nixexprs.tar.xz?narHash=sha256-7dZDc7YUsLkMH2GAKunEeSV1Z32Zk3ssnwxV6ei575k%3D»/lib/customisation.nix:416:11:
          415|         // {
          416|           drvPath =
             |           ^
          417|             assert condition;

       … while calling the 'derivationStrict' builtin
         at «nix-internal»/derivation-internal.nix:37:12:
           36|
           37|   strict = derivationStrict drvAttrs;
             |            ^
           38|

       … while evaluating the option `driverConfiguration.vlans':

       … while evaluating definitions from `/nix/store/mqh8wsjzzvzpsnqyyh4klw0ph4a78cjl-source/nixos/lib/testing/driver-configuration.nix':

       … while evaluating the option `containers.machine1.networking.interfaces':

       … while evaluating definitions from `/nix/store/mqh8wsjzzvzpsnqyyh4klw0ph4a78cjl-source/nixos/modules/hardware/facter/networking':

       … while evaluating the option `containers.machine1.hardware.facter.enable':

       … while evaluating the option `containers.machine1.hardware.facter.report':

       … while evaluating the option `containers.machine1.hardware.facter.reportPath':

       … while evaluating definitions from `/nix/store/fdj7n8si088wabiyrmavsz9hi44n363z-source/nixosModules/clanCore/nixos-facter.nix':

       (stack trace truncated; use '--show-trace' to show the full, detailed trace)

       error: opening a connection to remote store 'grpc://nix-store.geninf.io:50051' previously failed
failed eval checks.aarch64-linux.trusted-nix-caches —
error: … while evaluating the attribute 'drvPath' at «https://releases.nixos.org/nixpkgs/nixpkgs-26.11pre1079672.79b6d20e5559/nixexprs.tar.xz?na …
error:
       … while evaluating the attribute 'drvPath'
         at «https://releases.nixos.org/nixpkgs/nixpkgs-26.11pre1079672.79b6d20e5559/nixexprs.tar.xz?narHash=sha256-7dZDc7YUsLkMH2GAKunEeSV1Z32Zk3ssnwxV6ei575k%3D»/lib/customisation.nix:416:11:
          415|         // {
          416|           drvPath =
             |           ^
          417|             assert condition;

       … while calling the 'derivationStrict' builtin
         at «nix-internal»/derivation-internal.nix:37:12:
           36|
           37|   strict = derivationStrict drvAttrs;
             |            ^
           38|

       … while evaluating the option `driverConfiguration.vlans':

       … while evaluating definitions from `/nix/store/mqh8wsjzzvzpsnqyyh4klw0ph4a78cjl-source/nixos/lib/testing/driver-configuration.nix':

       … while evaluating the option `containers.server.networking.interfaces':

       … while evaluating definitions from `/nix/store/mqh8wsjzzvzpsnqyyh4klw0ph4a78cjl-source/nixos/modules/hardware/facter/networking':

       … while evaluating the option `containers.server.hardware.facter.enable':

       … while evaluating the option `containers.server.hardware.facter.report':

       … while evaluating the option `containers.server.hardware.facter.reportPath':

       … while evaluating definitions from `/nix/store/fdj7n8si088wabiyrmavsz9hi44n363z-source/nixosModules/clanCore/nixos-facter.nix':

       (stack trace truncated; use '--show-trace' to show the full, detailed trace)

       error: opening a connection to remote store 'grpc://nix-store.geninf.io:50051' previously failed
failed eval checks.aarch64-linux.users —
error: … while evaluating the attribute 'drvPath' at «https://releases.nixos.org/nixpkgs/nixpkgs-26.11pre1079672.79b6d20e5559/nixexprs.tar.xz?na …
error:
       … while evaluating the attribute 'drvPath'
         at «https://releases.nixos.org/nixpkgs/nixpkgs-26.11pre1079672.79b6d20e5559/nixexprs.tar.xz?narHash=sha256-7dZDc7YUsLkMH2GAKunEeSV1Z32Zk3ssnwxV6ei575k%3D»/lib/customisation.nix:416:11:
          415|         // {
          416|           drvPath =
             |           ^
          417|             assert condition;

       … while calling the 'derivationStrict' builtin
         at «nix-internal»/derivation-internal.nix:37:12:
           36|
           37|   strict = derivationStrict drvAttrs;
             |            ^
           38|

       … while evaluating the option `driverConfiguration.vlans':

       … while evaluating definitions from `/nix/store/mqh8wsjzzvzpsnqyyh4klw0ph4a78cjl-source/nixos/lib/testing/driver-configuration.nix':

       … while evaluating the option `containers.server.networking.interfaces':

       … while evaluating definitions from `/nix/store/mqh8wsjzzvzpsnqyyh4klw0ph4a78cjl-source/nixos/modules/hardware/facter/networking':

       … while evaluating the option `containers.server.hardware.facter.enable':

       … while evaluating the option `containers.server.hardware.facter.report':

       … while evaluating the option `containers.server.hardware.facter.reportPath':

       … while evaluating definitions from `/nix/store/fdj7n8si088wabiyrmavsz9hi44n363z-source/nixosModules/clanCore/nixos-facter.nix':

       (stack trace truncated; use '--show-trace' to show the full, detailed trace)

       error: opening a connection to remote store 'grpc://nix-store.geninf.io:50051' previously failed
failed eval checks.aarch64-linux.wifi —
error: … while evaluating the attribute 'drvPath' at «https://releases.nixos.org/nixpkgs/nixpkgs-26.11pre1079672.79b6d20e5559/nixexprs.tar.xz?na …
error:
       … while evaluating the attribute 'drvPath'
         at «https://releases.nixos.org/nixpkgs/nixpkgs-26.11pre1079672.79b6d20e5559/nixexprs.tar.xz?narHash=sha256-7dZDc7YUsLkMH2GAKunEeSV1Z32Zk3ssnwxV6ei575k%3D»/lib/customisation.nix:416:11:
          415|         // {
          416|           drvPath =
             |           ^
          417|             assert condition;

       … while calling the 'derivationStrict' builtin
         at «nix-internal»/derivation-internal.nix:37:12:
           36|
           37|   strict = derivationStrict drvAttrs;
             |            ^
           38|

       … while evaluating the option `driverConfiguration.vlans':

       … while evaluating definitions from `/nix/store/mqh8wsjzzvzpsnqyyh4klw0ph4a78cjl-source/nixos/lib/testing/driver-configuration.nix':

       … while evaluating the option `nodes.second.networking.interfaces':

       … while evaluating definitions from `/nix/store/mqh8wsjzzvzpsnqyyh4klw0ph4a78cjl-source/nixos/modules/hardware/facter/networking':

       … while evaluating the option `nodes.second.hardware.facter.enable':

       … while evaluating the option `nodes.second.hardware.facter.report':

       … while evaluating the option `nodes.second.hardware.facter.reportPath':

       … while evaluating definitions from `/nix/store/fdj7n8si088wabiyrmavsz9hi44n363z-source/nixosModules/clanCore/nixos-facter.nix':

       (stack trace truncated; use '--show-trace' to show the full, detailed trace)

       error: opening a connection to remote store 'grpc://nix-store.geninf.io:50051' previously failed
failed eval checks.aarch64-linux.wireguard —
error: … while evaluating the attribute 'drvPath' at «https://releases.nixos.org/nixpkgs/nixpkgs-26.11pre1079672.79b6d20e5559/nixexprs.tar.xz?na …
error:
       … while evaluating the attribute 'drvPath'
         at «https://releases.nixos.org/nixpkgs/nixpkgs-26.11pre1079672.79b6d20e5559/nixexprs.tar.xz?narHash=sha256-7dZDc7YUsLkMH2GAKunEeSV1Z32Zk3ssnwxV6ei575k%3D»/lib/customisation.nix:416:11:
          415|         // {
          416|           drvPath =
             |           ^
          417|             assert condition;

       … while calling the 'derivationStrict' builtin
         at «nix-internal»/derivation-internal.nix:37:12:
           36|
           37|   strict = derivationStrict drvAttrs;
             |            ^
           38|

       … while evaluating the option `driverConfiguration.vlans':

       … while evaluating definitions from `/nix/store/mqh8wsjzzvzpsnqyyh4klw0ph4a78cjl-source/nixos/lib/testing/driver-configuration.nix':

       … while evaluating the option `containers.ctrl1.networking.interfaces':

       … while evaluating definitions from `/nix/store/mqh8wsjzzvzpsnqyyh4klw0ph4a78cjl-source/nixos/modules/hardware/facter/networking':

       … while evaluating the option `containers.ctrl1.hardware.facter.enable':

       … while evaluating the option `containers.ctrl1.hardware.facter.report':

       … while evaluating the option `containers.ctrl1.hardware.facter.reportPath':

       … while evaluating definitions from `/nix/store/fdj7n8si088wabiyrmavsz9hi44n363z-source/nixosModules/clanCore/nixos-facter.nix':

       (stack trace truncated; use '--show-trace' to show the full, detailed trace)

       error: opening a connection to remote store 'grpc://nix-store.geninf.io:50051' previously failed
failed eval checks.aarch64-linux.yggdrasil —
error: … while evaluating the attribute 'drvPath' at «https://releases.nixos.org/nixpkgs/nixpkgs-26.11pre1079672.79b6d20e5559/nixexprs.tar.xz?na …
error:
       … while evaluating the attribute 'drvPath'
         at «https://releases.nixos.org/nixpkgs/nixpkgs-26.11pre1079672.79b6d20e5559/nixexprs.tar.xz?narHash=sha256-7dZDc7YUsLkMH2GAKunEeSV1Z32Zk3ssnwxV6ei575k%3D»/lib/customisation.nix:416:11:
          415|         // {
          416|           drvPath =
             |           ^
          417|             assert condition;

       … while calling the 'derivationStrict' builtin
         at «nix-internal»/derivation-internal.nix:37:12:
           36|
           37|   strict = derivationStrict drvAttrs;
             |            ^
           38|

       … while evaluating the option `driverConfiguration.vlans':

       … while evaluating definitions from `/nix/store/mqh8wsjzzvzpsnqyyh4klw0ph4a78cjl-source/nixos/lib/testing/driver-configuration.nix':

       … while evaluating the option `nodes.outsider.networking.interfaces':

       … while evaluating definitions from `/nix/store/mqh8wsjzzvzpsnqyyh4klw0ph4a78cjl-source/nixos/modules/hardware/facter/networking':

       … while evaluating the option `nodes.outsider.hardware.facter.enable':

       … while evaluating the option `nodes.outsider.hardware.facter.report':

       … while evaluating the option `nodes.outsider.hardware.facter.reportPath':

       … while evaluating definitions from `/nix/store/fdj7n8si088wabiyrmavsz9hi44n363z-source/nixosModules/clanCore/nixos-facter.nix':

       (stack trace truncated; use '--show-trace' to show the full, detailed trace)

       error: opening a connection to remote store 'grpc://nix-store.geninf.io:50051' previously failed
failed eval checks.aarch64-linux.zerotier —
error: … while evaluating the attribute 'drvPath' at «https://releases.nixos.org/nixpkgs/nixpkgs-26.11pre1079672.79b6d20e5559/nixexprs.tar.xz?na …
error:
       … while evaluating the attribute 'drvPath'
         at «https://releases.nixos.org/nixpkgs/nixpkgs-26.11pre1079672.79b6d20e5559/nixexprs.tar.xz?narHash=sha256-7dZDc7YUsLkMH2GAKunEeSV1Z32Zk3ssnwxV6ei575k%3D»/lib/customisation.nix:416:11:
          415|         // {
          416|           drvPath =
             |           ^
          417|             assert condition;

       … while calling the 'derivationStrict' builtin
         at «nix-internal»/derivation-internal.nix:37:12:
           36|
           37|   strict = derivationStrict drvAttrs;
             |            ^
           38|

       … while evaluating the option `driverConfiguration.vlans':

       … while evaluating definitions from `/nix/store/mqh8wsjzzvzpsnqyyh4klw0ph4a78cjl-source/nixos/lib/testing/driver-configuration.nix':

       … while evaluating the option `nodes.controller.networking.interfaces':

       … while evaluating definitions from `/nix/store/mqh8wsjzzvzpsnqyyh4klw0ph4a78cjl-source/nixos/modules/hardware/facter/networking':

       … while evaluating the option `nodes.controller.hardware.facter.enable':

       … while evaluating the option `nodes.controller.hardware.facter.report':

       … while evaluating the option `nodes.controller.hardware.facter.reportPath':

       … while evaluating definitions from `/nix/store/fdj7n8si088wabiyrmavsz9hi44n363z-source/nixosModules/clanCore/nixos-facter.nix':

       (stack trace truncated; use '--show-trace' to show the full, detailed trace)

       error: opening a connection to remote store 'grpc://nix-store.geninf.io:50051' previously failed
failed eval checks.aarch64-linux.zerotier-multi-instance —
error: … while evaluating the attribute 'drvPath' at «https://releases.nixos.org/nixpkgs/nixpkgs-26.11pre1079672.79b6d20e5559/nixexprs.tar.xz?na …
error:
       … while evaluating the attribute 'drvPath'
         at «https://releases.nixos.org/nixpkgs/nixpkgs-26.11pre1079672.79b6d20e5559/nixexprs.tar.xz?narHash=sha256-7dZDc7YUsLkMH2GAKunEeSV1Z32Zk3ssnwxV6ei575k%3D»/lib/customisation.nix:416:11:
          415|         // {
          416|           drvPath =
             |           ^
          417|             assert condition;

       … while calling the 'derivationStrict' builtin
         at «nix-internal»/derivation-internal.nix:37:12:
           36|
           37|   strict = derivationStrict drvAttrs;
             |            ^
           38|

       … while evaluating the option `driverConfiguration.vlans':

       … while evaluating definitions from `/nix/store/mqh8wsjzzvzpsnqyyh4klw0ph4a78cjl-source/nixos/lib/testing/driver-configuration.nix':

       … while evaluating the option `nodes.alpha.networking.interfaces':

       … while evaluating definitions from `/nix/store/mqh8wsjzzvzpsnqyyh4klw0ph4a78cjl-source/nixos/modules/hardware/facter/networking':

       … while evaluating the option `nodes.alpha.hardware.facter.enable':

       … while evaluating the option `nodes.alpha.hardware.facter.report':

       … while evaluating the option `nodes.alpha.hardware.facter.reportPath':

       … while evaluating definitions from `/nix/store/fdj7n8si088wabiyrmavsz9hi44n363z-source/nixosModules/clanCore/nixos-facter.nix':

       (stack trace truncated; use '--show-trace' to show the full, detailed trace)

       error: opening a connection to remote store 'grpc://nix-store.geninf.io:50051' previously failed
failed eval checks.x86_64-linux.admin —
error: … while evaluating the attribute 'drvPath' at «https://releases.nixos.org/nixpkgs/nixpkgs-26.11pre1079672.79b6d20e5559/nixexprs.tar.xz?na …
error:
       … while evaluating the attribute 'drvPath'
         at «https://releases.nixos.org/nixpkgs/nixpkgs-26.11pre1079672.79b6d20e5559/nixexprs.tar.xz?narHash=sha256-7dZDc7YUsLkMH2GAKunEeSV1Z32Zk3ssnwxV6ei575k%3D»/lib/customisation.nix:416:11:
          415|         // {
          416|           drvPath =
             |           ^
          417|             assert condition;

       … while calling the 'derivationStrict' builtin
         at «nix-internal»/derivation-internal.nix:37:12:
           36|
           37|   strict = derivationStrict drvAttrs;
             |            ^
           38|

       … while evaluating the option `driverConfiguration.vlans':

       … while evaluating definitions from `/nix/store/mqh8wsjzzvzpsnqyyh4klw0ph4a78cjl-source/nixos/lib/testing/driver-configuration.nix':

       … while evaluating the option `containers.client.networking.interfaces':

       … while evaluating definitions from `/nix/store/mqh8wsjzzvzpsnqyyh4klw0ph4a78cjl-source/nixos/modules/hardware/facter/networking':

       … while evaluating the option `containers.client.hardware.facter.enable':

       … while evaluating the option `containers.client.hardware.facter.report':

       … while evaluating the option `containers.client.hardware.facter.reportPath':

       … while evaluating definitions from `/nix/store/fdj7n8si088wabiyrmavsz9hi44n363z-source/nixosModules/clanCore/nixos-facter.nix':

       (stack trace truncated; use '--show-trace' to show the full, detailed trace)

       error: opening a connection to remote store 'grpc://nix-store.geninf.io:50051' previously failed
failed eval checks.x86_64-linux.borgbackup —
error: … while evaluating the attribute 'drvPath' at «https://releases.nixos.org/nixpkgs/nixpkgs-26.11pre1079672.79b6d20e5559/nixexprs.tar.xz?na …
error:
       … while evaluating the attribute 'drvPath'
         at «https://releases.nixos.org/nixpkgs/nixpkgs-26.11pre1079672.79b6d20e5559/nixexprs.tar.xz?narHash=sha256-7dZDc7YUsLkMH2GAKunEeSV1Z32Zk3ssnwxV6ei575k%3D»/lib/customisation.nix:416:11:
          415|         // {
          416|           drvPath =
             |           ^
          417|             assert condition;

       … while calling the 'derivationStrict' builtin
         at «nix-internal»/derivation-internal.nix:37:12:
           36|
           37|   strict = derivationStrict drvAttrs;
             |            ^
           38|

       … while evaluating the option `driverConfiguration.vlans':

       … while evaluating definitions from `/nix/store/mqh8wsjzzvzpsnqyyh4klw0ph4a78cjl-source/nixos/lib/testing/driver-configuration.nix':

       … while evaluating the option `containers.clientone.networking.interfaces':

       … while evaluating definitions from `/nix/store/mqh8wsjzzvzpsnqyyh4klw0ph4a78cjl-source/nixos/modules/hardware/facter/networking':

       … while evaluating the option `containers.clientone.hardware.facter.enable':

       … while evaluating the option `containers.clientone.hardware.facter.report':

       … while evaluating the option `containers.clientone.hardware.facter.reportPath':

       … while evaluating definitions from `/nix/store/fdj7n8si088wabiyrmavsz9hi44n363z-source/nixosModules/clanCore/nixos-facter.nix':

       (stack trace truncated; use '--show-trace' to show the full, detailed trace)

       error: opening a connection to remote store 'grpc://nix-store.geninf.io:50051' previously failed
failed eval checks.x86_64-linux.certificates —
error: … while evaluating the attribute 'drvPath' at «https://releases.nixos.org/nixpkgs/nixpkgs-26.11pre1079672.79b6d20e5559/nixexprs.tar.xz?na …
error:
       … while evaluating the attribute 'drvPath'
         at «https://releases.nixos.org/nixpkgs/nixpkgs-26.11pre1079672.79b6d20e5559/nixexprs.tar.xz?narHash=sha256-7dZDc7YUsLkMH2GAKunEeSV1Z32Zk3ssnwxV6ei575k%3D»/lib/customisation.nix:416:11:
          415|         // {
          416|           drvPath =
             |           ^
          417|             assert condition;

       … while calling the 'derivationStrict' builtin
         at «nix-internal»/derivation-internal.nix:37:12:
           36|
           37|   strict = derivationStrict drvAttrs;
             |            ^
           38|

       … while evaluating the option `driverConfiguration.vlans':

       … while evaluating definitions from `/nix/store/mqh8wsjzzvzpsnqyyh4klw0ph4a78cjl-source/nixos/lib/testing/driver-configuration.nix':

       … while evaluating the option `containers.ca.networking.interfaces':

       … while evaluating definitions from `/nix/store/mqh8wsjzzvzpsnqyyh4klw0ph4a78cjl-source/nixos/modules/hardware/facter/networking':

       … while evaluating the option `containers.ca.hardware.facter.enable':

       … while evaluating the option `containers.ca.hardware.facter.report':

       … while evaluating the option `containers.ca.hardware.facter.reportPath':

       … while evaluating definitions from `/nix/store/fdj7n8si088wabiyrmavsz9hi44n363z-source/nixosModules/clanCore/nixos-facter.nix':

       (stack trace truncated; use '--show-trace' to show the full, detailed trace)

       error: opening a connection to remote store 'grpc://nix-store.geninf.io:50051' previously failed
failed eval checks.x86_64-linux.clan-test-update —
error: … while evaluating the attribute 'drvPath' at «https://releases.nixos.org/nixpkgs/nixpkgs-26.11pre1079672.79b6d20e5559/nixexprs.tar.xz?na …
error:
       … while evaluating the attribute 'drvPath'
         at «https://releases.nixos.org/nixpkgs/nixpkgs-26.11pre1079672.79b6d20e5559/nixexprs.tar.xz?narHash=sha256-7dZDc7YUsLkMH2GAKunEeSV1Z32Zk3ssnwxV6ei575k%3D»/lib/customisation.nix:416:11:
          415|         // {
          416|           drvPath =
             |           ^
          417|             assert condition;

       … while calling the 'derivationStrict' builtin
         at «nix-internal»/derivation-internal.nix:37:12:
           36|
           37|   strict = derivationStrict drvAttrs;
             |            ^
           38|

       … while evaluating the option `driverConfiguration.vlans':

       … while evaluating definitions from `/nix/store/mqh8wsjzzvzpsnqyyh4klw0ph4a78cjl-source/nixos/lib/testing/driver-configuration.nix':

       … while evaluating the option `nodes.machine.networking.interfaces':

       … while evaluating definitions from `/nix/store/mqh8wsjzzvzpsnqyyh4klw0ph4a78cjl-source/nixos/modules/hardware/facter/networking':

       … while evaluating the option `nodes.machine.hardware.facter.enable':

       … while evaluating the option `nodes.machine.hardware.facter.report':

       … while evaluating the option `nodes.machine.hardware.facter.reportPath':

       … while evaluating definitions from `/nix/store/fdj7n8si088wabiyrmavsz9hi44n363z-source/nixosModules/clanCore/nixos-facter.nix':

       (stack trace truncated; use '--show-trace' to show the full, detailed trace)

       error: opening a connection to remote store 'grpc://nix-store.geninf.io:50051' previously failed
failed checks.x86_64-linux.darwin-test-darwin-machine 3h 0m
setup: don't know how to build these paths: /nix/store/vpz9k6819c3vjhz96qcaryyfmcx0higb-darwin-system-26.11.4cff07d.drv warning: ignoring the client-specified …
setup:
don't know how to build these paths:
  /nix/store/vpz9k6819c3vjhz96qcaryyfmcx0higb-darwin-system-26.11.4cff07d.drv
warning: ignoring the client-specified setting 'store', because it is a restricted setting and you are not a trusted user
failed eval checks.x86_64-linux.data-mesher —
error: … while evaluating the attribute 'drvPath' at «https://releases.nixos.org/nixpkgs/nixpkgs-26.11pre1079672.79b6d20e5559/nixexprs.tar.xz?na …
error:
       … while evaluating the attribute 'drvPath'
         at «https://releases.nixos.org/nixpkgs/nixpkgs-26.11pre1079672.79b6d20e5559/nixexprs.tar.xz?narHash=sha256-7dZDc7YUsLkMH2GAKunEeSV1Z32Zk3ssnwxV6ei575k%3D»/lib/customisation.nix:416:11:
          415|         // {
          416|           drvPath =
             |           ^
          417|             assert condition;

       … while calling the 'derivationStrict' builtin
         at «nix-internal»/derivation-internal.nix:37:12:
           36|
           37|   strict = derivationStrict drvAttrs;
             |            ^
           38|

       … while evaluating the option `driverConfiguration.vlans':

       … while evaluating definitions from `/nix/store/mqh8wsjzzvzpsnqyyh4klw0ph4a78cjl-source/nixos/lib/testing/driver-configuration.nix':

       … while evaluating the option `containers.alpha.networking.interfaces':

       … while evaluating definitions from `/nix/store/mqh8wsjzzvzpsnqyyh4klw0ph4a78cjl-source/nixos/modules/hardware/facter/networking':

       … while evaluating the option `containers.alpha.hardware.facter.enable':

       … while evaluating the option `containers.alpha.hardware.facter.report':

       … while evaluating the option `containers.alpha.hardware.facter.reportPath':

       … while evaluating definitions from `/nix/store/fdj7n8si088wabiyrmavsz9hi44n363z-source/nixosModules/clanCore/nixos-facter.nix':

       (stack trace truncated; use '--show-trace' to show the full, detailed trace)

       error: opening a connection to remote store 'grpc://nix-store.geninf.io:50051' previously failed
failed eval checks.x86_64-linux.dm-dns —
error: … while evaluating the attribute 'drvPath' at «https://releases.nixos.org/nixpkgs/nixpkgs-26.11pre1079672.79b6d20e5559/nixexprs.tar.xz?na …
error:
       … while evaluating the attribute 'drvPath'
         at «https://releases.nixos.org/nixpkgs/nixpkgs-26.11pre1079672.79b6d20e5559/nixexprs.tar.xz?narHash=sha256-7dZDc7YUsLkMH2GAKunEeSV1Z32Zk3ssnwxV6ei575k%3D»/lib/customisation.nix:416:11:
          415|         // {
          416|           drvPath =
             |           ^
          417|             assert condition;

       … while calling the 'derivationStrict' builtin
         at «nix-internal»/derivation-internal.nix:37:12:
           36|
           37|   strict = derivationStrict drvAttrs;
             |            ^
           38|

       … while evaluating the option `driverConfiguration.vlans':

       … while evaluating definitions from `/nix/store/mqh8wsjzzvzpsnqyyh4klw0ph4a78cjl-source/nixos/lib/testing/driver-configuration.nix':

       … while evaluating the option `containers.client.networking.interfaces':

       … while evaluating definitions from `/nix/store/mqh8wsjzzvzpsnqyyh4klw0ph4a78cjl-source/nixos/modules/hardware/facter/networking':

       … while evaluating the option `containers.client.hardware.facter.enable':

       … while evaluating the option `containers.client.hardware.facter.report':

       … while evaluating the option `containers.client.hardware.facter.reportPath':

       … while evaluating definitions from `/nix/store/fdj7n8si088wabiyrmavsz9hi44n363z-source/nixosModules/clanCore/nixos-facter.nix':

       (stack trace truncated; use '--show-trace' to show the full, detailed trace)

       error: cannot open connection to remote store 'grpc://nix-store.geninf.io:50051': error: Nix daemon disconnected unexpectedly (maybe it crashed?)
failed eval checks.x86_64-linux.dyndns —
error: … while evaluating the attribute 'drvPath' at «https://releases.nixos.org/nixpkgs/nixpkgs-26.11pre1079672.79b6d20e5559/nixexprs.tar.xz?na …
error:
       … while evaluating the attribute 'drvPath'
         at «https://releases.nixos.org/nixpkgs/nixpkgs-26.11pre1079672.79b6d20e5559/nixexprs.tar.xz?narHash=sha256-7dZDc7YUsLkMH2GAKunEeSV1Z32Zk3ssnwxV6ei575k%3D»/lib/customisation.nix:416:11:
          415|         // {
          416|           drvPath =
             |           ^
          417|             assert condition;

       … while calling the 'derivationStrict' builtin
         at «nix-internal»/derivation-internal.nix:37:12:
           36|
           37|   strict = derivationStrict drvAttrs;
             |            ^
           38|

       … while evaluating the option `driverConfiguration.vlans':

       … while evaluating definitions from `/nix/store/mqh8wsjzzvzpsnqyyh4klw0ph4a78cjl-source/nixos/lib/testing/driver-configuration.nix':

       … while evaluating the option `containers.server.networking.interfaces':

       … while evaluating definitions from `/nix/store/mqh8wsjzzvzpsnqyyh4klw0ph4a78cjl-source/nixos/modules/hardware/facter/networking':

       … while evaluating the option `containers.server.hardware.facter.enable':

       … while evaluating the option `containers.server.hardware.facter.report':

       … while evaluating the option `containers.server.hardware.facter.reportPath':

       … while evaluating definitions from `/nix/store/fdj7n8si088wabiyrmavsz9hi44n363z-source/nixosModules/clanCore/nixos-facter.nix':

       (stack trace truncated; use '--show-trace' to show the full, detailed trace)

       error: opening a connection to remote store 'grpc://nix-store.geninf.io:50051' previously failed
failed checks.x86_64-linux.eval-tests 3h 0m
setup: don't know how to build these paths: /nix/store/lpy6dy95935cz3kk1ixf0smqzrj88g26-eval-tests-x86_64-linux.drv warning: ignoring the client-specified set …
setup:
don't know how to build these paths:
  /nix/store/lpy6dy95935cz3kk1ixf0smqzrj88g26-eval-tests-x86_64-linux.drv
warning: ignoring the client-specified setting 'store', because it is a restricted setting and you are not a trusted user
failed eval checks.x86_64-linux.garage —
error: … while evaluating the attribute 'drvPath' at «https://releases.nixos.org/nixpkgs/nixpkgs-26.11pre1079672.79b6d20e5559/nixexprs.tar.xz?na …
error:
       … while evaluating the attribute 'drvPath'
         at «https://releases.nixos.org/nixpkgs/nixpkgs-26.11pre1079672.79b6d20e5559/nixexprs.tar.xz?narHash=sha256-7dZDc7YUsLkMH2GAKunEeSV1Z32Zk3ssnwxV6ei575k%3D»/lib/customisation.nix:416:11:
          415|         // {
          416|           drvPath =
             |           ^
          417|             assert condition;

       … while calling the 'derivationStrict' builtin
         at «nix-internal»/derivation-internal.nix:37:12:
           36|
           37|   strict = derivationStrict drvAttrs;
             |            ^
           38|

       … while evaluating the option `driverConfiguration.vlans':

       … while evaluating definitions from `/nix/store/mqh8wsjzzvzpsnqyyh4klw0ph4a78cjl-source/nixos/lib/testing/driver-configuration.nix':

       … while evaluating the option `containers.server.networking.interfaces':

       … while evaluating definitions from `/nix/store/mqh8wsjzzvzpsnqyyh4klw0ph4a78cjl-source/nixos/modules/hardware/facter/networking':

       … while evaluating the option `containers.server.hardware.facter.enable':

       … while evaluating the option `containers.server.hardware.facter.report':

       … while evaluating the option `containers.server.hardware.facter.reportPath':

       … while evaluating definitions from `/nix/store/fdj7n8si088wabiyrmavsz9hi44n363z-source/nixosModules/clanCore/nixos-facter.nix':

       (stack trace truncated; use '--show-trace' to show the full, detailed trace)

       error: opening a connection to remote store 'grpc://nix-store.geninf.io:50051' previously failed
failed eval checks.x86_64-linux.hello-service —
error: … while evaluating the attribute 'drvPath' at «https://releases.nixos.org/nixpkgs/nixpkgs-26.11pre1079672.79b6d20e5559/nixexprs.tar.xz?na …
error:
       … while evaluating the attribute 'drvPath'
         at «https://releases.nixos.org/nixpkgs/nixpkgs-26.11pre1079672.79b6d20e5559/nixexprs.tar.xz?narHash=sha256-7dZDc7YUsLkMH2GAKunEeSV1Z32Zk3ssnwxV6ei575k%3D»/lib/customisation.nix:416:11:
          415|         // {
          416|           drvPath =
             |           ^
          417|             assert condition;

       … while calling the 'derivationStrict' builtin
         at «nix-internal»/derivation-internal.nix:37:12:
           36|
           37|   strict = derivationStrict drvAttrs;
             |            ^
           38|

       … while evaluating the option `driverConfiguration.vlans':

       … while evaluating definitions from `/nix/store/mqh8wsjzzvzpsnqyyh4klw0ph4a78cjl-source/nixos/lib/testing/driver-configuration.nix':

       … while evaluating the option `containers.peer1.networking.interfaces':

       … while evaluating definitions from `/nix/store/mqh8wsjzzvzpsnqyyh4klw0ph4a78cjl-source/nixos/modules/hardware/facter/networking':

       … while evaluating the option `containers.peer1.hardware.facter.enable':

       … while evaluating the option `containers.peer1.hardware.facter.report':

       … while evaluating the option `containers.peer1.hardware.facter.reportPath':

       … while evaluating definitions from `/nix/store/fdj7n8si088wabiyrmavsz9hi44n363z-source/nixosModules/clanCore/nixos-facter.nix':

       (stack trace truncated; use '--show-trace' to show the full, detailed trace)

       error: opening a connection to remote store 'grpc://nix-store.geninf.io:50051' previously failed
failed eval checks.x86_64-linux.kde —
error: … while evaluating the attribute 'drvPath' at «https://releases.nixos.org/nixpkgs/nixpkgs-26.11pre1079672.79b6d20e5559/nixexprs.tar.xz?na …
error:
       … while evaluating the attribute 'drvPath'
         at «https://releases.nixos.org/nixpkgs/nixpkgs-26.11pre1079672.79b6d20e5559/nixexprs.tar.xz?narHash=sha256-7dZDc7YUsLkMH2GAKunEeSV1Z32Zk3ssnwxV6ei575k%3D»/lib/customisation.nix:416:11:
          415|         // {
          416|           drvPath =
             |           ^
          417|             assert condition;

       … while calling the 'derivationStrict' builtin
         at «nix-internal»/derivation-internal.nix:37:12:
           36|
           37|   strict = derivationStrict drvAttrs;
             |            ^
           38|

       … while evaluating the option `driverConfiguration.vlans':

       … while evaluating definitions from `/nix/store/mqh8wsjzzvzpsnqyyh4klw0ph4a78cjl-source/nixos/lib/testing/driver-configuration.nix':

       … while evaluating the option `containers.client.networking.interfaces':

       … while evaluating definitions from `/nix/store/mqh8wsjzzvzpsnqyyh4klw0ph4a78cjl-source/nixos/modules/hardware/facter/networking':

       … while evaluating the option `containers.client.hardware.facter.enable':

       … while evaluating the option `containers.client.hardware.facter.report':

       … while evaluating the option `containers.client.hardware.facter.reportPath':

       … while evaluating definitions from `/nix/store/fdj7n8si088wabiyrmavsz9hi44n363z-source/nixosModules/clanCore/nixos-facter.nix':

       (stack trace truncated; use '--show-trace' to show the full, detailed trace)

       error: opening a connection to remote store 'grpc://nix-store.geninf.io:50051' previously failed
failed eval checks.x86_64-linux.localbackup —
error: … while evaluating the attribute 'drvPath' at «https://releases.nixos.org/nixpkgs/nixpkgs-26.11pre1079672.79b6d20e5559/nixexprs.tar.xz?na …
error:
       … while evaluating the attribute 'drvPath'
         at «https://releases.nixos.org/nixpkgs/nixpkgs-26.11pre1079672.79b6d20e5559/nixexprs.tar.xz?narHash=sha256-7dZDc7YUsLkMH2GAKunEeSV1Z32Zk3ssnwxV6ei575k%3D»/lib/customisation.nix:416:11:
          415|         // {
          416|           drvPath =
             |           ^
          417|             assert condition;

       … while calling the 'derivationStrict' builtin
         at «nix-internal»/derivation-internal.nix:37:12:
           36|
           37|   strict = derivationStrict drvAttrs;
             |            ^
           38|

       … while evaluating the option `driverConfiguration.vlans':

       … while evaluating definitions from `/nix/store/mqh8wsjzzvzpsnqyyh4klw0ph4a78cjl-source/nixos/lib/testing/driver-configuration.nix':

       … while evaluating the option `containers.machine.networking.interfaces':

       … while evaluating definitions from `/nix/store/mqh8wsjzzvzpsnqyyh4klw0ph4a78cjl-source/nixos/modules/hardware/facter/networking':

       … while evaluating the option `containers.machine.hardware.facter.enable':

       … while evaluating the option `containers.machine.hardware.facter.report':

       … while evaluating the option `containers.machine.hardware.facter.reportPath':

       … while evaluating definitions from `/nix/store/fdj7n8si088wabiyrmavsz9hi44n363z-source/nixosModules/clanCore/nixos-facter.nix':

       (stack trace truncated; use '--show-trace' to show the full, detailed trace)

       error: opening a connection to remote store 'grpc://nix-store.geninf.io:50051' previously failed
failed eval checks.x86_64-linux.machine-id —
error: … while evaluating the attribute 'drvPath' at «https://releases.nixos.org/nixpkgs/nixpkgs-26.11pre1079672.79b6d20e5559/nixexprs.tar.xz?na …
error:
       … while evaluating the attribute 'drvPath'
         at «https://releases.nixos.org/nixpkgs/nixpkgs-26.11pre1079672.79b6d20e5559/nixexprs.tar.xz?narHash=sha256-7dZDc7YUsLkMH2GAKunEeSV1Z32Zk3ssnwxV6ei575k%3D»/lib/customisation.nix:416:11:
          415|         // {
          416|           drvPath =
             |           ^
          417|             assert condition;

       … while calling the 'derivationStrict' builtin
         at «nix-internal»/derivation-internal.nix:37:12:
           36|
           37|   strict = derivationStrict drvAttrs;
             |            ^
           38|

       … while evaluating the option `driverConfiguration.vlans':

       … while evaluating definitions from `/nix/store/mqh8wsjzzvzpsnqyyh4klw0ph4a78cjl-source/nixos/lib/testing/driver-configuration.nix':

       … while evaluating the option `containers.server.networking.interfaces':

       … while evaluating definitions from `/nix/store/mqh8wsjzzvzpsnqyyh4klw0ph4a78cjl-source/nixos/modules/hardware/facter/networking':

       … while evaluating the option `containers.server.hardware.facter.enable':

       … while evaluating the option `containers.server.hardware.facter.report':

       … while evaluating the option `containers.server.hardware.facter.reportPath':

       … while evaluating definitions from `/nix/store/fdj7n8si088wabiyrmavsz9hi44n363z-source/nixosModules/clanCore/nixos-facter.nix':

       (stack trace truncated; use '--show-trace' to show the full, detailed trace)

       error: cannot open connection to remote store 'grpc://nix-store.geninf.io:50051': error: Nix daemon disconnected unexpectedly (maybe it crashed?)
failed eval checks.x86_64-linux.matrix-synapse —
error: … while evaluating the attribute 'drvPath' at «https://releases.nixos.org/nixpkgs/nixpkgs-26.11pre1079672.79b6d20e5559/nixexprs.tar.xz?na …
error:
       … while evaluating the attribute 'drvPath'
         at «https://releases.nixos.org/nixpkgs/nixpkgs-26.11pre1079672.79b6d20e5559/nixexprs.tar.xz?narHash=sha256-7dZDc7YUsLkMH2GAKunEeSV1Z32Zk3ssnwxV6ei575k%3D»/lib/customisation.nix:416:11:
          415|         // {
          416|           drvPath =
             |           ^
          417|             assert condition;

       … while calling the 'derivationStrict' builtin
         at «nix-internal»/derivation-internal.nix:37:12:
           36|
           37|   strict = derivationStrict drvAttrs;
             |            ^
           38|

       … while evaluating the option `driverConfiguration.vlans':

       … while evaluating definitions from `/nix/store/mqh8wsjzzvzpsnqyyh4klw0ph4a78cjl-source/nixos/lib/testing/driver-configuration.nix':

       … while evaluating the option `containers.machine.networking.interfaces':

       … while evaluating definitions from `/nix/store/mqh8wsjzzvzpsnqyyh4klw0ph4a78cjl-source/nixos/modules/hardware/facter/networking':

       … while evaluating the option `containers.machine.hardware.facter.enable':

       … while evaluating the option `containers.machine.hardware.facter.report':

       … while evaluating the option `containers.machine.hardware.facter.reportPath':

       … while evaluating definitions from `/nix/store/fdj7n8si088wabiyrmavsz9hi44n363z-source/nixosModules/clanCore/nixos-facter.nix':

       (stack trace truncated; use '--show-trace' to show the full, detailed trace)

       error: opening a connection to remote store 'grpc://nix-store.geninf.io:50051' previously failed
failed eval checks.x86_64-linux.monitoring —
error: … while evaluating the attribute 'drvPath' at «https://releases.nixos.org/nixpkgs/nixpkgs-26.11pre1079672.79b6d20e5559/nixexprs.tar.xz?na …
error:
       … while evaluating the attribute 'drvPath'
         at «https://releases.nixos.org/nixpkgs/nixpkgs-26.11pre1079672.79b6d20e5559/nixexprs.tar.xz?narHash=sha256-7dZDc7YUsLkMH2GAKunEeSV1Z32Zk3ssnwxV6ei575k%3D»/lib/customisation.nix:416:11:
          415|         // {
          416|           drvPath =
             |           ^
          417|             assert condition;

       … while calling the 'derivationStrict' builtin
         at «nix-internal»/derivation-internal.nix:37:12:
           36|
           37|   strict = derivationStrict drvAttrs;
             |            ^
           38|

       … while evaluating the option `driverConfiguration.vlans':

       … while evaluating definitions from `/nix/store/mqh8wsjzzvzpsnqyyh4klw0ph4a78cjl-source/nixos/lib/testing/driver-configuration.nix':

       … while evaluating the option `containers.machine1.networking.interfaces':

       … while evaluating definitions from `/nix/store/mqh8wsjzzvzpsnqyyh4klw0ph4a78cjl-source/nixos/modules/hardware/facter/networking':

       … while evaluating the option `containers.machine1.hardware.facter.enable':

       … while evaluating the option `containers.machine1.hardware.facter.report':

       … while evaluating the option `containers.machine1.hardware.facter.reportPath':

       … while evaluating definitions from `/nix/store/fdj7n8si088wabiyrmavsz9hi44n363z-source/nixosModules/clanCore/nixos-facter.nix':

       (stack trace truncated; use '--show-trace' to show the full, detailed trace)

       error: opening a connection to remote store 'grpc://nix-store.geninf.io:50051' previously failed
failed eval checks.x86_64-linux.mycelium —
error: … while evaluating the attribute 'drvPath' at «https://releases.nixos.org/nixpkgs/nixpkgs-26.11pre1079672.79b6d20e5559/nixexprs.tar.xz?na …
error:
       … while evaluating the attribute 'drvPath'
         at «https://releases.nixos.org/nixpkgs/nixpkgs-26.11pre1079672.79b6d20e5559/nixexprs.tar.xz?narHash=sha256-7dZDc7YUsLkMH2GAKunEeSV1Z32Zk3ssnwxV6ei575k%3D»/lib/customisation.nix:416:11:
          415|         // {
          416|           drvPath =
             |           ^
          417|             assert condition;

       … while calling the 'derivationStrict' builtin
         at «nix-internal»/derivation-internal.nix:37:12:
           36|
           37|   strict = derivationStrict drvAttrs;
             |            ^
           38|

       … while evaluating the option `driverConfiguration.vlans':

       … while evaluating definitions from `/nix/store/mqh8wsjzzvzpsnqyyh4klw0ph4a78cjl-source/nixos/lib/testing/driver-configuration.nix':

       … while evaluating the option `nodes.server.networking.interfaces':

       … while evaluating definitions from `/nix/store/mqh8wsjzzvzpsnqyyh4klw0ph4a78cjl-source/nixos/modules/hardware/facter/networking':

       … while evaluating the option `nodes.server.hardware.facter.enable':

       … while evaluating the option `nodes.server.hardware.facter.report':

       … while evaluating the option `nodes.server.hardware.facter.reportPath':

       … while evaluating definitions from `/nix/store/fdj7n8si088wabiyrmavsz9hi44n363z-source/nixosModules/clanCore/nixos-facter.nix':

       (stack trace truncated; use '--show-trace' to show the full, detailed trace)

       error: opening a connection to remote store 'grpc://nix-store.geninf.io:50051' previously failed
failed eval checks.x86_64-linux.ncps —
error: … while evaluating the attribute 'drvPath' at «https://releases.nixos.org/nixpkgs/nixpkgs-26.11pre1079672.79b6d20e5559/nixexprs.tar.xz?na …
error:
       … while evaluating the attribute 'drvPath'
         at «https://releases.nixos.org/nixpkgs/nixpkgs-26.11pre1079672.79b6d20e5559/nixexprs.tar.xz?narHash=sha256-7dZDc7YUsLkMH2GAKunEeSV1Z32Zk3ssnwxV6ei575k%3D»/lib/customisation.nix:416:11:
          415|         // {
          416|           drvPath =
             |           ^
          417|             assert condition;

       … while calling the 'derivationStrict' builtin
         at «nix-internal»/derivation-internal.nix:37:12:
           36|
           37|   strict = derivationStrict drvAttrs;
             |            ^
           38|

       … while evaluating the option `driverConfiguration.vlans':

       … while evaluating definitions from `/nix/store/mqh8wsjzzvzpsnqyyh4klw0ph4a78cjl-source/nixos/lib/testing/driver-configuration.nix':

       … while evaluating the option `nodes.alice.networking.interfaces':

       … while evaluating definitions from `/nix/store/mqh8wsjzzvzpsnqyyh4klw0ph4a78cjl-source/nixos/modules/hardware/facter/networking':

       … while evaluating the option `nodes.alice.hardware.facter.enable':

       … while evaluating the option `nodes.alice.hardware.facter.report':

       … while evaluating the option `nodes.alice.hardware.facter.reportPath':

       … while evaluating definitions from `/nix/store/fdj7n8si088wabiyrmavsz9hi44n363z-source/nixosModules/clanCore/nixos-facter.nix':

       (stack trace truncated; use '--show-trace' to show the full, detailed trace)

       error: opening a connection to remote store 'grpc://nix-store.geninf.io:50051' previously failed
failed checks.x86_64-linux.nixos-documentation 3h 0m
setup: don't know how to build these paths: /nix/store/rrcncmybxwk5bpw4y514l3db09cxqg1y-nixos-system-test-documentation-26.11.20260925.79b6d20.drv warning: ig …
setup:
don't know how to build these paths:
  /nix/store/rrcncmybxwk5bpw4y514l3db09cxqg1y-nixos-system-test-documentation-26.11.20260925.79b6d20.drv
warning: ignoring the client-specified setting 'store', because it is a restricted setting and you are not a trusted user
g8z6q2bj55c67x32qhwmgcxd4dbmlmjz-etc-nix-registry.json.drv: gi-build-x86-02: not scheduled here: g8z6q2bj55c67x32qhwmgcxd4dbmlmjz-etc-nix-registry.json.drv, asking the scheduler again
failed checks.x86_64-linux.nixos-test-flash 3h 0m
setup: don't know how to build these paths: /nix/store/13484bg2vhcr1gb5y261abrgni52gc9j-vm-test-run-flash.drv warning: ignoring the client-specified setting ' …
setup:
don't know how to build these paths:
  /nix/store/13484bg2vhcr1gb5y261abrgni52gc9j-vm-test-run-flash.drv
warning: ignoring the client-specified setting 'store', because it is a restricted setting and you are not a trusted user
r109667g9418zh9ysif2jpnmwrc6rq4i-test-script.drv: build-x86-01: not scheduled here: r109667g9418zh9ysif2jpnmwrc6rq4i-test-script.drv, asking the scheduler again
lyp5a0y21gy6zm7i4xhcdzmcpipqk6w1-closure-info.drv: build-x86-01: not scheduled here: lyp5a0y21gy6zm7i4xhcdzmcpipqk6w1-closure-info.drv, asking the scheduler again
failed checks.x86_64-linux.nixos-test-flash-installer-boot 3h 0m
setup: /nix/store/i7w5milvb85ph6x8rgv7f67bpq3s28x4-sudoers /nix/store/nkyz42bg3b49fcpb6d5cbcbf7bcph2hf-testdisk-7.2 /nix/store/mqw17azb09csh2nnm3l5zjvmdkf …
setup:
  /nix/store/i7w5milvb85ph6x8rgv7f67bpq3s28x4-sudoers
  /nix/store/nkyz42bg3b49fcpb6d5cbcbf7bcph2hf-testdisk-7.2
  /nix/store/mqw17azb09csh2nnm3l5zjvmdkfl7jha-testdisk-7.2-man
  /nix/store/1qswf1mgr8xqvclxcgnd61bygyzac86m-tor-0.4.9.13
  /nix/store/lglivnxwpinc046nlzv9nspdl37b0a3a-tor-0.4.9.13-geoip
  /nix/store/wfqcg62dadknanwcvk7ac5k3hlnjzvxz-users-groups.json
warning: ignoring the client-specified setting 'store', because it is a restricted setting and you are not a trusted user
bsnvpna41b8mrlscn57n9a46iwvb6r3c-nixos-.drv: build-x86-01: not scheduled here: bsnvpna41b8mrlscn57n9a46iwvb6r3c-nixos-.drv, asking the scheduler again
failed checks.x86_64-linux.nixos-test-installation 3h 0m
setup: /nix/store/55w1wmglzz40qrma8scg6dzn2f6gc2fj-zlib-1.3.2 /nix/store/96r2n039x32s0qmcgabx19l7m7c0aq6j-zlib-1.3.2 /nix/store/6vdilqj08xqi91w72bvhxpxpmc …
setup:
  /nix/store/55w1wmglzz40qrma8scg6dzn2f6gc2fj-zlib-1.3.2
  /nix/store/96r2n039x32s0qmcgabx19l7m7c0aq6j-zlib-1.3.2
  /nix/store/6vdilqj08xqi91w72bvhxpxpmck591mh-zlib-1.3.2-dev
  /nix/store/qn3f3m8xmnwnsnbkldlmicgx6cmxls0y-zlib-1.3.2-static
  /nix/store/13vkic2v8zac4m6p38asdhasb3xylv07-zlib-1.3.2.tar.gz
  /nix/store/18agc3vzx1yqx1hz807wa4iflsy02ifw-zlib-1.3.2.tar.xz
warning: ignoring the client-specified setting 'store', because it is a restricted setting and you are not a trusted user
z98v2ngilq5rdl47h3r76vk41r6m9n31-installation-test-flake-x86_64-linux.drv: build-x86-01: not scheduled here: z98v2ngilq5rdl47h3r76vk41r6m9n31-installation-test-flake-x86_64-linux.drv, asking the scheduler again
failed checks.x86_64-linux.nixos-test-installation-age 3h 0m
setup: don't know how to build these paths: /nix/store/nd6jv2khp50jbjv7xjbc1fc5lzv82dqw-vm-test-run-installation.drv warning: ignoring the client-specified se …
setup:
don't know how to build these paths:
  /nix/store/nd6jv2khp50jbjv7xjbc1fc5lzv82dqw-vm-test-run-installation.drv
warning: ignoring the client-specified setting 'store', because it is a restricted setting and you are not a trusted user
3xxx49mfch7gqj28l9nqd9y203fk5ns2-clan-runtime.drv: gi-build-x86-02: not scheduled here: 3xxx49mfch7gqj28l9nqd9y203fk5ns2-clan-runtime.drv, asking the scheduler again
z98v2ngilq5rdl47h3r76vk41r6m9n31-installation-test-flake-x86_64-linux.drv: build-x86-01: not scheduled here: z98v2ngilq5rdl47h3r76vk41r6m9n31-installation-test-flake-x86_64-linux.drv, asking the scheduler again
failed checks.x86_64-linux.nixos-test-installation-password-store 3h 0m
setup: /nix/store/55w1wmglzz40qrma8scg6dzn2f6gc2fj-zlib-1.3.2 /nix/store/96r2n039x32s0qmcgabx19l7m7c0aq6j-zlib-1.3.2 /nix/store/6vdilqj08xqi91w72bvhxpxpmc …
setup:
  /nix/store/55w1wmglzz40qrma8scg6dzn2f6gc2fj-zlib-1.3.2
  /nix/store/96r2n039x32s0qmcgabx19l7m7c0aq6j-zlib-1.3.2
  /nix/store/6vdilqj08xqi91w72bvhxpxpmck591mh-zlib-1.3.2-dev
  /nix/store/qn3f3m8xmnwnsnbkldlmicgx6cmxls0y-zlib-1.3.2-static
  /nix/store/13vkic2v8zac4m6p38asdhasb3xylv07-zlib-1.3.2.tar.gz
  /nix/store/18agc3vzx1yqx1hz807wa4iflsy02ifw-zlib-1.3.2.tar.xz
warning: ignoring the client-specified setting 'store', because it is a restricted setting and you are not a trusted user
z98v2ngilq5rdl47h3r76vk41r6m9n31-installation-test-flake-x86_64-linux.drv: build-x86-01: not scheduled here: z98v2ngilq5rdl47h3r76vk41r6m9n31-installation-test-flake-x86_64-linux.drv, asking the scheduler again
failed eval checks.x86_64-linux.nixos-test-password-store-mounts —
error: … while evaluating the attribute 'drvPath' at «https://releases.nixos.org/nixpkgs/nixpkgs-26.11pre1079672.79b6d20e5559/nixexprs.tar.xz?na …
error:
       … while evaluating the attribute 'drvPath'
         at «https://releases.nixos.org/nixpkgs/nixpkgs-26.11pre1079672.79b6d20e5559/nixexprs.tar.xz?narHash=sha256-7dZDc7YUsLkMH2GAKunEeSV1Z32Zk3ssnwxV6ei575k%3D»/lib/customisation.nix:416:11:
          415|         // {
          416|           drvPath =
             |           ^
          417|             assert condition;

       … while calling the 'derivationStrict' builtin
         at «nix-internal»/derivation-internal.nix:37:12:
           36|
           37|   strict = derivationStrict drvAttrs;
             |            ^
           38|

       … while evaluating the option `driverConfiguration.vlans':

       … while evaluating definitions from `/nix/store/mqh8wsjzzvzpsnqyyh4klw0ph4a78cjl-source/nixos/lib/testing/driver-configuration.nix':

       … while evaluating the option `nodes.machine.networking.interfaces':

       … while evaluating definitions from `/nix/store/mqh8wsjzzvzpsnqyyh4klw0ph4a78cjl-source/nixos/modules/hardware/facter/networking':

       … while evaluating the option `nodes.machine.hardware.facter.enable':

       … while evaluating the option `nodes.machine.hardware.facter.report':

       … while evaluating the option `nodes.machine.hardware.facter.reportPath':

       … while evaluating definitions from `/nix/store/fdj7n8si088wabiyrmavsz9hi44n363z-source/nixosModules/clanCore/nixos-facter.nix':

       (stack trace truncated; use '--show-trace' to show the full, detailed trace)

       error: opening a connection to remote store 'grpc://nix-store.geninf.io:50051' previously failed
failed checks.x86_64-linux.nixos-test-update-hardware-configuration 3h 0m
setup: don't know how to build these paths: /nix/store/9k8cyq61rzmw13a9j1062jwqv2nq5a1y-vm-test-run-update-hardware-configuration.drv warning: ignoring the cl …
setup:
don't know how to build these paths:
  /nix/store/9k8cyq61rzmw13a9j1062jwqv2nq5a1y-vm-test-run-update-hardware-configuration.drv
warning: ignoring the client-specified setting 'store', because it is a restricted setting and you are not a trusted user
z98v2ngilq5rdl47h3r76vk41r6m9n31-installation-test-flake-x86_64-linux.drv: build-x86-01: not scheduled here: z98v2ngilq5rdl47h3r76vk41r6m9n31-installation-test-flake-x86_64-linux.drv, asking the scheduler again
failed eval checks.x86_64-linux.p2p-ssh-iroh —
error: … while evaluating the attribute 'drvPath' at «https://releases.nixos.org/nixpkgs/nixpkgs-26.11pre1079672.79b6d20e5559/nixexprs.tar.xz?na …
error:
       … while evaluating the attribute 'drvPath'
         at «https://releases.nixos.org/nixpkgs/nixpkgs-26.11pre1079672.79b6d20e5559/nixexprs.tar.xz?narHash=sha256-7dZDc7YUsLkMH2GAKunEeSV1Z32Zk3ssnwxV6ei575k%3D»/lib/customisation.nix:416:11:
          415|         // {
          416|           drvPath =
             |           ^
          417|             assert condition;

       … while calling the 'derivationStrict' builtin
         at «nix-internal»/derivation-internal.nix:37:12:
           36|
           37|   strict = derivationStrict drvAttrs;
             |            ^
           38|

       … while evaluating the option `driverConfiguration.vlans':

       … while evaluating definitions from `/nix/store/mqh8wsjzzvzpsnqyyh4klw0ph4a78cjl-source/nixos/lib/testing/driver-configuration.nix':

       … while evaluating the option `containers.client.networking.interfaces':

       … while evaluating definitions from `/nix/store/mqh8wsjzzvzpsnqyyh4klw0ph4a78cjl-source/nixos/modules/hardware/facter/networking':

       … while evaluating the option `containers.client.hardware.facter.enable':

       … while evaluating the option `containers.client.hardware.facter.report':

       … while evaluating the option `containers.client.hardware.facter.reportPath':

       … while evaluating definitions from `/nix/store/fdj7n8si088wabiyrmavsz9hi44n363z-source/nixosModules/clanCore/nixos-facter.nix':

       (stack trace truncated; use '--show-trace' to show the full, detailed trace)

       error: cannot open connection to remote store 'grpc://nix-store.geninf.io:50051': error: Nix daemon disconnected unexpectedly (maybe it crashed?)
failed eval checks.x86_64-linux.packages —
error: … while evaluating the attribute 'drvPath' at «https://releases.nixos.org/nixpkgs/nixpkgs-26.11pre1079672.79b6d20e5559/nixexprs.tar.xz?na …
error:
       … while evaluating the attribute 'drvPath'
         at «https://releases.nixos.org/nixpkgs/nixpkgs-26.11pre1079672.79b6d20e5559/nixexprs.tar.xz?narHash=sha256-7dZDc7YUsLkMH2GAKunEeSV1Z32Zk3ssnwxV6ei575k%3D»/lib/customisation.nix:416:11:
          415|         // {
          416|           drvPath =
             |           ^
          417|             assert condition;

       … while calling the 'derivationStrict' builtin
         at «nix-internal»/derivation-internal.nix:37:12:
           36|
           37|   strict = derivationStrict drvAttrs;
             |            ^
           38|

       … while evaluating the option `driverConfiguration.vlans':

       … while evaluating definitions from `/nix/store/mqh8wsjzzvzpsnqyyh4klw0ph4a78cjl-source/nixos/lib/testing/driver-configuration.nix':

       … while evaluating the option `containers.server.networking.interfaces':

       … while evaluating definitions from `/nix/store/mqh8wsjzzvzpsnqyyh4klw0ph4a78cjl-source/nixos/modules/hardware/facter/networking':

       … while evaluating the option `containers.server.hardware.facter.enable':

       … while evaluating the option `containers.server.hardware.facter.report':

       … while evaluating the option `containers.server.hardware.facter.reportPath':

       … while evaluating definitions from `/nix/store/fdj7n8si088wabiyrmavsz9hi44n363z-source/nixosModules/clanCore/nixos-facter.nix':

       (stack trace truncated; use '--show-trace' to show the full, detailed trace)

       error: cannot open connection to remote store 'grpc://nix-store.geninf.io:50051': error: Nix daemon disconnected unexpectedly (maybe it crashed?)
failed eval checks.x86_64-linux.pki —
error: … while evaluating the attribute 'drvPath' at «https://releases.nixos.org/nixpkgs/nixpkgs-26.11pre1079672.79b6d20e5559/nixexprs.tar.xz?na …
error:
       … while evaluating the attribute 'drvPath'
         at «https://releases.nixos.org/nixpkgs/nixpkgs-26.11pre1079672.79b6d20e5559/nixexprs.tar.xz?narHash=sha256-7dZDc7YUsLkMH2GAKunEeSV1Z32Zk3ssnwxV6ei575k%3D»/lib/customisation.nix:416:11:
          415|         // {
          416|           drvPath =
             |           ^
          417|             assert condition;

       … while calling the 'derivationStrict' builtin
         at «nix-internal»/derivation-internal.nix:37:12:
           36|
           37|   strict = derivationStrict drvAttrs;
             |            ^
           38|

       … while evaluating the option `driverConfiguration.vlans':

       … while evaluating definitions from `/nix/store/mqh8wsjzzvzpsnqyyh4klw0ph4a78cjl-source/nixos/lib/testing/driver-configuration.nix':

       … while evaluating the option `nodes.caddy.networking.interfaces':

       … while evaluating definitions from `/nix/store/mqh8wsjzzvzpsnqyyh4klw0ph4a78cjl-source/nixos/modules/hardware/facter/networking':

       … while evaluating the option `nodes.caddy.hardware.facter.enable':

       … while evaluating the option `nodes.caddy.hardware.facter.report':

       … while evaluating the option `nodes.caddy.hardware.facter.reportPath':

       … while evaluating definitions from `/nix/store/fdj7n8si088wabiyrmavsz9hi44n363z-source/nixosModules/clanCore/nixos-facter.nix':

       (stack trace truncated; use '--show-trace' to show the full, detailed trace)

       error: opening a connection to remote store 'grpc://nix-store.geninf.io:50051' previously failed
failed eval checks.x86_64-linux.postgresql —
error: … while evaluating the attribute 'drvPath' at «https://releases.nixos.org/nixpkgs/nixpkgs-26.11pre1079672.79b6d20e5559/nixexprs.tar.xz?na …
error:
       … while evaluating the attribute 'drvPath'
         at «https://releases.nixos.org/nixpkgs/nixpkgs-26.11pre1079672.79b6d20e5559/nixexprs.tar.xz?narHash=sha256-7dZDc7YUsLkMH2GAKunEeSV1Z32Zk3ssnwxV6ei575k%3D»/lib/customisation.nix:416:11:
          415|         // {
          416|           drvPath =
             |           ^
          417|             assert condition;

       … while calling the 'derivationStrict' builtin
         at «nix-internal»/derivation-internal.nix:37:12:
           36|
           37|   strict = derivationStrict drvAttrs;
             |            ^
           38|

       … while evaluating the option `driverConfiguration.vlans':

       … while evaluating definitions from `/nix/store/mqh8wsjzzvzpsnqyyh4klw0ph4a78cjl-source/nixos/lib/testing/driver-configuration.nix':

       … while evaluating the option `containers.machine.networking.interfaces':

       … while evaluating definitions from `/nix/store/mqh8wsjzzvzpsnqyyh4klw0ph4a78cjl-source/nixos/modules/hardware/facter/networking':

       … while evaluating the option `containers.machine.hardware.facter.enable':

       … while evaluating the option `containers.machine.hardware.facter.report':

       … while evaluating the option `containers.machine.hardware.facter.reportPath':

       … while evaluating definitions from `/nix/store/fdj7n8si088wabiyrmavsz9hi44n363z-source/nixosModules/clanCore/nixos-facter.nix':

       (stack trace truncated; use '--show-trace' to show the full, detailed trace)

       error: cannot open connection to remote store 'grpc://nix-store.geninf.io:50051': error: Nix daemon disconnected unexpectedly (maybe it crashed?)
failed eval checks.x86_64-linux.service-dummy-test —
error: … while evaluating the attribute 'drvPath' at «https://releases.nixos.org/nixpkgs/nixpkgs-26.11pre1079672.79b6d20e5559/nixexprs.tar.xz?na …
error:
       … while evaluating the attribute 'drvPath'
         at «https://releases.nixos.org/nixpkgs/nixpkgs-26.11pre1079672.79b6d20e5559/nixexprs.tar.xz?narHash=sha256-7dZDc7YUsLkMH2GAKunEeSV1Z32Zk3ssnwxV6ei575k%3D»/lib/customisation.nix:416:11:
          415|         // {
          416|           drvPath =
             |           ^
          417|             assert condition;

       … while calling the 'derivationStrict' builtin
         at «nix-internal»/derivation-internal.nix:37:12:
           36|
           37|   strict = derivationStrict drvAttrs;
             |            ^
           38|

       … while evaluating the option `driverConfiguration.vlans':

       … while evaluating definitions from `/nix/store/mqh8wsjzzvzpsnqyyh4klw0ph4a78cjl-source/nixos/lib/testing/driver-configuration.nix':

       … while evaluating the option `containers.admin1.networking.interfaces':

       … while evaluating definitions from `/nix/store/mqh8wsjzzvzpsnqyyh4klw0ph4a78cjl-source/nixos/modules/hardware/facter/networking':

       … while evaluating the option `containers.admin1.hardware.facter.enable':

       … while evaluating the option `containers.admin1.hardware.facter.report':

       … while evaluating the option `containers.admin1.hardware.facter.reportPath':

       … while evaluating definitions from `/nix/store/fdj7n8si088wabiyrmavsz9hi44n363z-source/nixosModules/clanCore/nixos-facter.nix':

       (stack trace truncated; use '--show-trace' to show the full, detailed trace)

       error: cannot open connection to remote store 'grpc://nix-store.geninf.io:50051': error: Nix daemon disconnected unexpectedly (maybe it crashed?)
failed eval checks.x86_64-linux.service-dummy-test-from-flake —
error: … while evaluating the attribute 'drvPath' at «https://releases.nixos.org/nixpkgs/nixpkgs-26.11pre1079672.79b6d20e5559/nixexprs.tar.xz?na …
error:
       … while evaluating the attribute 'drvPath'
         at «https://releases.nixos.org/nixpkgs/nixpkgs-26.11pre1079672.79b6d20e5559/nixexprs.tar.xz?narHash=sha256-7dZDc7YUsLkMH2GAKunEeSV1Z32Zk3ssnwxV6ei575k%3D»/lib/customisation.nix:416:11:
          415|         // {
          416|           drvPath =
             |           ^
          417|             assert condition;

       … while calling the 'derivationStrict' builtin
         at «nix-internal»/derivation-internal.nix:37:12:
           36|
           37|   strict = derivationStrict drvAttrs;
             |            ^
           38|

       … while evaluating the option `driverConfiguration.vlans':

       … while evaluating definitions from `/nix/store/mqh8wsjzzvzpsnqyyh4klw0ph4a78cjl-source/nixos/lib/testing/driver-configuration.nix':

       … while evaluating the option `containers.admin1.networking.interfaces':

       … while evaluating definitions from `/nix/store/mqh8wsjzzvzpsnqyyh4klw0ph4a78cjl-source/nixos/modules/hardware/facter/networking':

       … while evaluating the option `containers.admin1.hardware.facter.enable':

       … while evaluating the option `containers.admin1.hardware.facter.report':

       … while evaluating the option `containers.admin1.hardware.facter.reportPath':

       … while evaluating definitions from `/nix/store/fdj7n8si088wabiyrmavsz9hi44n363z-source/nixosModules/clanCore/nixos-facter.nix':

       (stack trace truncated; use '--show-trace' to show the full, detailed trace)

       error: cannot open connection to remote store 'grpc://nix-store.geninf.io:50051': error: Nix daemon disconnected unexpectedly (maybe it crashed?)
failed eval checks.x86_64-linux.sshd —
error: … while evaluating the attribute 'drvPath' at «https://releases.nixos.org/nixpkgs/nixpkgs-26.11pre1079672.79b6d20e5559/nixexprs.tar.xz?na …
error:
       … while evaluating the attribute 'drvPath'
         at «https://releases.nixos.org/nixpkgs/nixpkgs-26.11pre1079672.79b6d20e5559/nixexprs.tar.xz?narHash=sha256-7dZDc7YUsLkMH2GAKunEeSV1Z32Zk3ssnwxV6ei575k%3D»/lib/customisation.nix:416:11:
          415|         // {
          416|           drvPath =
             |           ^
          417|             assert condition;

       … while calling the 'derivationStrict' builtin
         at «nix-internal»/derivation-internal.nix:37:12:
           36|
           37|   strict = derivationStrict drvAttrs;
             |            ^
           38|

       … while evaluating the option `driverConfiguration.vlans':

       … while evaluating definitions from `/nix/store/mqh8wsjzzvzpsnqyyh4klw0ph4a78cjl-source/nixos/lib/testing/driver-configuration.nix':

       … while evaluating the option `containers.client.networking.interfaces':

       … while evaluating definitions from `/nix/store/mqh8wsjzzvzpsnqyyh4klw0ph4a78cjl-source/nixos/modules/hardware/facter/networking':

       … while evaluating the option `containers.client.hardware.facter.enable':

       … while evaluating the option `containers.client.hardware.facter.report':

       … while evaluating the option `containers.client.hardware.facter.reportPath':

       … while evaluating definitions from `/nix/store/fdj7n8si088wabiyrmavsz9hi44n363z-source/nixosModules/clanCore/nixos-facter.nix':

       (stack trace truncated; use '--show-trace' to show the full, detailed trace)

       error: cannot open connection to remote store 'grpc://nix-store.geninf.io:50051': error: Nix daemon disconnected unexpectedly (maybe it crashed?)
failed eval checks.x86_64-linux.sshd-no-ca —
error: … while evaluating the attribute 'drvPath' at «https://releases.nixos.org/nixpkgs/nixpkgs-26.11pre1079672.79b6d20e5559/nixexprs.tar.xz?na …
error:
       … while evaluating the attribute 'drvPath'
         at «https://releases.nixos.org/nixpkgs/nixpkgs-26.11pre1079672.79b6d20e5559/nixexprs.tar.xz?narHash=sha256-7dZDc7YUsLkMH2GAKunEeSV1Z32Zk3ssnwxV6ei575k%3D»/lib/customisation.nix:416:11:
          415|         // {
          416|           drvPath =
             |           ^
          417|             assert condition;

       … while calling the 'derivationStrict' builtin
         at «nix-internal»/derivation-internal.nix:37:12:
           36|
           37|   strict = derivationStrict drvAttrs;
             |            ^
           38|

       … while evaluating the option `driverConfiguration.vlans':

       … while evaluating definitions from `/nix/store/mqh8wsjzzvzpsnqyyh4klw0ph4a78cjl-source/nixos/lib/testing/driver-configuration.nix':

       … while evaluating the option `containers.client.networking.interfaces':

       … while evaluating definitions from `/nix/store/mqh8wsjzzvzpsnqyyh4klw0ph4a78cjl-source/nixos/modules/hardware/facter/networking':

       … while evaluating the option `containers.client.hardware.facter.enable':

       … while evaluating the option `containers.client.hardware.facter.report':

       … while evaluating the option `containers.client.hardware.facter.reportPath':

       … while evaluating definitions from `/nix/store/fdj7n8si088wabiyrmavsz9hi44n363z-source/nixosModules/clanCore/nixos-facter.nix':

       (stack trace truncated; use '--show-trace' to show the full, detailed trace)

       error: opening a connection to remote store 'grpc://nix-store.geninf.io:50051' previously failed
failed eval checks.x86_64-linux.state-version —
error: … while evaluating the attribute 'drvPath' at «https://releases.nixos.org/nixpkgs/nixpkgs-26.11pre1079672.79b6d20e5559/nixexprs.tar.xz?na …
error:
       … while evaluating the attribute 'drvPath'
         at «https://releases.nixos.org/nixpkgs/nixpkgs-26.11pre1079672.79b6d20e5559/nixexprs.tar.xz?narHash=sha256-7dZDc7YUsLkMH2GAKunEeSV1Z32Zk3ssnwxV6ei575k%3D»/lib/customisation.nix:416:11:
          415|         // {
          416|           drvPath =
             |           ^
          417|             assert condition;

       … while calling the 'derivationStrict' builtin
         at «nix-internal»/derivation-internal.nix:37:12:
           36|
           37|   strict = derivationStrict drvAttrs;
             |            ^
           38|

       … while evaluating the option `driverConfiguration.vlans':

       … while evaluating definitions from `/nix/store/mqh8wsjzzvzpsnqyyh4klw0ph4a78cjl-source/nixos/lib/testing/driver-configuration.nix':

       … while evaluating the option `containers.server.networking.interfaces':

       … while evaluating definitions from `/nix/store/mqh8wsjzzvzpsnqyyh4klw0ph4a78cjl-source/nixos/modules/hardware/facter/networking':

       … while evaluating the option `containers.server.hardware.facter.enable':

       … while evaluating the option `containers.server.hardware.facter.report':

       … while evaluating the option `containers.server.hardware.facter.reportPath':

       … while evaluating definitions from `/nix/store/fdj7n8si088wabiyrmavsz9hi44n363z-source/nixosModules/clanCore/nixos-facter.nix':

       (stack trace truncated; use '--show-trace' to show the full, detailed trace)

       error: cannot open connection to remote store 'grpc://nix-store.geninf.io:50051': error: Nix daemon disconnected unexpectedly (maybe it crashed?)
failed eval checks.x86_64-linux.syncthing-service —
error: … while evaluating the attribute 'drvPath' at «https://releases.nixos.org/nixpkgs/nixpkgs-26.11pre1079672.79b6d20e5559/nixexprs.tar.xz?na …
error:
       … while evaluating the attribute 'drvPath'
         at «https://releases.nixos.org/nixpkgs/nixpkgs-26.11pre1079672.79b6d20e5559/nixexprs.tar.xz?narHash=sha256-7dZDc7YUsLkMH2GAKunEeSV1Z32Zk3ssnwxV6ei575k%3D»/lib/customisation.nix:416:11:
          415|         // {
          416|           drvPath =
             |           ^
          417|             assert condition;

       … while calling the 'derivationStrict' builtin
         at «nix-internal»/derivation-internal.nix:37:12:
           36|
           37|   strict = derivationStrict drvAttrs;
             |            ^
           38|

       … while evaluating the option `driverConfiguration.vlans':

       … while evaluating definitions from `/nix/store/mqh8wsjzzvzpsnqyyh4klw0ph4a78cjl-source/nixos/lib/testing/driver-configuration.nix':

       … while evaluating the option `containers.machine1.networking.interfaces':

       … while evaluating definitions from `/nix/store/mqh8wsjzzvzpsnqyyh4klw0ph4a78cjl-source/nixos/modules/hardware/facter/networking':

       … while evaluating the option `containers.machine1.hardware.facter.enable':

       … while evaluating the option `containers.machine1.hardware.facter.report':

       … while evaluating the option `containers.machine1.hardware.facter.reportPath':

       … while evaluating definitions from `/nix/store/fdj7n8si088wabiyrmavsz9hi44n363z-source/nixosModules/clanCore/nixos-facter.nix':

       (stack trace truncated; use '--show-trace' to show the full, detailed trace)

       error: opening a connection to remote store 'grpc://nix-store.geninf.io:50051' previously failed
failed eval checks.x86_64-linux.template-minimal —
error: … while calling the 'import' builtin at «git+file:///var/lib/nixbot/worktrees/5-d790244940e6-24?ref=HEAD&rev=35de96467996ba0a21ec805ea6f7 …
error:
       … while calling the 'import' builtin
         at «git+file:///var/lib/nixbot/worktrees/5-d790244940e6-24?ref=HEAD&rev=35de96467996ba0a21ec805ea6f76a640bb3e657»/templates/flake-module.nix:50:19:
           49|         '';
           50|         evaled = (import "${initialized}/flake.nix").outputs {
             |                   ^
           51|           self = evaled // {

       … while realising the context of path '/nix/store/ix4rhpnw2f728ndbpsbchli8syap3smf-minimal-clan-flake/flake.nix'

       error: opening a connection to remote store 'grpc://nix-store.geninf.io:50051' previously failed
failed eval checks.x86_64-linux.trusted-nix-caches —
error: … while evaluating the attribute 'drvPath' at «https://releases.nixos.org/nixpkgs/nixpkgs-26.11pre1079672.79b6d20e5559/nixexprs.tar.xz?na …
error:
       … while evaluating the attribute 'drvPath'
         at «https://releases.nixos.org/nixpkgs/nixpkgs-26.11pre1079672.79b6d20e5559/nixexprs.tar.xz?narHash=sha256-7dZDc7YUsLkMH2GAKunEeSV1Z32Zk3ssnwxV6ei575k%3D»/lib/customisation.nix:416:11:
          415|         // {
          416|           drvPath =
             |           ^
          417|             assert condition;

       … while calling the 'derivationStrict' builtin
         at «nix-internal»/derivation-internal.nix:37:12:
           36|
           37|   strict = derivationStrict drvAttrs;
             |            ^
           38|

       … while evaluating the option `driverConfiguration.vlans':

       … while evaluating definitions from `/nix/store/mqh8wsjzzvzpsnqyyh4klw0ph4a78cjl-source/nixos/lib/testing/driver-configuration.nix':

       … while evaluating the option `containers.server.networking.interfaces':

       … while evaluating definitions from `/nix/store/mqh8wsjzzvzpsnqyyh4klw0ph4a78cjl-source/nixos/modules/hardware/facter/networking':

       … while evaluating the option `containers.server.hardware.facter.enable':

       … while evaluating the option `containers.server.hardware.facter.report':

       … while evaluating the option `containers.server.hardware.facter.reportPath':

       … while evaluating definitions from `/nix/store/fdj7n8si088wabiyrmavsz9hi44n363z-source/nixosModules/clanCore/nixos-facter.nix':

       (stack trace truncated; use '--show-trace' to show the full, detailed trace)

       error: opening a connection to remote store 'grpc://nix-store.geninf.io:50051' previously failed
failed eval checks.x86_64-linux.users —
error: … while evaluating the attribute 'drvPath' at «https://releases.nixos.org/nixpkgs/nixpkgs-26.11pre1079672.79b6d20e5559/nixexprs.tar.xz?na …
error:
       … while evaluating the attribute 'drvPath'
         at «https://releases.nixos.org/nixpkgs/nixpkgs-26.11pre1079672.79b6d20e5559/nixexprs.tar.xz?narHash=sha256-7dZDc7YUsLkMH2GAKunEeSV1Z32Zk3ssnwxV6ei575k%3D»/lib/customisation.nix:416:11:
          415|         // {
          416|           drvPath =
             |           ^
          417|             assert condition;

       … while calling the 'derivationStrict' builtin
         at «nix-internal»/derivation-internal.nix:37:12:
           36|
           37|   strict = derivationStrict drvAttrs;
             |            ^
           38|

       … while evaluating the option `driverConfiguration.vlans':

       … while evaluating definitions from `/nix/store/mqh8wsjzzvzpsnqyyh4klw0ph4a78cjl-source/nixos/lib/testing/driver-configuration.nix':

       … while evaluating the option `containers.server.networking.interfaces':

       … while evaluating definitions from `/nix/store/mqh8wsjzzvzpsnqyyh4klw0ph4a78cjl-source/nixos/modules/hardware/facter/networking':

       … while evaluating the option `containers.server.hardware.facter.enable':

       … while evaluating the option `containers.server.hardware.facter.report':

       … while evaluating the option `containers.server.hardware.facter.reportPath':

       … while evaluating definitions from `/nix/store/fdj7n8si088wabiyrmavsz9hi44n363z-source/nixosModules/clanCore/nixos-facter.nix':

       (stack trace truncated; use '--show-trace' to show the full, detailed trace)

       error: cannot open connection to remote store 'grpc://nix-store.geninf.io:50051': error: Nix daemon disconnected unexpectedly (maybe it crashed?)
failed eval checks.x86_64-linux.wifi —
error: … while evaluating the attribute 'drvPath' at «https://releases.nixos.org/nixpkgs/nixpkgs-26.11pre1079672.79b6d20e5559/nixexprs.tar.xz?na …
error:
       … while evaluating the attribute 'drvPath'
         at «https://releases.nixos.org/nixpkgs/nixpkgs-26.11pre1079672.79b6d20e5559/nixexprs.tar.xz?narHash=sha256-7dZDc7YUsLkMH2GAKunEeSV1Z32Zk3ssnwxV6ei575k%3D»/lib/customisation.nix:416:11:
          415|         // {
          416|           drvPath =
             |           ^
          417|             assert condition;

       … while calling the 'derivationStrict' builtin
         at «nix-internal»/derivation-internal.nix:37:12:
           36|
           37|   strict = derivationStrict drvAttrs;
             |            ^
           38|

       … while evaluating the option `driverConfiguration.vlans':

       … while evaluating definitions from `/nix/store/mqh8wsjzzvzpsnqyyh4klw0ph4a78cjl-source/nixos/lib/testing/driver-configuration.nix':

       … while evaluating the option `nodes.second.networking.interfaces':

       … while evaluating definitions from `/nix/store/mqh8wsjzzvzpsnqyyh4klw0ph4a78cjl-source/nixos/modules/hardware/facter/networking':

       … while evaluating the option `nodes.second.hardware.facter.enable':

       … while evaluating the option `nodes.second.hardware.facter.report':

       … while evaluating the option `nodes.second.hardware.facter.reportPath':

       … while evaluating definitions from `/nix/store/fdj7n8si088wabiyrmavsz9hi44n363z-source/nixosModules/clanCore/nixos-facter.nix':

       (stack trace truncated; use '--show-trace' to show the full, detailed trace)

       error: opening a connection to remote store 'grpc://nix-store.geninf.io:50051' previously failed
failed eval checks.x86_64-linux.wireguard —
error: … while evaluating the attribute 'drvPath' at «https://releases.nixos.org/nixpkgs/nixpkgs-26.11pre1079672.79b6d20e5559/nixexprs.tar.xz?na …
error:
       … while evaluating the attribute 'drvPath'
         at «https://releases.nixos.org/nixpkgs/nixpkgs-26.11pre1079672.79b6d20e5559/nixexprs.tar.xz?narHash=sha256-7dZDc7YUsLkMH2GAKunEeSV1Z32Zk3ssnwxV6ei575k%3D»/lib/customisation.nix:416:11:
          415|         // {
          416|           drvPath =
             |           ^
          417|             assert condition;

       … while calling the 'derivationStrict' builtin
         at «nix-internal»/derivation-internal.nix:37:12:
           36|
           37|   strict = derivationStrict drvAttrs;
             |            ^
           38|

       … while evaluating the option `driverConfiguration.vlans':

       … while evaluating definitions from `/nix/store/mqh8wsjzzvzpsnqyyh4klw0ph4a78cjl-source/nixos/lib/testing/driver-configuration.nix':

       … while evaluating the option `containers.ctrl1.networking.interfaces':

       … while evaluating definitions from `/nix/store/mqh8wsjzzvzpsnqyyh4klw0ph4a78cjl-source/nixos/modules/hardware/facter/networking':

       … while evaluating the option `containers.ctrl1.hardware.facter.enable':

       … while evaluating the option `containers.ctrl1.hardware.facter.report':

       … while evaluating the option `containers.ctrl1.hardware.facter.reportPath':

       … while evaluating definitions from `/nix/store/fdj7n8si088wabiyrmavsz9hi44n363z-source/nixosModules/clanCore/nixos-facter.nix':

       (stack trace truncated; use '--show-trace' to show the full, detailed trace)

       error: opening a connection to remote store 'grpc://nix-store.geninf.io:50051' previously failed
failed eval checks.x86_64-linux.yggdrasil —
error: … while evaluating the attribute 'drvPath' at «https://releases.nixos.org/nixpkgs/nixpkgs-26.11pre1079672.79b6d20e5559/nixexprs.tar.xz?na …
error:
       … while evaluating the attribute 'drvPath'
         at «https://releases.nixos.org/nixpkgs/nixpkgs-26.11pre1079672.79b6d20e5559/nixexprs.tar.xz?narHash=sha256-7dZDc7YUsLkMH2GAKunEeSV1Z32Zk3ssnwxV6ei575k%3D»/lib/customisation.nix:416:11:
          415|         // {
          416|           drvPath =
             |           ^
          417|             assert condition;

       … while calling the 'derivationStrict' builtin
         at «nix-internal»/derivation-internal.nix:37:12:
           36|
           37|   strict = derivationStrict drvAttrs;
             |            ^
           38|

       … while evaluating the option `driverConfiguration.vlans':

       … while evaluating definitions from `/nix/store/mqh8wsjzzvzpsnqyyh4klw0ph4a78cjl-source/nixos/lib/testing/driver-configuration.nix':

       … while evaluating the option `nodes.outsider.networking.interfaces':

       … while evaluating definitions from `/nix/store/mqh8wsjzzvzpsnqyyh4klw0ph4a78cjl-source/nixos/modules/hardware/facter/networking':

       … while evaluating the option `nodes.outsider.hardware.facter.enable':

       … while evaluating the option `nodes.outsider.hardware.facter.report':

       … while evaluating the option `nodes.outsider.hardware.facter.reportPath':

       … while evaluating definitions from `/nix/store/fdj7n8si088wabiyrmavsz9hi44n363z-source/nixosModules/clanCore/nixos-facter.nix':

       (stack trace truncated; use '--show-trace' to show the full, detailed trace)

       error: opening a connection to remote store 'grpc://nix-store.geninf.io:50051' previously failed
failed eval checks.x86_64-linux.zerotier —
error: … while evaluating the attribute 'drvPath' at «https://releases.nixos.org/nixpkgs/nixpkgs-26.11pre1079672.79b6d20e5559/nixexprs.tar.xz?na …
error:
       … while evaluating the attribute 'drvPath'
         at «https://releases.nixos.org/nixpkgs/nixpkgs-26.11pre1079672.79b6d20e5559/nixexprs.tar.xz?narHash=sha256-7dZDc7YUsLkMH2GAKunEeSV1Z32Zk3ssnwxV6ei575k%3D»/lib/customisation.nix:416:11:
          415|         // {
          416|           drvPath =
             |           ^
          417|             assert condition;

       … while calling the 'derivationStrict' builtin
         at «nix-internal»/derivation-internal.nix:37:12:
           36|
           37|   strict = derivationStrict drvAttrs;
             |            ^
           38|

       … while evaluating the option `driverConfiguration.vlans':

       … while evaluating definitions from `/nix/store/mqh8wsjzzvzpsnqyyh4klw0ph4a78cjl-source/nixos/lib/testing/driver-configuration.nix':

       … while evaluating the option `nodes.controller.networking.interfaces':

       … while evaluating definitions from `/nix/store/mqh8wsjzzvzpsnqyyh4klw0ph4a78cjl-source/nixos/modules/hardware/facter/networking':

       … while evaluating the option `nodes.controller.hardware.facter.enable':

       … while evaluating the option `nodes.controller.hardware.facter.report':

       … while evaluating the option `nodes.controller.hardware.facter.reportPath':

       … while evaluating definitions from `/nix/store/fdj7n8si088wabiyrmavsz9hi44n363z-source/nixosModules/clanCore/nixos-facter.nix':

       (stack trace truncated; use '--show-trace' to show the full, detailed trace)

       error: opening a connection to remote store 'grpc://nix-store.geninf.io:50051' previously failed
failed eval checks.x86_64-linux.zerotier-multi-instance —
error: … while evaluating the attribute 'drvPath' at «https://releases.nixos.org/nixpkgs/nixpkgs-26.11pre1079672.79b6d20e5559/nixexprs.tar.xz?na …
error:
       … while evaluating the attribute 'drvPath'
         at «https://releases.nixos.org/nixpkgs/nixpkgs-26.11pre1079672.79b6d20e5559/nixexprs.tar.xz?narHash=sha256-7dZDc7YUsLkMH2GAKunEeSV1Z32Zk3ssnwxV6ei575k%3D»/lib/customisation.nix:416:11:
          415|         // {
          416|           drvPath =
             |           ^
          417|             assert condition;

       … while calling the 'derivationStrict' builtin
         at «nix-internal»/derivation-internal.nix:37:12:
           36|
           37|   strict = derivationStrict drvAttrs;
             |            ^
           38|

       … while evaluating the option `driverConfiguration.vlans':

       … while evaluating definitions from `/nix/store/mqh8wsjzzvzpsnqyyh4klw0ph4a78cjl-source/nixos/lib/testing/driver-configuration.nix':

       … while evaluating the option `nodes.alpha.networking.interfaces':

       … while evaluating definitions from `/nix/store/mqh8wsjzzvzpsnqyyh4klw0ph4a78cjl-source/nixos/modules/hardware/facter/networking':

       … while evaluating the option `nodes.alpha.hardware.facter.enable':

       … while evaluating the option `nodes.alpha.hardware.facter.report':

       … while evaluating the option `nodes.alpha.hardware.facter.reportPath':

       … while evaluating definitions from `/nix/store/fdj7n8si088wabiyrmavsz9hi44n363z-source/nixosModules/clanCore/nixos-facter.nix':

       (stack trace truncated; use '--show-trace' to show the full, detailed trace)

       error: opening a connection to remote store 'grpc://nix-store.geninf.io:50051' previously failed
26 succeeded
succeeded attributes
status attribute duration
loading…
22 already built
skipped attributes
status attribute duration
loading…