nixbot

builds

clan/clan-core build #778 failed

branch 26.05 · PR #8137 · commit 8e2bb67880 · · took 3h 5m · eval 53s

eval warnings 4 kinds · 159 occurrences
  • error gRPC Connect on 'nix-store.geninf.io:50051' failed: role 'write' may not call Connect ×23
  • error ×68
  • error cannot open connection to remote store 'grpc://nix-store.geninf.io:50051': error: Nix daemon disconnected unexpectedly (maybe it crashed?) ×23
  • error opening a connection to remote store 'grpc://nix-store.geninf.io:50051' previously failed ×45

78 failed
failed attributes
status attribute duration
failed checks.aarch64-darwin.all-packages 3h 0m
setup: don't know how to build these paths: /nix/store/pr7m05pazh5pvzmqcwiy2ybnfmykf2gf-all-packages.drv warning: ignoring the client-specified setting 'store …
setup:
don't know how to build these paths:
  /nix/store/pr7m05pazh5pvzmqcwiy2ybnfmykf2gf-all-packages.drv
warning: ignoring the client-specified setting 'store', because it is a restricted setting and you are not a trusted user
azhryp0h9zysi26pj2swcmfl84nvlyqs-clan-runtime.drv: build04: not scheduled here: azhryp0h9zysi26pj2swcmfl84nvlyqs-clan-runtime.drv, asking the scheduler again
17l2nkg6id5d1d4g9hfmrfzyv60qdlyf-clan-runtime.drv: build04: not scheduled here: 17l2nkg6id5d1d4g9hfmrfzyv60qdlyf-clan-runtime.drv, asking the scheduler again
failed checks.aarch64-darwin.clan-app-pytest 3h 0m
setup: /nix/store/600wx4h47gwbfm2j59v33wj0xy3ni6qz-zlib-1.3.2-static /nix/store/5ds9fysxln35sqh4krqw9imr4m5lnr1q-zlib-ng-2.3.3 /nix/store/mxajghyzvi968fzv …
setup:
  /nix/store/600wx4h47gwbfm2j59v33wj0xy3ni6qz-zlib-1.3.2-static
  /nix/store/5ds9fysxln35sqh4krqw9imr4m5lnr1q-zlib-ng-2.3.3
  /nix/store/mxajghyzvi968fzv2vcwq368mxi92niw-zstd-1.5.7
  /nix/store/sj5gmvy8rr4r60sdfic9w426addgjpq3-zstd-1.5.7-bin
  /nix/store/jjlwnz5xzkxgql1v0dbbj611j6b4m469-zstd-1.5.7-dev
  /nix/store/2im2w9bb1h2gdm1g6j1x9hhjkqmrvs11-zxing-cpp-2.3.0
warning: ignoring the client-specified setting 'store', because it is a restricted setting and you are not a trusted user
azhryp0h9zysi26pj2swcmfl84nvlyqs-clan-runtime.drv: build04: not scheduled here: azhryp0h9zysi26pj2swcmfl84nvlyqs-clan-runtime.drv, asking the scheduler again
failed checks.aarch64-darwin.clan-pytest-with-core 3h 0m
setup: /nix/store/600wx4h47gwbfm2j59v33wj0xy3ni6qz-zlib-1.3.2-static /nix/store/ln2b96ri528ibxx8cfa75j90mmrk370w-zlib-1.3.2-static /nix/store/13vkic2v8zac …
setup:
  /nix/store/600wx4h47gwbfm2j59v33wj0xy3ni6qz-zlib-1.3.2-static
  /nix/store/ln2b96ri528ibxx8cfa75j90mmrk370w-zlib-1.3.2-static
  /nix/store/13vkic2v8zac4m6p38asdhasb3xylv07-zlib-1.3.2.tar.gz
  /nix/store/5ds9fysxln35sqh4krqw9imr4m5lnr1q-zlib-ng-2.3.3
  /nix/store/mxajghyzvi968fzv2vcwq368mxi92niw-zstd-1.5.7
warning: ignoring the client-specified setting 'store', because it is a restricted setting and you are not a trusted user
azhryp0h9zysi26pj2swcmfl84nvlyqs-clan-runtime.drv: build04: not scheduled here: azhryp0h9zysi26pj2swcmfl84nvlyqs-clan-runtime.drv, asking the scheduler again
biqk5fiwrsrdjgx4f4j5nq3yzkdgm450-clan-core-flake.drv: build04: not scheduled here: biqk5fiwrsrdjgx4f4j5nq3yzkdgm450-clan-core-flake.drv, asking the scheduler again
failed checks.aarch64-darwin.darwin-test-darwin-machine 3h 0m
setup: /nix/store/papzdc7ngbiyvgymzcygb0xp13cpis48-xz-5.8.4-bin /nix/store/476zsjqic4kbjk43p27m165b5flfqr8l-zlib-1.3.2 /nix/store/5ds9fysxln35sqh4krqw9imr …
setup:
  /nix/store/papzdc7ngbiyvgymzcygb0xp13cpis48-xz-5.8.4-bin
  /nix/store/476zsjqic4kbjk43p27m165b5flfqr8l-zlib-1.3.2
  /nix/store/5ds9fysxln35sqh4krqw9imr4m5lnr1q-zlib-ng-2.3.3
  /nix/store/zwlm8hwl20j12pp7c6dn8dcyj781krl5-zsh-5.9.1
  /nix/store/1vs1j6bg4n2q9pszgyzbp9p10i0szvc9-zsh-5.9.1-info
  /nix/store/4qzmzkyckdkqc7jpmhlrnj3vjmi0mi68-zsh-5.9.1-man
  /nix/store/mxajghyzvi968fzv2vcwq368mxi92niw-zstd-1.5.7
warning: ignoring the client-specified setting 'store', because it is a restricted setting and you are not a trusted user
failed checks.aarch64-darwin.devShell-clan-app 3h 0m
setup: don't know how to build these paths: /nix/store/7rjggz6r31ri7d0q2r8fp66dwi28hvkb-ui.drv warning: ignoring the client-specified setting 'store', because …
setup:
don't know how to build these paths:
  /nix/store/7rjggz6r31ri7d0q2r8fp66dwi28hvkb-ui.drv
warning: ignoring the client-specified setting 'store', because it is a restricted setting and you are not a trusted user
azhryp0h9zysi26pj2swcmfl84nvlyqs-clan-runtime.drv: build04: not scheduled here: azhryp0h9zysi26pj2swcmfl84nvlyqs-clan-runtime.drv, asking the scheduler again
failed checks.aarch64-darwin.devShell-clan-site 3h 0m
setup: /nix/store/nc18xhxz6k4svwsz72nmh2w3nrwqar7v-zlib-1.3.2-dev /nix/store/600wx4h47gwbfm2j59v33wj0xy3ni6qz-zlib-1.3.2-static /nix/store/5ds9fysxln35sqh …
setup:
  /nix/store/nc18xhxz6k4svwsz72nmh2w3nrwqar7v-zlib-1.3.2-dev
  /nix/store/600wx4h47gwbfm2j59v33wj0xy3ni6qz-zlib-1.3.2-static
  /nix/store/5ds9fysxln35sqh4krqw9imr4m5lnr1q-zlib-ng-2.3.3
  /nix/store/mxajghyzvi968fzv2vcwq368mxi92niw-zstd-1.5.7
  /nix/store/sj5gmvy8rr4r60sdfic9w426addgjpq3-zstd-1.5.7-bin
  /nix/store/jjlwnz5xzkxgql1v0dbbj611j6b4m469-zstd-1.5.7-dev
warning: ignoring the client-specified setting 'store', because it is a restricted setting and you are not a trusted user
azhryp0h9zysi26pj2swcmfl84nvlyqs-clan-runtime.drv: build04: not scheduled here: azhryp0h9zysi26pj2swcmfl84nvlyqs-clan-runtime.drv, asking the scheduler again
failed checks.aarch64-darwin.eval-tests 3h 0m
setup: don't know how to build these paths: /nix/store/545swxd8v8kndgs8gdyy0964jb8z10yf-eval-tests-aarch64-darwin.drv warning: ignoring the client-specified s …
setup:
don't know how to build these paths:
  /nix/store/545swxd8v8kndgs8gdyy0964jb8z10yf-eval-tests-aarch64-darwin.drv
warning: ignoring the client-specified setting 'store', because it is a restricted setting and you are not a trusted user
failed eval checks.aarch64-linux.admin —
error: … while evaluating the attribute 'drvPath' at «https://releases.nixos.org/nixos/26.05/nixos-26.05.10620.f5c082a40f75/nixexprs.tar.xz?narH …
error:
       … while evaluating the attribute 'drvPath'
         at «https://releases.nixos.org/nixos/26.05/nixos-26.05.10620.f5c082a40f75/nixexprs.tar.xz?narHash=sha256-7CLWYUrZU7w6X7y3VBohp2TUhQb0CjiEUbPE6WaOdK4%3D»/lib/customisation.nix:427:7:
          426|     // {
          427|       drvPath =
             |       ^
          428|         assert condition;

       … while calling the 'derivationStrict' builtin
         at «nix-internal»/derivation-internal.nix:37:12:
           36|
           37|   strict = derivationStrict drvAttrs;
             |            ^
           38|

       … while evaluating the option `nodes.client.networking.interfaces':

       … while evaluating definitions from `/nix/store/mz7g35d4m7d69sy6vc4iw6r11zp47fi3-source/nixos/modules/hardware/facter/networking':

       … while evaluating the option `nodes.client.hardware.facter.enable':

       … while evaluating the option `nodes.client.hardware.facter.report':

       … while evaluating the option `nodes.client.hardware.facter.reportPath':

       … while evaluating definitions from `/nix/store/hq8q721jlz0mqramvlvyj8lqa0d7nxrk-source/nixosModules/clanCore/nixos-facter.nix':

       (stack trace truncated; use '--show-trace' to show the full, detailed trace)

       error: cannot open connection to remote store 'grpc://nix-store.geninf.io:50051': error: Nix daemon disconnected unexpectedly (maybe it crashed?)
failed eval checks.aarch64-linux.borgbackup —
error: … while evaluating the attribute 'drvPath' at «https://releases.nixos.org/nixos/26.05/nixos-26.05.10620.f5c082a40f75/nixexprs.tar.xz?narH …
error:
       … while evaluating the attribute 'drvPath'
         at «https://releases.nixos.org/nixos/26.05/nixos-26.05.10620.f5c082a40f75/nixexprs.tar.xz?narHash=sha256-7CLWYUrZU7w6X7y3VBohp2TUhQb0CjiEUbPE6WaOdK4%3D»/lib/customisation.nix:427:7:
          426|     // {
          427|       drvPath =
             |       ^
          428|         assert condition;

       … while calling the 'derivationStrict' builtin
         at «nix-internal»/derivation-internal.nix:37:12:
           36|
           37|   strict = derivationStrict drvAttrs;
             |            ^
           38|

       … while evaluating the option `nodes.clientone.networking.interfaces':

       … while evaluating definitions from `/nix/store/mz7g35d4m7d69sy6vc4iw6r11zp47fi3-source/nixos/modules/hardware/facter/networking':

       … while evaluating the option `nodes.clientone.hardware.facter.enable':

       … while evaluating the option `nodes.clientone.hardware.facter.report':

       … while evaluating the option `nodes.clientone.hardware.facter.reportPath':

       … while evaluating definitions from `/nix/store/hq8q721jlz0mqramvlvyj8lqa0d7nxrk-source/nixosModules/clanCore/nixos-facter.nix':

       (stack trace truncated; use '--show-trace' to show the full, detailed trace)

       error: cannot open connection to remote store 'grpc://nix-store.geninf.io:50051': error: Nix daemon disconnected unexpectedly (maybe it crashed?)
failed eval checks.aarch64-linux.certificates —
error: … while evaluating the attribute 'drvPath' at «https://releases.nixos.org/nixos/26.05/nixos-26.05.10620.f5c082a40f75/nixexprs.tar.xz?narH …
error:
       … while evaluating the attribute 'drvPath'
         at «https://releases.nixos.org/nixos/26.05/nixos-26.05.10620.f5c082a40f75/nixexprs.tar.xz?narHash=sha256-7CLWYUrZU7w6X7y3VBohp2TUhQb0CjiEUbPE6WaOdK4%3D»/lib/customisation.nix:427:7:
          426|     // {
          427|       drvPath =
             |       ^
          428|         assert condition;

       … while calling the 'derivationStrict' builtin
         at «nix-internal»/derivation-internal.nix:37:12:
           36|
           37|   strict = derivationStrict drvAttrs;
             |            ^
           38|

       … while evaluating the option `nodes.ca.networking.interfaces':

       … while evaluating definitions from `/nix/store/mz7g35d4m7d69sy6vc4iw6r11zp47fi3-source/nixos/modules/hardware/facter/networking':

       … while evaluating the option `nodes.ca.hardware.facter.enable':

       … while evaluating the option `nodes.ca.hardware.facter.report':

       … while evaluating the option `nodes.ca.hardware.facter.reportPath':

       … while evaluating definitions from `/nix/store/hq8q721jlz0mqramvlvyj8lqa0d7nxrk-source/nixosModules/clanCore/nixos-facter.nix':

       (stack trace truncated; use '--show-trace' to show the full, detailed trace)

       error: cannot open connection to remote store 'grpc://nix-store.geninf.io:50051': error: Nix daemon disconnected unexpectedly (maybe it crashed?)
failed checks.aarch64-linux.darwin-test-darwin-machine 3h 0m
setup: /nix/store/papzdc7ngbiyvgymzcygb0xp13cpis48-xz-5.8.4-bin /nix/store/476zsjqic4kbjk43p27m165b5flfqr8l-zlib-1.3.2 /nix/store/5ds9fysxln35sqh4krqw9imr …
setup:
  /nix/store/papzdc7ngbiyvgymzcygb0xp13cpis48-xz-5.8.4-bin
  /nix/store/476zsjqic4kbjk43p27m165b5flfqr8l-zlib-1.3.2
  /nix/store/5ds9fysxln35sqh4krqw9imr4m5lnr1q-zlib-ng-2.3.3
  /nix/store/zwlm8hwl20j12pp7c6dn8dcyj781krl5-zsh-5.9.1
  /nix/store/1vs1j6bg4n2q9pszgyzbp9p10i0szvc9-zsh-5.9.1-info
  /nix/store/4qzmzkyckdkqc7jpmhlrnj3vjmi0mi68-zsh-5.9.1-man
  /nix/store/mxajghyzvi968fzv2vcwq368mxi92niw-zstd-1.5.7
warning: ignoring the client-specified setting 'store', because it is a restricted setting and you are not a trusted user
failed eval checks.aarch64-linux.data-mesher —
error: … while evaluating the attribute 'drvPath' at «https://releases.nixos.org/nixos/26.05/nixos-26.05.10620.f5c082a40f75/nixexprs.tar.xz?narH …
error:
       … while evaluating the attribute 'drvPath'
         at «https://releases.nixos.org/nixos/26.05/nixos-26.05.10620.f5c082a40f75/nixexprs.tar.xz?narHash=sha256-7CLWYUrZU7w6X7y3VBohp2TUhQb0CjiEUbPE6WaOdK4%3D»/lib/customisation.nix:427:7:
          426|     // {
          427|       drvPath =
             |       ^
          428|         assert condition;

       … while calling the 'derivationStrict' builtin
         at «nix-internal»/derivation-internal.nix:37:12:
           36|
           37|   strict = derivationStrict drvAttrs;
             |            ^
           38|

       … while evaluating the option `nodes.alpha.networking.interfaces':

       … while evaluating definitions from `/nix/store/mz7g35d4m7d69sy6vc4iw6r11zp47fi3-source/nixos/modules/hardware/facter/networking':

       … while evaluating the option `nodes.alpha.hardware.facter.enable':

       … while evaluating the option `nodes.alpha.hardware.facter.report':

       … while evaluating the option `nodes.alpha.hardware.facter.reportPath':

       … while evaluating definitions from `/nix/store/hq8q721jlz0mqramvlvyj8lqa0d7nxrk-source/nixosModules/clanCore/nixos-facter.nix':

       (stack trace truncated; use '--show-trace' to show the full, detailed trace)

       error: opening a connection to remote store 'grpc://nix-store.geninf.io:50051' previously failed
failed eval checks.aarch64-linux.dm-dns —
error: … while evaluating the attribute 'drvPath' at «https://releases.nixos.org/nixos/26.05/nixos-26.05.10620.f5c082a40f75/nixexprs.tar.xz?narH …
error:
       … while evaluating the attribute 'drvPath'
         at «https://releases.nixos.org/nixos/26.05/nixos-26.05.10620.f5c082a40f75/nixexprs.tar.xz?narHash=sha256-7CLWYUrZU7w6X7y3VBohp2TUhQb0CjiEUbPE6WaOdK4%3D»/lib/customisation.nix:427:7:
          426|     // {
          427|       drvPath =
             |       ^
          428|         assert condition;

       … while calling the 'derivationStrict' builtin
         at «nix-internal»/derivation-internal.nix:37:12:
           36|
           37|   strict = derivationStrict drvAttrs;
             |            ^
           38|

       … while evaluating the option `nodes.client.networking.interfaces':

       … while evaluating definitions from `/nix/store/mz7g35d4m7d69sy6vc4iw6r11zp47fi3-source/nixos/modules/hardware/facter/networking':

       … while evaluating the option `nodes.client.hardware.facter.enable':

       … while evaluating the option `nodes.client.hardware.facter.report':

       … while evaluating the option `nodes.client.hardware.facter.reportPath':

       … while evaluating definitions from `/nix/store/hq8q721jlz0mqramvlvyj8lqa0d7nxrk-source/nixosModules/clanCore/nixos-facter.nix':

       (stack trace truncated; use '--show-trace' to show the full, detailed trace)

       error: cannot open connection to remote store 'grpc://nix-store.geninf.io:50051': error: Nix daemon disconnected unexpectedly (maybe it crashed?)
failed eval checks.aarch64-linux.dyndns —
error: … while evaluating the attribute 'drvPath' at «https://releases.nixos.org/nixos/26.05/nixos-26.05.10620.f5c082a40f75/nixexprs.tar.xz?narH …
error:
       … while evaluating the attribute 'drvPath'
         at «https://releases.nixos.org/nixos/26.05/nixos-26.05.10620.f5c082a40f75/nixexprs.tar.xz?narHash=sha256-7CLWYUrZU7w6X7y3VBohp2TUhQb0CjiEUbPE6WaOdK4%3D»/lib/customisation.nix:427:7:
          426|     // {
          427|       drvPath =
             |       ^
          428|         assert condition;

       … while calling the 'derivationStrict' builtin
         at «nix-internal»/derivation-internal.nix:37:12:
           36|
           37|   strict = derivationStrict drvAttrs;
             |            ^
           38|

       … while evaluating the option `nodes.server.networking.interfaces':

       … while evaluating definitions from `/nix/store/mz7g35d4m7d69sy6vc4iw6r11zp47fi3-source/nixos/modules/hardware/facter/networking':

       … while evaluating the option `nodes.server.hardware.facter.enable':

       … while evaluating the option `nodes.server.hardware.facter.report':

       … while evaluating the option `nodes.server.hardware.facter.reportPath':

       … while evaluating definitions from `/nix/store/hq8q721jlz0mqramvlvyj8lqa0d7nxrk-source/nixosModules/clanCore/nixos-facter.nix':

       (stack trace truncated; use '--show-trace' to show the full, detailed trace)

       error: opening a connection to remote store 'grpc://nix-store.geninf.io:50051' previously failed
failed eval checks.aarch64-linux.garage —
error: … while evaluating the attribute 'drvPath' at «https://releases.nixos.org/nixos/26.05/nixos-26.05.10620.f5c082a40f75/nixexprs.tar.xz?narH …
error:
       … while evaluating the attribute 'drvPath'
         at «https://releases.nixos.org/nixos/26.05/nixos-26.05.10620.f5c082a40f75/nixexprs.tar.xz?narHash=sha256-7CLWYUrZU7w6X7y3VBohp2TUhQb0CjiEUbPE6WaOdK4%3D»/lib/customisation.nix:427:7:
          426|     // {
          427|       drvPath =
             |       ^
          428|         assert condition;

       … while calling the 'derivationStrict' builtin
         at «nix-internal»/derivation-internal.nix:37:12:
           36|
           37|   strict = derivationStrict drvAttrs;
             |            ^
           38|

       … while evaluating the option `nodes.server.networking.interfaces':

       … while evaluating definitions from `/nix/store/mz7g35d4m7d69sy6vc4iw6r11zp47fi3-source/nixos/modules/hardware/facter/networking':

       … while evaluating the option `nodes.server.hardware.facter.enable':

       … while evaluating the option `nodes.server.hardware.facter.report':

       … while evaluating the option `nodes.server.hardware.facter.reportPath':

       … while evaluating definitions from `/nix/store/hq8q721jlz0mqramvlvyj8lqa0d7nxrk-source/nixosModules/clanCore/nixos-facter.nix':

       (stack trace truncated; use '--show-trace' to show the full, detailed trace)

       error: cannot open connection to remote store 'grpc://nix-store.geninf.io:50051': error: Nix daemon disconnected unexpectedly (maybe it crashed?)
failed eval checks.aarch64-linux.hello-service —
error: … while evaluating the attribute 'drvPath' at «https://releases.nixos.org/nixos/26.05/nixos-26.05.10620.f5c082a40f75/nixexprs.tar.xz?narH …
error:
       … while evaluating the attribute 'drvPath'
         at «https://releases.nixos.org/nixos/26.05/nixos-26.05.10620.f5c082a40f75/nixexprs.tar.xz?narHash=sha256-7CLWYUrZU7w6X7y3VBohp2TUhQb0CjiEUbPE6WaOdK4%3D»/lib/customisation.nix:427:7:
          426|     // {
          427|       drvPath =
             |       ^
          428|         assert condition;

       … while calling the 'derivationStrict' builtin
         at «nix-internal»/derivation-internal.nix:37:12:
           36|
           37|   strict = derivationStrict drvAttrs;
             |            ^
           38|

       … while evaluating the option `nodes.peer1.networking.interfaces':

       … while evaluating definitions from `/nix/store/mz7g35d4m7d69sy6vc4iw6r11zp47fi3-source/nixos/modules/hardware/facter/networking':

       … while evaluating the option `nodes.peer1.hardware.facter.enable':

       … while evaluating the option `nodes.peer1.hardware.facter.report':

       … while evaluating the option `nodes.peer1.hardware.facter.reportPath':

       … while evaluating definitions from `/nix/store/hq8q721jlz0mqramvlvyj8lqa0d7nxrk-source/nixosModules/clanCore/nixos-facter.nix':

       (stack trace truncated; use '--show-trace' to show the full, detailed trace)

       error: cannot open connection to remote store 'grpc://nix-store.geninf.io:50051': error: Nix daemon disconnected unexpectedly (maybe it crashed?)
failed eval checks.aarch64-linux.kde —
error: … while evaluating the attribute 'drvPath' at «https://releases.nixos.org/nixos/26.05/nixos-26.05.10620.f5c082a40f75/nixexprs.tar.xz?narH …
error:
       … while evaluating the attribute 'drvPath'
         at «https://releases.nixos.org/nixos/26.05/nixos-26.05.10620.f5c082a40f75/nixexprs.tar.xz?narHash=sha256-7CLWYUrZU7w6X7y3VBohp2TUhQb0CjiEUbPE6WaOdK4%3D»/lib/customisation.nix:427:7:
          426|     // {
          427|       drvPath =
             |       ^
          428|         assert condition;

       … while calling the 'derivationStrict' builtin
         at «nix-internal»/derivation-internal.nix:37:12:
           36|
           37|   strict = derivationStrict drvAttrs;
             |            ^
           38|

       … while evaluating the option `nodes.client.networking.interfaces':

       … while evaluating definitions from `/nix/store/mz7g35d4m7d69sy6vc4iw6r11zp47fi3-source/nixos/modules/hardware/facter/networking':

       … while evaluating the option `nodes.client.hardware.facter.enable':

       … while evaluating the option `nodes.client.hardware.facter.report':

       … while evaluating the option `nodes.client.hardware.facter.reportPath':

       … while evaluating definitions from `/nix/store/hq8q721jlz0mqramvlvyj8lqa0d7nxrk-source/nixosModules/clanCore/nixos-facter.nix':

       (stack trace truncated; use '--show-trace' to show the full, detailed trace)

       error: cannot open connection to remote store 'grpc://nix-store.geninf.io:50051': error: Nix daemon disconnected unexpectedly (maybe it crashed?)
failed eval checks.aarch64-linux.localbackup —
error: … while evaluating the attribute 'drvPath' at «https://releases.nixos.org/nixos/26.05/nixos-26.05.10620.f5c082a40f75/nixexprs.tar.xz?narH …
error:
       … while evaluating the attribute 'drvPath'
         at «https://releases.nixos.org/nixos/26.05/nixos-26.05.10620.f5c082a40f75/nixexprs.tar.xz?narHash=sha256-7CLWYUrZU7w6X7y3VBohp2TUhQb0CjiEUbPE6WaOdK4%3D»/lib/customisation.nix:427:7:
          426|     // {
          427|       drvPath =
             |       ^
          428|         assert condition;

       … while calling the 'derivationStrict' builtin
         at «nix-internal»/derivation-internal.nix:37:12:
           36|
           37|   strict = derivationStrict drvAttrs;
             |            ^
           38|

       … while evaluating the option `nodes.machine.networking.interfaces':

       … while evaluating definitions from `/nix/store/mz7g35d4m7d69sy6vc4iw6r11zp47fi3-source/nixos/modules/hardware/facter/networking':

       … while evaluating the option `nodes.machine.hardware.facter.enable':

       … while evaluating the option `nodes.machine.hardware.facter.report':

       … while evaluating the option `nodes.machine.hardware.facter.reportPath':

       … while evaluating definitions from `/nix/store/hq8q721jlz0mqramvlvyj8lqa0d7nxrk-source/nixosModules/clanCore/nixos-facter.nix':

       (stack trace truncated; use '--show-trace' to show the full, detailed trace)

       error: cannot open connection to remote store 'grpc://nix-store.geninf.io:50051': error: Nix daemon disconnected unexpectedly (maybe it crashed?)
failed eval checks.aarch64-linux.machine-id —
error: … while evaluating the attribute 'drvPath' at «https://releases.nixos.org/nixos/26.05/nixos-26.05.10620.f5c082a40f75/nixexprs.tar.xz?narH …
error:
       … while evaluating the attribute 'drvPath'
         at «https://releases.nixos.org/nixos/26.05/nixos-26.05.10620.f5c082a40f75/nixexprs.tar.xz?narHash=sha256-7CLWYUrZU7w6X7y3VBohp2TUhQb0CjiEUbPE6WaOdK4%3D»/lib/customisation.nix:427:7:
          426|     // {
          427|       drvPath =
             |       ^
          428|         assert condition;

       … while calling the 'derivationStrict' builtin
         at «nix-internal»/derivation-internal.nix:37:12:
           36|
           37|   strict = derivationStrict drvAttrs;
             |            ^
           38|

       … while evaluating the option `nodes.server.networking.interfaces':

       … while evaluating definitions from `/nix/store/mz7g35d4m7d69sy6vc4iw6r11zp47fi3-source/nixos/modules/hardware/facter/networking':

       … while evaluating the option `nodes.server.hardware.facter.enable':

       … while evaluating the option `nodes.server.hardware.facter.report':

       … while evaluating the option `nodes.server.hardware.facter.reportPath':

       … while evaluating definitions from `/nix/store/hq8q721jlz0mqramvlvyj8lqa0d7nxrk-source/nixosModules/clanCore/nixos-facter.nix':

       (stack trace truncated; use '--show-trace' to show the full, detailed trace)

       error: opening a connection to remote store 'grpc://nix-store.geninf.io:50051' previously failed
failed eval checks.aarch64-linux.matrix-synapse —
error: … while evaluating the attribute 'drvPath' at «https://releases.nixos.org/nixos/26.05/nixos-26.05.10620.f5c082a40f75/nixexprs.tar.xz?narH …
error:
       … while evaluating the attribute 'drvPath'
         at «https://releases.nixos.org/nixos/26.05/nixos-26.05.10620.f5c082a40f75/nixexprs.tar.xz?narHash=sha256-7CLWYUrZU7w6X7y3VBohp2TUhQb0CjiEUbPE6WaOdK4%3D»/lib/customisation.nix:427:7:
          426|     // {
          427|       drvPath =
             |       ^
          428|         assert condition;

       … while calling the 'derivationStrict' builtin
         at «nix-internal»/derivation-internal.nix:37:12:
           36|
           37|   strict = derivationStrict drvAttrs;
             |            ^
           38|

       … while evaluating the option `nodes.machine.networking.interfaces':

       … while evaluating definitions from `/nix/store/mz7g35d4m7d69sy6vc4iw6r11zp47fi3-source/nixos/modules/hardware/facter/networking':

       … while evaluating the option `nodes.machine.hardware.facter.enable':

       … while evaluating the option `nodes.machine.hardware.facter.report':

       … while evaluating the option `nodes.machine.hardware.facter.reportPath':

       … while evaluating definitions from `/nix/store/hq8q721jlz0mqramvlvyj8lqa0d7nxrk-source/nixosModules/clanCore/nixos-facter.nix':

       (stack trace truncated; use '--show-trace' to show the full, detailed trace)

       error: cannot open connection to remote store 'grpc://nix-store.geninf.io:50051': error: Nix daemon disconnected unexpectedly (maybe it crashed?)
failed eval checks.aarch64-linux.monitoring —
error: … while evaluating the attribute 'drvPath' at «https://releases.nixos.org/nixos/26.05/nixos-26.05.10620.f5c082a40f75/nixexprs.tar.xz?narH …
error:
       … while evaluating the attribute 'drvPath'
         at «https://releases.nixos.org/nixos/26.05/nixos-26.05.10620.f5c082a40f75/nixexprs.tar.xz?narHash=sha256-7CLWYUrZU7w6X7y3VBohp2TUhQb0CjiEUbPE6WaOdK4%3D»/lib/customisation.nix:427:7:
          426|     // {
          427|       drvPath =
             |       ^
          428|         assert condition;

       … while calling the 'derivationStrict' builtin
         at «nix-internal»/derivation-internal.nix:37:12:
           36|
           37|   strict = derivationStrict drvAttrs;
             |            ^
           38|

       … while evaluating the option `nodes.machine1.networking.interfaces':

       … while evaluating definitions from `/nix/store/mz7g35d4m7d69sy6vc4iw6r11zp47fi3-source/nixos/modules/hardware/facter/networking':

       … while evaluating the option `nodes.machine1.hardware.facter.enable':

       … while evaluating the option `nodes.machine1.hardware.facter.report':

       … while evaluating the option `nodes.machine1.hardware.facter.reportPath':

       … while evaluating definitions from `/nix/store/hq8q721jlz0mqramvlvyj8lqa0d7nxrk-source/nixosModules/clanCore/nixos-facter.nix':

       (stack trace truncated; use '--show-trace' to show the full, detailed trace)

       error: cannot open connection to remote store 'grpc://nix-store.geninf.io:50051': error: Nix daemon disconnected unexpectedly (maybe it crashed?)
failed eval checks.aarch64-linux.mycelium —
error: … while evaluating the attribute 'drvPath' at «https://releases.nixos.org/nixos/26.05/nixos-26.05.10620.f5c082a40f75/nixexprs.tar.xz?narH …
error:
       … while evaluating the attribute 'drvPath'
         at «https://releases.nixos.org/nixos/26.05/nixos-26.05.10620.f5c082a40f75/nixexprs.tar.xz?narHash=sha256-7CLWYUrZU7w6X7y3VBohp2TUhQb0CjiEUbPE6WaOdK4%3D»/lib/customisation.nix:427:7:
          426|     // {
          427|       drvPath =
             |       ^
          428|         assert condition;

       … while calling the 'derivationStrict' builtin
         at «nix-internal»/derivation-internal.nix:37:12:
           36|
           37|   strict = derivationStrict drvAttrs;
             |            ^
           38|

       … while evaluating the option `driverConfiguration.vlans':

       … while evaluating definitions from `/nix/store/mz7g35d4m7d69sy6vc4iw6r11zp47fi3-source/nixos/lib/testing/driver-configuration.nix':

       … while evaluating the option `nodes.server.networking.interfaces':

       … while evaluating definitions from `/nix/store/mz7g35d4m7d69sy6vc4iw6r11zp47fi3-source/nixos/modules/hardware/facter/networking':

       … while evaluating the option `nodes.server.hardware.facter.enable':

       … while evaluating the option `nodes.server.hardware.facter.report':

       … while evaluating the option `nodes.server.hardware.facter.reportPath':

       … while evaluating definitions from `/nix/store/hq8q721jlz0mqramvlvyj8lqa0d7nxrk-source/nixosModules/clanCore/nixos-facter.nix':

       (stack trace truncated; use '--show-trace' to show the full, detailed trace)

       error: cannot open connection to remote store 'grpc://nix-store.geninf.io:50051': error: Nix daemon disconnected unexpectedly (maybe it crashed?)
failed eval checks.aarch64-linux.ncps —
error: … while evaluating the attribute 'drvPath' at «https://releases.nixos.org/nixos/26.05/nixos-26.05.10620.f5c082a40f75/nixexprs.tar.xz?narH …
error:
       … while evaluating the attribute 'drvPath'
         at «https://releases.nixos.org/nixos/26.05/nixos-26.05.10620.f5c082a40f75/nixexprs.tar.xz?narHash=sha256-7CLWYUrZU7w6X7y3VBohp2TUhQb0CjiEUbPE6WaOdK4%3D»/lib/customisation.nix:427:7:
          426|     // {
          427|       drvPath =
             |       ^
          428|         assert condition;

       … while calling the 'derivationStrict' builtin
         at «nix-internal»/derivation-internal.nix:37:12:
           36|
           37|   strict = derivationStrict drvAttrs;
             |            ^
           38|

       … while evaluating the option `nodes.alice.networking.interfaces':

       … while evaluating definitions from `/nix/store/mz7g35d4m7d69sy6vc4iw6r11zp47fi3-source/nixos/modules/hardware/facter/networking':

       … while evaluating the option `nodes.alice.hardware.facter.enable':

       … while evaluating the option `nodes.alice.hardware.facter.report':

       … while evaluating the option `nodes.alice.hardware.facter.reportPath':

       … while evaluating definitions from `/nix/store/hq8q721jlz0mqramvlvyj8lqa0d7nxrk-source/nixosModules/clanCore/nixos-facter.nix':

       (stack trace truncated; use '--show-trace' to show the full, detailed trace)

       error: opening a connection to remote store 'grpc://nix-store.geninf.io:50051' previously failed
failed eval checks.aarch64-linux.nixos-test-password-store-mounts —
error: … while evaluating the attribute 'drvPath' at «https://releases.nixos.org/nixos/26.05/nixos-26.05.10620.f5c082a40f75/nixexprs.tar.xz?narH …
error:
       … while evaluating the attribute 'drvPath'
         at «https://releases.nixos.org/nixos/26.05/nixos-26.05.10620.f5c082a40f75/nixexprs.tar.xz?narHash=sha256-7CLWYUrZU7w6X7y3VBohp2TUhQb0CjiEUbPE6WaOdK4%3D»/lib/customisation.nix:427:7:
          426|     // {
          427|       drvPath =
             |       ^
          428|         assert condition;

       … while calling the 'derivationStrict' builtin
         at «nix-internal»/derivation-internal.nix:37:12:
           36|
           37|   strict = derivationStrict drvAttrs;
             |            ^
           38|

       … while evaluating the option `driverConfiguration.vlans':

       … while evaluating definitions from `/nix/store/mz7g35d4m7d69sy6vc4iw6r11zp47fi3-source/nixos/lib/testing/driver-configuration.nix':

       … while evaluating the option `nodes.machine.networking.interfaces':

       … while evaluating definitions from `/nix/store/mz7g35d4m7d69sy6vc4iw6r11zp47fi3-source/nixos/modules/hardware/facter/networking':

       … while evaluating the option `nodes.machine.hardware.facter.enable':

       … while evaluating the option `nodes.machine.hardware.facter.report':

       … while evaluating the option `nodes.machine.hardware.facter.reportPath':

       … while evaluating definitions from `/nix/store/hq8q721jlz0mqramvlvyj8lqa0d7nxrk-source/nixosModules/clanCore/nixos-facter.nix':

       (stack trace truncated; use '--show-trace' to show the full, detailed trace)

       error: opening a connection to remote store 'grpc://nix-store.geninf.io:50051' previously failed
failed eval checks.aarch64-linux.p2p-ssh-iroh —
error: … while evaluating the attribute 'drvPath' at «https://releases.nixos.org/nixos/26.05/nixos-26.05.10620.f5c082a40f75/nixexprs.tar.xz?narH …
error:
       … while evaluating the attribute 'drvPath'
         at «https://releases.nixos.org/nixos/26.05/nixos-26.05.10620.f5c082a40f75/nixexprs.tar.xz?narHash=sha256-7CLWYUrZU7w6X7y3VBohp2TUhQb0CjiEUbPE6WaOdK4%3D»/lib/customisation.nix:427:7:
          426|     // {
          427|       drvPath =
             |       ^
          428|         assert condition;

       … while calling the 'derivationStrict' builtin
         at «nix-internal»/derivation-internal.nix:37:12:
           36|
           37|   strict = derivationStrict drvAttrs;
             |            ^
           38|

       … while evaluating the option `nodes.client.networking.interfaces':

       … while evaluating definitions from `/nix/store/mz7g35d4m7d69sy6vc4iw6r11zp47fi3-source/nixos/modules/hardware/facter/networking':

       … while evaluating the option `nodes.client.hardware.facter.enable':

       … while evaluating the option `nodes.client.hardware.facter.report':

       … while evaluating the option `nodes.client.hardware.facter.reportPath':

       … while evaluating definitions from `/nix/store/hq8q721jlz0mqramvlvyj8lqa0d7nxrk-source/nixosModules/clanCore/nixos-facter.nix':

       (stack trace truncated; use '--show-trace' to show the full, detailed trace)

       error: opening a connection to remote store 'grpc://nix-store.geninf.io:50051' previously failed
failed eval checks.aarch64-linux.packages —
error: … while evaluating the attribute 'drvPath' at «https://releases.nixos.org/nixos/26.05/nixos-26.05.10620.f5c082a40f75/nixexprs.tar.xz?narH …
error:
       … while evaluating the attribute 'drvPath'
         at «https://releases.nixos.org/nixos/26.05/nixos-26.05.10620.f5c082a40f75/nixexprs.tar.xz?narHash=sha256-7CLWYUrZU7w6X7y3VBohp2TUhQb0CjiEUbPE6WaOdK4%3D»/lib/customisation.nix:427:7:
          426|     // {
          427|       drvPath =
             |       ^
          428|         assert condition;

       … while calling the 'derivationStrict' builtin
         at «nix-internal»/derivation-internal.nix:37:12:
           36|
           37|   strict = derivationStrict drvAttrs;
             |            ^
           38|

       … while evaluating the option `nodes.server.networking.interfaces':

       … while evaluating definitions from `/nix/store/mz7g35d4m7d69sy6vc4iw6r11zp47fi3-source/nixos/modules/hardware/facter/networking':

       … while evaluating the option `nodes.server.hardware.facter.enable':

       … while evaluating the option `nodes.server.hardware.facter.report':

       … while evaluating the option `nodes.server.hardware.facter.reportPath':

       … while evaluating definitions from `/nix/store/hq8q721jlz0mqramvlvyj8lqa0d7nxrk-source/nixosModules/clanCore/nixos-facter.nix':

       (stack trace truncated; use '--show-trace' to show the full, detailed trace)

       error: opening a connection to remote store 'grpc://nix-store.geninf.io:50051' previously failed
failed eval checks.aarch64-linux.pki —
error: … while evaluating the attribute 'drvPath' at «https://releases.nixos.org/nixos/26.05/nixos-26.05.10620.f5c082a40f75/nixexprs.tar.xz?narH …
error:
       … while evaluating the attribute 'drvPath'
         at «https://releases.nixos.org/nixos/26.05/nixos-26.05.10620.f5c082a40f75/nixexprs.tar.xz?narHash=sha256-7CLWYUrZU7w6X7y3VBohp2TUhQb0CjiEUbPE6WaOdK4%3D»/lib/customisation.nix:427:7:
          426|     // {
          427|       drvPath =
             |       ^
          428|         assert condition;

       … while calling the 'derivationStrict' builtin
         at «nix-internal»/derivation-internal.nix:37:12:
           36|
           37|   strict = derivationStrict drvAttrs;
             |            ^
           38|

       … while evaluating the option `driverConfiguration.vlans':

       … while evaluating definitions from `/nix/store/mz7g35d4m7d69sy6vc4iw6r11zp47fi3-source/nixos/lib/testing/driver-configuration.nix':

       … while evaluating the option `nodes.caddy.networking.interfaces':

       … while evaluating definitions from `/nix/store/mz7g35d4m7d69sy6vc4iw6r11zp47fi3-source/nixos/modules/hardware/facter/networking':

       … while evaluating the option `nodes.caddy.hardware.facter.enable':

       … while evaluating the option `nodes.caddy.hardware.facter.report':

       … while evaluating the option `nodes.caddy.hardware.facter.reportPath':

       … while evaluating definitions from `/nix/store/hq8q721jlz0mqramvlvyj8lqa0d7nxrk-source/nixosModules/clanCore/nixos-facter.nix':

       (stack trace truncated; use '--show-trace' to show the full, detailed trace)

       error: cannot open connection to remote store 'grpc://nix-store.geninf.io:50051': error: Nix daemon disconnected unexpectedly (maybe it crashed?)
failed eval checks.aarch64-linux.postgresql —
error: … while evaluating the attribute 'drvPath' at «https://releases.nixos.org/nixos/26.05/nixos-26.05.10620.f5c082a40f75/nixexprs.tar.xz?narH …
error:
       … while evaluating the attribute 'drvPath'
         at «https://releases.nixos.org/nixos/26.05/nixos-26.05.10620.f5c082a40f75/nixexprs.tar.xz?narHash=sha256-7CLWYUrZU7w6X7y3VBohp2TUhQb0CjiEUbPE6WaOdK4%3D»/lib/customisation.nix:427:7:
          426|     // {
          427|       drvPath =
             |       ^
          428|         assert condition;

       … while calling the 'derivationStrict' builtin
         at «nix-internal»/derivation-internal.nix:37:12:
           36|
           37|   strict = derivationStrict drvAttrs;
             |            ^
           38|

       … while evaluating the option `nodes.machine.networking.interfaces':

       … while evaluating definitions from `/nix/store/mz7g35d4m7d69sy6vc4iw6r11zp47fi3-source/nixos/modules/hardware/facter/networking':

       … while evaluating the option `nodes.machine.hardware.facter.enable':

       … while evaluating the option `nodes.machine.hardware.facter.report':

       … while evaluating the option `nodes.machine.hardware.facter.reportPath':

       … while evaluating definitions from `/nix/store/hq8q721jlz0mqramvlvyj8lqa0d7nxrk-source/nixosModules/clanCore/nixos-facter.nix':

       (stack trace truncated; use '--show-trace' to show the full, detailed trace)

       error: opening a connection to remote store 'grpc://nix-store.geninf.io:50051' previously failed
failed eval checks.aarch64-linux.service-dummy-test —
error: … while evaluating the attribute 'drvPath' at «https://releases.nixos.org/nixos/26.05/nixos-26.05.10620.f5c082a40f75/nixexprs.tar.xz?narH …
error:
       … while evaluating the attribute 'drvPath'
         at «https://releases.nixos.org/nixos/26.05/nixos-26.05.10620.f5c082a40f75/nixexprs.tar.xz?narHash=sha256-7CLWYUrZU7w6X7y3VBohp2TUhQb0CjiEUbPE6WaOdK4%3D»/lib/customisation.nix:427:7:
          426|     // {
          427|       drvPath =
             |       ^
          428|         assert condition;

       … while calling the 'derivationStrict' builtin
         at «nix-internal»/derivation-internal.nix:37:12:
           36|
           37|   strict = derivationStrict drvAttrs;
             |            ^
           38|

       … while evaluating the option `nodes.admin1.networking.interfaces':

       … while evaluating definitions from `/nix/store/mz7g35d4m7d69sy6vc4iw6r11zp47fi3-source/nixos/modules/hardware/facter/networking':

       … while evaluating the option `nodes.admin1.hardware.facter.enable':

       … while evaluating the option `nodes.admin1.hardware.facter.report':

       … while evaluating the option `nodes.admin1.hardware.facter.reportPath':

       … while evaluating definitions from `/nix/store/hq8q721jlz0mqramvlvyj8lqa0d7nxrk-source/nixosModules/clanCore/nixos-facter.nix':

       (stack trace truncated; use '--show-trace' to show the full, detailed trace)

       error: opening a connection to remote store 'grpc://nix-store.geninf.io:50051' previously failed
failed eval checks.aarch64-linux.service-dummy-test-from-flake —
error: … while evaluating the attribute 'drvPath' at «https://releases.nixos.org/nixos/26.05/nixos-26.05.10620.f5c082a40f75/nixexprs.tar.xz?narH …
error:
       … while evaluating the attribute 'drvPath'
         at «https://releases.nixos.org/nixos/26.05/nixos-26.05.10620.f5c082a40f75/nixexprs.tar.xz?narHash=sha256-7CLWYUrZU7w6X7y3VBohp2TUhQb0CjiEUbPE6WaOdK4%3D»/lib/customisation.nix:427:7:
          426|     // {
          427|       drvPath =
             |       ^
          428|         assert condition;

       … while calling the 'derivationStrict' builtin
         at «nix-internal»/derivation-internal.nix:37:12:
           36|
           37|   strict = derivationStrict drvAttrs;
             |            ^
           38|

       … while evaluating the option `nodes.admin1.networking.interfaces':

       … while evaluating definitions from `/nix/store/mz7g35d4m7d69sy6vc4iw6r11zp47fi3-source/nixos/modules/hardware/facter/networking':

       … while evaluating the option `nodes.admin1.hardware.facter.enable':

       … while evaluating the option `nodes.admin1.hardware.facter.report':

       … while evaluating the option `nodes.admin1.hardware.facter.reportPath':

       … while evaluating definitions from `/nix/store/hq8q721jlz0mqramvlvyj8lqa0d7nxrk-source/nixosModules/clanCore/nixos-facter.nix':

       (stack trace truncated; use '--show-trace' to show the full, detailed trace)

       error: opening a connection to remote store 'grpc://nix-store.geninf.io:50051' previously failed
failed eval checks.aarch64-linux.sshd —
error: … while evaluating the attribute 'drvPath' at «https://releases.nixos.org/nixos/26.05/nixos-26.05.10620.f5c082a40f75/nixexprs.tar.xz?narH …
error:
       … while evaluating the attribute 'drvPath'
         at «https://releases.nixos.org/nixos/26.05/nixos-26.05.10620.f5c082a40f75/nixexprs.tar.xz?narHash=sha256-7CLWYUrZU7w6X7y3VBohp2TUhQb0CjiEUbPE6WaOdK4%3D»/lib/customisation.nix:427:7:
          426|     // {
          427|       drvPath =
             |       ^
          428|         assert condition;

       … while calling the 'derivationStrict' builtin
         at «nix-internal»/derivation-internal.nix:37:12:
           36|
           37|   strict = derivationStrict drvAttrs;
             |            ^
           38|

       … while evaluating the option `nodes.client.networking.interfaces':

       … while evaluating definitions from `/nix/store/mz7g35d4m7d69sy6vc4iw6r11zp47fi3-source/nixos/modules/hardware/facter/networking':

       … while evaluating the option `nodes.client.hardware.facter.enable':

       … while evaluating the option `nodes.client.hardware.facter.report':

       … while evaluating the option `nodes.client.hardware.facter.reportPath':

       … while evaluating definitions from `/nix/store/hq8q721jlz0mqramvlvyj8lqa0d7nxrk-source/nixosModules/clanCore/nixos-facter.nix':

       (stack trace truncated; use '--show-trace' to show the full, detailed trace)

       error: opening a connection to remote store 'grpc://nix-store.geninf.io:50051' previously failed
failed eval checks.aarch64-linux.sshd-no-ca —
error: … while evaluating the attribute 'drvPath' at «https://releases.nixos.org/nixos/26.05/nixos-26.05.10620.f5c082a40f75/nixexprs.tar.xz?narH …
error:
       … while evaluating the attribute 'drvPath'
         at «https://releases.nixos.org/nixos/26.05/nixos-26.05.10620.f5c082a40f75/nixexprs.tar.xz?narHash=sha256-7CLWYUrZU7w6X7y3VBohp2TUhQb0CjiEUbPE6WaOdK4%3D»/lib/customisation.nix:427:7:
          426|     // {
          427|       drvPath =
             |       ^
          428|         assert condition;

       … while calling the 'derivationStrict' builtin
         at «nix-internal»/derivation-internal.nix:37:12:
           36|
           37|   strict = derivationStrict drvAttrs;
             |            ^
           38|

       … while evaluating the option `nodes.client.networking.interfaces':

       … while evaluating definitions from `/nix/store/mz7g35d4m7d69sy6vc4iw6r11zp47fi3-source/nixos/modules/hardware/facter/networking':

       … while evaluating the option `nodes.client.hardware.facter.enable':

       … while evaluating the option `nodes.client.hardware.facter.report':

       … while evaluating the option `nodes.client.hardware.facter.reportPath':

       … while evaluating definitions from `/nix/store/hq8q721jlz0mqramvlvyj8lqa0d7nxrk-source/nixosModules/clanCore/nixos-facter.nix':

       (stack trace truncated; use '--show-trace' to show the full, detailed trace)

       error: opening a connection to remote store 'grpc://nix-store.geninf.io:50051' previously failed
failed eval checks.aarch64-linux.state-version —
error: … while evaluating the attribute 'drvPath' at «https://releases.nixos.org/nixos/26.05/nixos-26.05.10620.f5c082a40f75/nixexprs.tar.xz?narH …
error:
       … while evaluating the attribute 'drvPath'
         at «https://releases.nixos.org/nixos/26.05/nixos-26.05.10620.f5c082a40f75/nixexprs.tar.xz?narHash=sha256-7CLWYUrZU7w6X7y3VBohp2TUhQb0CjiEUbPE6WaOdK4%3D»/lib/customisation.nix:427:7:
          426|     // {
          427|       drvPath =
             |       ^
          428|         assert condition;

       … while calling the 'derivationStrict' builtin
         at «nix-internal»/derivation-internal.nix:37:12:
           36|
           37|   strict = derivationStrict drvAttrs;
             |            ^
           38|

       … while evaluating the option `nodes.server.networking.interfaces':

       … while evaluating definitions from `/nix/store/mz7g35d4m7d69sy6vc4iw6r11zp47fi3-source/nixos/modules/hardware/facter/networking':

       … while evaluating the option `nodes.server.hardware.facter.enable':

       … while evaluating the option `nodes.server.hardware.facter.report':

       … while evaluating the option `nodes.server.hardware.facter.reportPath':

       … while evaluating definitions from `/nix/store/hq8q721jlz0mqramvlvyj8lqa0d7nxrk-source/nixosModules/clanCore/nixos-facter.nix':

       (stack trace truncated; use '--show-trace' to show the full, detailed trace)

       error: opening a connection to remote store 'grpc://nix-store.geninf.io:50051' previously failed
failed eval checks.aarch64-linux.syncthing-service —
error: … while evaluating the attribute 'drvPath' at «https://releases.nixos.org/nixos/26.05/nixos-26.05.10620.f5c082a40f75/nixexprs.tar.xz?narH …
error:
       … while evaluating the attribute 'drvPath'
         at «https://releases.nixos.org/nixos/26.05/nixos-26.05.10620.f5c082a40f75/nixexprs.tar.xz?narHash=sha256-7CLWYUrZU7w6X7y3VBohp2TUhQb0CjiEUbPE6WaOdK4%3D»/lib/customisation.nix:427:7:
          426|     // {
          427|       drvPath =
             |       ^
          428|         assert condition;

       … while calling the 'derivationStrict' builtin
         at «nix-internal»/derivation-internal.nix:37:12:
           36|
           37|   strict = derivationStrict drvAttrs;
             |            ^
           38|

       … while evaluating the option `nodes.machine1.networking.interfaces':

       … while evaluating definitions from `/nix/store/mz7g35d4m7d69sy6vc4iw6r11zp47fi3-source/nixos/modules/hardware/facter/networking':

       … while evaluating the option `nodes.machine1.hardware.facter.enable':

       … while evaluating the option `nodes.machine1.hardware.facter.report':

       … while evaluating the option `nodes.machine1.hardware.facter.reportPath':

       … while evaluating definitions from `/nix/store/hq8q721jlz0mqramvlvyj8lqa0d7nxrk-source/nixosModules/clanCore/nixos-facter.nix':

       (stack trace truncated; use '--show-trace' to show the full, detailed trace)

       error: opening a connection to remote store 'grpc://nix-store.geninf.io:50051' previously failed
failed eval checks.aarch64-linux.trusted-nix-caches —
error: … while evaluating the attribute 'drvPath' at «https://releases.nixos.org/nixos/26.05/nixos-26.05.10620.f5c082a40f75/nixexprs.tar.xz?narH …
error:
       … while evaluating the attribute 'drvPath'
         at «https://releases.nixos.org/nixos/26.05/nixos-26.05.10620.f5c082a40f75/nixexprs.tar.xz?narHash=sha256-7CLWYUrZU7w6X7y3VBohp2TUhQb0CjiEUbPE6WaOdK4%3D»/lib/customisation.nix:427:7:
          426|     // {
          427|       drvPath =
             |       ^
          428|         assert condition;

       … while calling the 'derivationStrict' builtin
         at «nix-internal»/derivation-internal.nix:37:12:
           36|
           37|   strict = derivationStrict drvAttrs;
             |            ^
           38|

       … while evaluating the option `nodes.server.networking.interfaces':

       … while evaluating definitions from `/nix/store/mz7g35d4m7d69sy6vc4iw6r11zp47fi3-source/nixos/modules/hardware/facter/networking':

       … while evaluating the option `nodes.server.hardware.facter.enable':

       … while evaluating the option `nodes.server.hardware.facter.report':

       … while evaluating the option `nodes.server.hardware.facter.reportPath':

       … while evaluating definitions from `/nix/store/hq8q721jlz0mqramvlvyj8lqa0d7nxrk-source/nixosModules/clanCore/nixos-facter.nix':

       (stack trace truncated; use '--show-trace' to show the full, detailed trace)

       error: opening a connection to remote store 'grpc://nix-store.geninf.io:50051' previously failed
failed eval checks.aarch64-linux.users —
error: … while evaluating the attribute 'drvPath' at «https://releases.nixos.org/nixos/26.05/nixos-26.05.10620.f5c082a40f75/nixexprs.tar.xz?narH …
error:
       … while evaluating the attribute 'drvPath'
         at «https://releases.nixos.org/nixos/26.05/nixos-26.05.10620.f5c082a40f75/nixexprs.tar.xz?narHash=sha256-7CLWYUrZU7w6X7y3VBohp2TUhQb0CjiEUbPE6WaOdK4%3D»/lib/customisation.nix:427:7:
          426|     // {
          427|       drvPath =
             |       ^
          428|         assert condition;

       … while calling the 'derivationStrict' builtin
         at «nix-internal»/derivation-internal.nix:37:12:
           36|
           37|   strict = derivationStrict drvAttrs;
             |            ^
           38|

       … while evaluating the option `nodes.server.networking.interfaces':

       … while evaluating definitions from `/nix/store/mz7g35d4m7d69sy6vc4iw6r11zp47fi3-source/nixos/modules/hardware/facter/networking':

       … while evaluating the option `nodes.server.hardware.facter.enable':

       … while evaluating the option `nodes.server.hardware.facter.report':

       … while evaluating the option `nodes.server.hardware.facter.reportPath':

       … while evaluating definitions from `/nix/store/hq8q721jlz0mqramvlvyj8lqa0d7nxrk-source/nixosModules/clanCore/nixos-facter.nix':

       (stack trace truncated; use '--show-trace' to show the full, detailed trace)

       error: opening a connection to remote store 'grpc://nix-store.geninf.io:50051' previously failed
failed eval checks.aarch64-linux.wifi —
error: … while evaluating the attribute 'drvPath' at «https://releases.nixos.org/nixos/26.05/nixos-26.05.10620.f5c082a40f75/nixexprs.tar.xz?narH …
error:
       … while evaluating the attribute 'drvPath'
         at «https://releases.nixos.org/nixos/26.05/nixos-26.05.10620.f5c082a40f75/nixexprs.tar.xz?narHash=sha256-7CLWYUrZU7w6X7y3VBohp2TUhQb0CjiEUbPE6WaOdK4%3D»/lib/customisation.nix:427:7:
          426|     // {
          427|       drvPath =
             |       ^
          428|         assert condition;

       … while calling the 'derivationStrict' builtin
         at «nix-internal»/derivation-internal.nix:37:12:
           36|
           37|   strict = derivationStrict drvAttrs;
             |            ^
           38|

       … while evaluating the option `driverConfiguration.vlans':

       … while evaluating definitions from `/nix/store/mz7g35d4m7d69sy6vc4iw6r11zp47fi3-source/nixos/lib/testing/driver-configuration.nix':

       … while evaluating the option `nodes.second.networking.interfaces':

       … while evaluating definitions from `/nix/store/mz7g35d4m7d69sy6vc4iw6r11zp47fi3-source/nixos/modules/hardware/facter/networking':

       … while evaluating the option `nodes.second.hardware.facter.enable':

       … while evaluating the option `nodes.second.hardware.facter.report':

       … while evaluating the option `nodes.second.hardware.facter.reportPath':

       … while evaluating definitions from `/nix/store/hq8q721jlz0mqramvlvyj8lqa0d7nxrk-source/nixosModules/clanCore/nixos-facter.nix':

       (stack trace truncated; use '--show-trace' to show the full, detailed trace)

       error: opening a connection to remote store 'grpc://nix-store.geninf.io:50051' previously failed
failed eval checks.aarch64-linux.wireguard —
error: … while evaluating the attribute 'drvPath' at «https://releases.nixos.org/nixos/26.05/nixos-26.05.10620.f5c082a40f75/nixexprs.tar.xz?narH …
error:
       … while evaluating the attribute 'drvPath'
         at «https://releases.nixos.org/nixos/26.05/nixos-26.05.10620.f5c082a40f75/nixexprs.tar.xz?narHash=sha256-7CLWYUrZU7w6X7y3VBohp2TUhQb0CjiEUbPE6WaOdK4%3D»/lib/customisation.nix:427:7:
          426|     // {
          427|       drvPath =
             |       ^
          428|         assert condition;

       … while calling the 'derivationStrict' builtin
         at «nix-internal»/derivation-internal.nix:37:12:
           36|
           37|   strict = derivationStrict drvAttrs;
             |            ^
           38|

       … while evaluating the option `nodes.controller1.networking.interfaces':

       … while evaluating definitions from `/nix/store/mz7g35d4m7d69sy6vc4iw6r11zp47fi3-source/nixos/modules/hardware/facter/networking':

       … while evaluating the option `nodes.controller1.hardware.facter.enable':

       … while evaluating the option `nodes.controller1.hardware.facter.report':

       … while evaluating the option `nodes.controller1.hardware.facter.reportPath':

       … while evaluating definitions from `/nix/store/hq8q721jlz0mqramvlvyj8lqa0d7nxrk-source/nixosModules/clanCore/nixos-facter.nix':

       (stack trace truncated; use '--show-trace' to show the full, detailed trace)

       error: opening a connection to remote store 'grpc://nix-store.geninf.io:50051' previously failed
failed eval checks.aarch64-linux.yggdrasil —
error: … while evaluating the attribute 'drvPath' at «https://releases.nixos.org/nixos/26.05/nixos-26.05.10620.f5c082a40f75/nixexprs.tar.xz?narH …
error:
       … while evaluating the attribute 'drvPath'
         at «https://releases.nixos.org/nixos/26.05/nixos-26.05.10620.f5c082a40f75/nixexprs.tar.xz?narHash=sha256-7CLWYUrZU7w6X7y3VBohp2TUhQb0CjiEUbPE6WaOdK4%3D»/lib/customisation.nix:427:7:
          426|     // {
          427|       drvPath =
             |       ^
          428|         assert condition;

       … while calling the 'derivationStrict' builtin
         at «nix-internal»/derivation-internal.nix:37:12:
           36|
           37|   strict = derivationStrict drvAttrs;
             |            ^
           38|

       … while evaluating the option `driverConfiguration.vlans':

       … while evaluating definitions from `/nix/store/mz7g35d4m7d69sy6vc4iw6r11zp47fi3-source/nixos/lib/testing/driver-configuration.nix':

       … while evaluating the option `nodes.outsider.networking.interfaces':

       … while evaluating definitions from `/nix/store/mz7g35d4m7d69sy6vc4iw6r11zp47fi3-source/nixos/modules/hardware/facter/networking':

       … while evaluating the option `nodes.outsider.hardware.facter.enable':

       … while evaluating the option `nodes.outsider.hardware.facter.report':

       … while evaluating the option `nodes.outsider.hardware.facter.reportPath':

       … while evaluating definitions from `/nix/store/hq8q721jlz0mqramvlvyj8lqa0d7nxrk-source/nixosModules/clanCore/nixos-facter.nix':

       (stack trace truncated; use '--show-trace' to show the full, detailed trace)

       error: opening a connection to remote store 'grpc://nix-store.geninf.io:50051' previously failed
failed eval checks.aarch64-linux.zerotier —
error: … while evaluating the attribute 'drvPath' at «https://releases.nixos.org/nixos/26.05/nixos-26.05.10620.f5c082a40f75/nixexprs.tar.xz?narH …
error:
       … while evaluating the attribute 'drvPath'
         at «https://releases.nixos.org/nixos/26.05/nixos-26.05.10620.f5c082a40f75/nixexprs.tar.xz?narHash=sha256-7CLWYUrZU7w6X7y3VBohp2TUhQb0CjiEUbPE6WaOdK4%3D»/lib/customisation.nix:427:7:
          426|     // {
          427|       drvPath =
             |       ^
          428|         assert condition;

       … while calling the 'derivationStrict' builtin
         at «nix-internal»/derivation-internal.nix:37:12:
           36|
           37|   strict = derivationStrict drvAttrs;
             |            ^
           38|

       … while evaluating the option `driverConfiguration.vlans':

       … while evaluating definitions from `/nix/store/mz7g35d4m7d69sy6vc4iw6r11zp47fi3-source/nixos/lib/testing/driver-configuration.nix':

       … while evaluating the option `nodes.controller.networking.interfaces':

       … while evaluating definitions from `/nix/store/mz7g35d4m7d69sy6vc4iw6r11zp47fi3-source/nixos/modules/hardware/facter/networking':

       … while evaluating the option `nodes.controller.hardware.facter.enable':

       … while evaluating the option `nodes.controller.hardware.facter.report':

       … while evaluating the option `nodes.controller.hardware.facter.reportPath':

       … while evaluating definitions from `/nix/store/hq8q721jlz0mqramvlvyj8lqa0d7nxrk-source/nixosModules/clanCore/nixos-facter.nix':

       (stack trace truncated; use '--show-trace' to show the full, detailed trace)

       error: opening a connection to remote store 'grpc://nix-store.geninf.io:50051' previously failed
failed eval checks.aarch64-linux.zerotier-multi-instance —
error: … while evaluating the attribute 'drvPath' at «https://releases.nixos.org/nixos/26.05/nixos-26.05.10620.f5c082a40f75/nixexprs.tar.xz?narH …
error:
       … while evaluating the attribute 'drvPath'
         at «https://releases.nixos.org/nixos/26.05/nixos-26.05.10620.f5c082a40f75/nixexprs.tar.xz?narHash=sha256-7CLWYUrZU7w6X7y3VBohp2TUhQb0CjiEUbPE6WaOdK4%3D»/lib/customisation.nix:427:7:
          426|     // {
          427|       drvPath =
             |       ^
          428|         assert condition;

       … while calling the 'derivationStrict' builtin
         at «nix-internal»/derivation-internal.nix:37:12:
           36|
           37|   strict = derivationStrict drvAttrs;
             |            ^
           38|

       … while evaluating the option `driverConfiguration.vlans':

       … while evaluating definitions from `/nix/store/mz7g35d4m7d69sy6vc4iw6r11zp47fi3-source/nixos/lib/testing/driver-configuration.nix':

       … while evaluating the option `nodes.alpha.networking.interfaces':

       … while evaluating definitions from `/nix/store/mz7g35d4m7d69sy6vc4iw6r11zp47fi3-source/nixos/modules/hardware/facter/networking':

       … while evaluating the option `nodes.alpha.hardware.facter.enable':

       … while evaluating the option `nodes.alpha.hardware.facter.report':

       … while evaluating the option `nodes.alpha.hardware.facter.reportPath':

       … while evaluating definitions from `/nix/store/hq8q721jlz0mqramvlvyj8lqa0d7nxrk-source/nixosModules/clanCore/nixos-facter.nix':

       (stack trace truncated; use '--show-trace' to show the full, detailed trace)

       error: opening a connection to remote store 'grpc://nix-store.geninf.io:50051' previously failed
failed eval checks.x86_64-linux.admin —
error: … while evaluating the attribute 'drvPath' at «https://releases.nixos.org/nixos/26.05/nixos-26.05.10620.f5c082a40f75/nixexprs.tar.xz?narH …
error:
       … while evaluating the attribute 'drvPath'
         at «https://releases.nixos.org/nixos/26.05/nixos-26.05.10620.f5c082a40f75/nixexprs.tar.xz?narHash=sha256-7CLWYUrZU7w6X7y3VBohp2TUhQb0CjiEUbPE6WaOdK4%3D»/lib/customisation.nix:427:7:
          426|     // {
          427|       drvPath =
             |       ^
          428|         assert condition;

       … while calling the 'derivationStrict' builtin
         at «nix-internal»/derivation-internal.nix:37:12:
           36|
           37|   strict = derivationStrict drvAttrs;
             |            ^
           38|

       … while evaluating the option `nodes.client.networking.interfaces':

       … while evaluating definitions from `/nix/store/mz7g35d4m7d69sy6vc4iw6r11zp47fi3-source/nixos/modules/hardware/facter/networking':

       … while evaluating the option `nodes.client.hardware.facter.enable':

       … while evaluating the option `nodes.client.hardware.facter.report':

       … while evaluating the option `nodes.client.hardware.facter.reportPath':

       … while evaluating definitions from `/nix/store/hq8q721jlz0mqramvlvyj8lqa0d7nxrk-source/nixosModules/clanCore/nixos-facter.nix':

       (stack trace truncated; use '--show-trace' to show the full, detailed trace)

       error: opening a connection to remote store 'grpc://nix-store.geninf.io:50051' previously failed
failed eval checks.x86_64-linux.borgbackup —
error: … while evaluating the attribute 'drvPath' at «https://releases.nixos.org/nixos/26.05/nixos-26.05.10620.f5c082a40f75/nixexprs.tar.xz?narH …
error:
       … while evaluating the attribute 'drvPath'
         at «https://releases.nixos.org/nixos/26.05/nixos-26.05.10620.f5c082a40f75/nixexprs.tar.xz?narHash=sha256-7CLWYUrZU7w6X7y3VBohp2TUhQb0CjiEUbPE6WaOdK4%3D»/lib/customisation.nix:427:7:
          426|     // {
          427|       drvPath =
             |       ^
          428|         assert condition;

       … while calling the 'derivationStrict' builtin
         at «nix-internal»/derivation-internal.nix:37:12:
           36|
           37|   strict = derivationStrict drvAttrs;
             |            ^
           38|

       … while evaluating the option `nodes.clientone.networking.interfaces':

       … while evaluating definitions from `/nix/store/mz7g35d4m7d69sy6vc4iw6r11zp47fi3-source/nixos/modules/hardware/facter/networking':

       … while evaluating the option `nodes.clientone.hardware.facter.enable':

       … while evaluating the option `nodes.clientone.hardware.facter.report':

       … while evaluating the option `nodes.clientone.hardware.facter.reportPath':

       … while evaluating definitions from `/nix/store/hq8q721jlz0mqramvlvyj8lqa0d7nxrk-source/nixosModules/clanCore/nixos-facter.nix':

       (stack trace truncated; use '--show-trace' to show the full, detailed trace)

       error: opening a connection to remote store 'grpc://nix-store.geninf.io:50051' previously failed
failed eval checks.x86_64-linux.certificates —
error: … while evaluating the attribute 'drvPath' at «https://releases.nixos.org/nixos/26.05/nixos-26.05.10620.f5c082a40f75/nixexprs.tar.xz?narH …
error:
       … while evaluating the attribute 'drvPath'
         at «https://releases.nixos.org/nixos/26.05/nixos-26.05.10620.f5c082a40f75/nixexprs.tar.xz?narHash=sha256-7CLWYUrZU7w6X7y3VBohp2TUhQb0CjiEUbPE6WaOdK4%3D»/lib/customisation.nix:427:7:
          426|     // {
          427|       drvPath =
             |       ^
          428|         assert condition;

       … while calling the 'derivationStrict' builtin
         at «nix-internal»/derivation-internal.nix:37:12:
           36|
           37|   strict = derivationStrict drvAttrs;
             |            ^
           38|

       … while evaluating the option `nodes.ca.networking.interfaces':

       … while evaluating definitions from `/nix/store/mz7g35d4m7d69sy6vc4iw6r11zp47fi3-source/nixos/modules/hardware/facter/networking':

       … while evaluating the option `nodes.ca.hardware.facter.enable':

       … while evaluating the option `nodes.ca.hardware.facter.report':

       … while evaluating the option `nodes.ca.hardware.facter.reportPath':

       … while evaluating definitions from `/nix/store/hq8q721jlz0mqramvlvyj8lqa0d7nxrk-source/nixosModules/clanCore/nixos-facter.nix':

       (stack trace truncated; use '--show-trace' to show the full, detailed trace)

       error: opening a connection to remote store 'grpc://nix-store.geninf.io:50051' previously failed
failed checks.x86_64-linux.clan-test-iso 3h 0m
setup: don't know how to build these paths: /nix/store/ag32vzlsiz20yn60r8az0x05619vaf6r-container-test-run-clan-test-iso.drv warning: ignoring the client-spec …
setup:
don't know how to build these paths:
  /nix/store/ag32vzlsiz20yn60r8az0x05619vaf6r-container-test-run-clan-test-iso.drv
warning: ignoring the client-specified setting 'store', because it is a restricted setting and you are not a trusted user
finlfc3d65swhhxy4dhkwla0akyin7yi-etc.drv: gi-build-x86-02: not scheduled here: finlfc3d65swhhxy4dhkwla0akyin7yi-etc.drv, asking the scheduler again
finlfc3d65swhhxy4dhkwla0akyin7yi-etc.drv: build-x86-01: not scheduled here: finlfc3d65swhhxy4dhkwla0akyin7yi-etc.drv, asking the scheduler again
failed eval checks.x86_64-linux.clan-test-update —
error: … while evaluating the attribute 'drvPath' at «https://releases.nixos.org/nixos/26.05/nixos-26.05.10620.f5c082a40f75/nixexprs.tar.xz?narH …
error:
       … while evaluating the attribute 'drvPath'
         at «https://releases.nixos.org/nixos/26.05/nixos-26.05.10620.f5c082a40f75/nixexprs.tar.xz?narHash=sha256-7CLWYUrZU7w6X7y3VBohp2TUhQb0CjiEUbPE6WaOdK4%3D»/lib/customisation.nix:427:7:
          426|     // {
          427|       drvPath =
             |       ^
          428|         assert condition;

       … while calling the 'derivationStrict' builtin
         at «nix-internal»/derivation-internal.nix:37:12:
           36|
           37|   strict = derivationStrict drvAttrs;
             |            ^
           38|

       … while evaluating the option `nodes.test-update-machine.networking.interfaces':

       … while evaluating definitions from `/nix/store/mz7g35d4m7d69sy6vc4iw6r11zp47fi3-source/nixos/modules/hardware/facter/networking':

       … while evaluating the option `nodes.test-update-machine.hardware.facter.enable':

       … while evaluating the option `nodes.test-update-machine.hardware.facter.report':

       … while evaluating the option `nodes.test-update-machine.hardware.facter.reportPath':

       … while evaluating definitions from `/nix/store/hq8q721jlz0mqramvlvyj8lqa0d7nxrk-source/nixosModules/clanCore/nixos-facter.nix':

       (stack trace truncated; use '--show-trace' to show the full, detailed trace)

       error: opening a connection to remote store 'grpc://nix-store.geninf.io:50051' previously failed
failed checks.x86_64-linux.darwin-test-darwin-machine 3h 0m
setup: don't know how to build these paths: /nix/store/bf6dh1sx0vlcqs2rznp5ggd579mdy4gj-darwin-system-26.05.c3e90c8.drv warning: ignoring the client-specified …
setup:
don't know how to build these paths:
  /nix/store/bf6dh1sx0vlcqs2rznp5ggd579mdy4gj-darwin-system-26.05.c3e90c8.drv
warning: ignoring the client-specified setting 'store', because it is a restricted setting and you are not a trusted user
failed eval checks.x86_64-linux.data-mesher —
error: … while evaluating the attribute 'drvPath' at «https://releases.nixos.org/nixos/26.05/nixos-26.05.10620.f5c082a40f75/nixexprs.tar.xz?narH …
error:
       … while evaluating the attribute 'drvPath'
         at «https://releases.nixos.org/nixos/26.05/nixos-26.05.10620.f5c082a40f75/nixexprs.tar.xz?narHash=sha256-7CLWYUrZU7w6X7y3VBohp2TUhQb0CjiEUbPE6WaOdK4%3D»/lib/customisation.nix:427:7:
          426|     // {
          427|       drvPath =
             |       ^
          428|         assert condition;

       … while calling the 'derivationStrict' builtin
         at «nix-internal»/derivation-internal.nix:37:12:
           36|
           37|   strict = derivationStrict drvAttrs;
             |            ^
           38|

       … while evaluating the option `nodes.alpha.networking.interfaces':

       … while evaluating definitions from `/nix/store/mz7g35d4m7d69sy6vc4iw6r11zp47fi3-source/nixos/modules/hardware/facter/networking':

       … while evaluating the option `nodes.alpha.hardware.facter.enable':

       … while evaluating the option `nodes.alpha.hardware.facter.report':

       … while evaluating the option `nodes.alpha.hardware.facter.reportPath':

       … while evaluating definitions from `/nix/store/hq8q721jlz0mqramvlvyj8lqa0d7nxrk-source/nixosModules/clanCore/nixos-facter.nix':

       (stack trace truncated; use '--show-trace' to show the full, detailed trace)

       error: opening a connection to remote store 'grpc://nix-store.geninf.io:50051' previously failed
failed eval checks.x86_64-linux.dm-dns —
error: … while evaluating the attribute 'drvPath' at «https://releases.nixos.org/nixos/26.05/nixos-26.05.10620.f5c082a40f75/nixexprs.tar.xz?narH …
error:
       … while evaluating the attribute 'drvPath'
         at «https://releases.nixos.org/nixos/26.05/nixos-26.05.10620.f5c082a40f75/nixexprs.tar.xz?narHash=sha256-7CLWYUrZU7w6X7y3VBohp2TUhQb0CjiEUbPE6WaOdK4%3D»/lib/customisation.nix:427:7:
          426|     // {
          427|       drvPath =
             |       ^
          428|         assert condition;

       … while calling the 'derivationStrict' builtin
         at «nix-internal»/derivation-internal.nix:37:12:
           36|
           37|   strict = derivationStrict drvAttrs;
             |            ^
           38|

       … while evaluating the option `nodes.client.networking.interfaces':

       … while evaluating definitions from `/nix/store/mz7g35d4m7d69sy6vc4iw6r11zp47fi3-source/nixos/modules/hardware/facter/networking':

       … while evaluating the option `nodes.client.hardware.facter.enable':

       … while evaluating the option `nodes.client.hardware.facter.report':

       … while evaluating the option `nodes.client.hardware.facter.reportPath':

       … while evaluating definitions from `/nix/store/hq8q721jlz0mqramvlvyj8lqa0d7nxrk-source/nixosModules/clanCore/nixos-facter.nix':

       (stack trace truncated; use '--show-trace' to show the full, detailed trace)

       error: cannot open connection to remote store 'grpc://nix-store.geninf.io:50051': error: Nix daemon disconnected unexpectedly (maybe it crashed?)
failed eval checks.x86_64-linux.dyndns —
error: … while evaluating the attribute 'drvPath' at «https://releases.nixos.org/nixos/26.05/nixos-26.05.10620.f5c082a40f75/nixexprs.tar.xz?narH …
error:
       … while evaluating the attribute 'drvPath'
         at «https://releases.nixos.org/nixos/26.05/nixos-26.05.10620.f5c082a40f75/nixexprs.tar.xz?narHash=sha256-7CLWYUrZU7w6X7y3VBohp2TUhQb0CjiEUbPE6WaOdK4%3D»/lib/customisation.nix:427:7:
          426|     // {
          427|       drvPath =
             |       ^
          428|         assert condition;

       … while calling the 'derivationStrict' builtin
         at «nix-internal»/derivation-internal.nix:37:12:
           36|
           37|   strict = derivationStrict drvAttrs;
             |            ^
           38|

       … while evaluating the option `nodes.server.networking.interfaces':

       … while evaluating definitions from `/nix/store/mz7g35d4m7d69sy6vc4iw6r11zp47fi3-source/nixos/modules/hardware/facter/networking':

       … while evaluating the option `nodes.server.hardware.facter.enable':

       … while evaluating the option `nodes.server.hardware.facter.report':

       … while evaluating the option `nodes.server.hardware.facter.reportPath':

       … while evaluating definitions from `/nix/store/hq8q721jlz0mqramvlvyj8lqa0d7nxrk-source/nixosModules/clanCore/nixos-facter.nix':

       (stack trace truncated; use '--show-trace' to show the full, detailed trace)

       error: opening a connection to remote store 'grpc://nix-store.geninf.io:50051' previously failed
failed eval checks.x86_64-linux.garage —
error: … while evaluating the attribute 'drvPath' at «https://releases.nixos.org/nixos/26.05/nixos-26.05.10620.f5c082a40f75/nixexprs.tar.xz?narH …
error:
       … while evaluating the attribute 'drvPath'
         at «https://releases.nixos.org/nixos/26.05/nixos-26.05.10620.f5c082a40f75/nixexprs.tar.xz?narHash=sha256-7CLWYUrZU7w6X7y3VBohp2TUhQb0CjiEUbPE6WaOdK4%3D»/lib/customisation.nix:427:7:
          426|     // {
          427|       drvPath =
             |       ^
          428|         assert condition;

       … while calling the 'derivationStrict' builtin
         at «nix-internal»/derivation-internal.nix:37:12:
           36|
           37|   strict = derivationStrict drvAttrs;
             |            ^
           38|

       … while evaluating the option `nodes.server.networking.interfaces':

       … while evaluating definitions from `/nix/store/mz7g35d4m7d69sy6vc4iw6r11zp47fi3-source/nixos/modules/hardware/facter/networking':

       … while evaluating the option `nodes.server.hardware.facter.enable':

       … while evaluating the option `nodes.server.hardware.facter.report':

       … while evaluating the option `nodes.server.hardware.facter.reportPath':

       … while evaluating definitions from `/nix/store/hq8q721jlz0mqramvlvyj8lqa0d7nxrk-source/nixosModules/clanCore/nixos-facter.nix':

       (stack trace truncated; use '--show-trace' to show the full, detailed trace)

       error: opening a connection to remote store 'grpc://nix-store.geninf.io:50051' previously failed
failed eval checks.x86_64-linux.hello-service —
error: … while evaluating the attribute 'drvPath' at «https://releases.nixos.org/nixos/26.05/nixos-26.05.10620.f5c082a40f75/nixexprs.tar.xz?narH …
error:
       … while evaluating the attribute 'drvPath'
         at «https://releases.nixos.org/nixos/26.05/nixos-26.05.10620.f5c082a40f75/nixexprs.tar.xz?narHash=sha256-7CLWYUrZU7w6X7y3VBohp2TUhQb0CjiEUbPE6WaOdK4%3D»/lib/customisation.nix:427:7:
          426|     // {
          427|       drvPath =
             |       ^
          428|         assert condition;

       … while calling the 'derivationStrict' builtin
         at «nix-internal»/derivation-internal.nix:37:12:
           36|
           37|   strict = derivationStrict drvAttrs;
             |            ^
           38|

       … while evaluating the option `nodes.peer1.networking.interfaces':

       … while evaluating definitions from `/nix/store/mz7g35d4m7d69sy6vc4iw6r11zp47fi3-source/nixos/modules/hardware/facter/networking':

       … while evaluating the option `nodes.peer1.hardware.facter.enable':

       … while evaluating the option `nodes.peer1.hardware.facter.report':

       … while evaluating the option `nodes.peer1.hardware.facter.reportPath':

       … while evaluating definitions from `/nix/store/hq8q721jlz0mqramvlvyj8lqa0d7nxrk-source/nixosModules/clanCore/nixos-facter.nix':

       (stack trace truncated; use '--show-trace' to show the full, detailed trace)

       error: opening a connection to remote store 'grpc://nix-store.geninf.io:50051' previously failed
failed eval checks.x86_64-linux.kde —
error: … while evaluating the attribute 'drvPath' at «https://releases.nixos.org/nixos/26.05/nixos-26.05.10620.f5c082a40f75/nixexprs.tar.xz?narH …
error:
       … while evaluating the attribute 'drvPath'
         at «https://releases.nixos.org/nixos/26.05/nixos-26.05.10620.f5c082a40f75/nixexprs.tar.xz?narHash=sha256-7CLWYUrZU7w6X7y3VBohp2TUhQb0CjiEUbPE6WaOdK4%3D»/lib/customisation.nix:427:7:
          426|     // {
          427|       drvPath =
             |       ^
          428|         assert condition;

       … while calling the 'derivationStrict' builtin
         at «nix-internal»/derivation-internal.nix:37:12:
           36|
           37|   strict = derivationStrict drvAttrs;
             |            ^
           38|

       … while evaluating the option `nodes.client.networking.interfaces':

       … while evaluating definitions from `/nix/store/mz7g35d4m7d69sy6vc4iw6r11zp47fi3-source/nixos/modules/hardware/facter/networking':

       … while evaluating the option `nodes.client.hardware.facter.enable':

       … while evaluating the option `nodes.client.hardware.facter.report':

       … while evaluating the option `nodes.client.hardware.facter.reportPath':

       … while evaluating definitions from `/nix/store/hq8q721jlz0mqramvlvyj8lqa0d7nxrk-source/nixosModules/clanCore/nixos-facter.nix':

       (stack trace truncated; use '--show-trace' to show the full, detailed trace)

       error: cannot open connection to remote store 'grpc://nix-store.geninf.io:50051': error: Nix daemon disconnected unexpectedly (maybe it crashed?)
failed eval checks.x86_64-linux.localbackup —
error: … while evaluating the attribute 'drvPath' at «https://releases.nixos.org/nixos/26.05/nixos-26.05.10620.f5c082a40f75/nixexprs.tar.xz?narH …
error:
       … while evaluating the attribute 'drvPath'
         at «https://releases.nixos.org/nixos/26.05/nixos-26.05.10620.f5c082a40f75/nixexprs.tar.xz?narHash=sha256-7CLWYUrZU7w6X7y3VBohp2TUhQb0CjiEUbPE6WaOdK4%3D»/lib/customisation.nix:427:7:
          426|     // {
          427|       drvPath =
             |       ^
          428|         assert condition;

       … while calling the 'derivationStrict' builtin
         at «nix-internal»/derivation-internal.nix:37:12:
           36|
           37|   strict = derivationStrict drvAttrs;
             |            ^
           38|

       … while evaluating the option `nodes.machine.networking.interfaces':

       … while evaluating definitions from `/nix/store/mz7g35d4m7d69sy6vc4iw6r11zp47fi3-source/nixos/modules/hardware/facter/networking':

       … while evaluating the option `nodes.machine.hardware.facter.enable':

       … while evaluating the option `nodes.machine.hardware.facter.report':

       … while evaluating the option `nodes.machine.hardware.facter.reportPath':

       … while evaluating definitions from `/nix/store/hq8q721jlz0mqramvlvyj8lqa0d7nxrk-source/nixosModules/clanCore/nixos-facter.nix':

       (stack trace truncated; use '--show-trace' to show the full, detailed trace)

       error: opening a connection to remote store 'grpc://nix-store.geninf.io:50051' previously failed
failed eval checks.x86_64-linux.machine-id —
error: … while evaluating the attribute 'drvPath' at «https://releases.nixos.org/nixos/26.05/nixos-26.05.10620.f5c082a40f75/nixexprs.tar.xz?narH …
error:
       … while evaluating the attribute 'drvPath'
         at «https://releases.nixos.org/nixos/26.05/nixos-26.05.10620.f5c082a40f75/nixexprs.tar.xz?narHash=sha256-7CLWYUrZU7w6X7y3VBohp2TUhQb0CjiEUbPE6WaOdK4%3D»/lib/customisation.nix:427:7:
          426|     // {
          427|       drvPath =
             |       ^
          428|         assert condition;

       … while calling the 'derivationStrict' builtin
         at «nix-internal»/derivation-internal.nix:37:12:
           36|
           37|   strict = derivationStrict drvAttrs;
             |            ^
           38|

       … while evaluating the option `nodes.server.networking.interfaces':

       … while evaluating definitions from `/nix/store/mz7g35d4m7d69sy6vc4iw6r11zp47fi3-source/nixos/modules/hardware/facter/networking':

       … while evaluating the option `nodes.server.hardware.facter.enable':

       … while evaluating the option `nodes.server.hardware.facter.report':

       … while evaluating the option `nodes.server.hardware.facter.reportPath':

       … while evaluating definitions from `/nix/store/hq8q721jlz0mqramvlvyj8lqa0d7nxrk-source/nixosModules/clanCore/nixos-facter.nix':

       (stack trace truncated; use '--show-trace' to show the full, detailed trace)

       error: opening a connection to remote store 'grpc://nix-store.geninf.io:50051' previously failed
failed eval checks.x86_64-linux.matrix-synapse —
error: … while evaluating the attribute 'drvPath' at «https://releases.nixos.org/nixos/26.05/nixos-26.05.10620.f5c082a40f75/nixexprs.tar.xz?narH …
error:
       … while evaluating the attribute 'drvPath'
         at «https://releases.nixos.org/nixos/26.05/nixos-26.05.10620.f5c082a40f75/nixexprs.tar.xz?narHash=sha256-7CLWYUrZU7w6X7y3VBohp2TUhQb0CjiEUbPE6WaOdK4%3D»/lib/customisation.nix:427:7:
          426|     // {
          427|       drvPath =
             |       ^
          428|         assert condition;

       … while calling the 'derivationStrict' builtin
         at «nix-internal»/derivation-internal.nix:37:12:
           36|
           37|   strict = derivationStrict drvAttrs;
             |            ^
           38|

       … while evaluating the option `nodes.machine.networking.interfaces':

       … while evaluating definitions from `/nix/store/mz7g35d4m7d69sy6vc4iw6r11zp47fi3-source/nixos/modules/hardware/facter/networking':

       … while evaluating the option `nodes.machine.hardware.facter.enable':

       … while evaluating the option `nodes.machine.hardware.facter.report':

       … while evaluating the option `nodes.machine.hardware.facter.reportPath':

       … while evaluating definitions from `/nix/store/hq8q721jlz0mqramvlvyj8lqa0d7nxrk-source/nixosModules/clanCore/nixos-facter.nix':

       (stack trace truncated; use '--show-trace' to show the full, detailed trace)

       error: opening a connection to remote store 'grpc://nix-store.geninf.io:50051' previously failed
failed eval checks.x86_64-linux.monitoring —
error: … while evaluating the attribute 'drvPath' at «https://releases.nixos.org/nixos/26.05/nixos-26.05.10620.f5c082a40f75/nixexprs.tar.xz?narH …
error:
       … while evaluating the attribute 'drvPath'
         at «https://releases.nixos.org/nixos/26.05/nixos-26.05.10620.f5c082a40f75/nixexprs.tar.xz?narHash=sha256-7CLWYUrZU7w6X7y3VBohp2TUhQb0CjiEUbPE6WaOdK4%3D»/lib/customisation.nix:427:7:
          426|     // {
          427|       drvPath =
             |       ^
          428|         assert condition;

       … while calling the 'derivationStrict' builtin
         at «nix-internal»/derivation-internal.nix:37:12:
           36|
           37|   strict = derivationStrict drvAttrs;
             |            ^
           38|

       … while evaluating the option `nodes.machine1.networking.interfaces':

       … while evaluating definitions from `/nix/store/mz7g35d4m7d69sy6vc4iw6r11zp47fi3-source/nixos/modules/hardware/facter/networking':

       … while evaluating the option `nodes.machine1.hardware.facter.enable':

       … while evaluating the option `nodes.machine1.hardware.facter.report':

       … while evaluating the option `nodes.machine1.hardware.facter.reportPath':

       … while evaluating definitions from `/nix/store/hq8q721jlz0mqramvlvyj8lqa0d7nxrk-source/nixosModules/clanCore/nixos-facter.nix':

       (stack trace truncated; use '--show-trace' to show the full, detailed trace)

       error: opening a connection to remote store 'grpc://nix-store.geninf.io:50051' previously failed
failed eval checks.x86_64-linux.mycelium —
error: … while evaluating the attribute 'drvPath' at «https://releases.nixos.org/nixos/26.05/nixos-26.05.10620.f5c082a40f75/nixexprs.tar.xz?narH …
error:
       … while evaluating the attribute 'drvPath'
         at «https://releases.nixos.org/nixos/26.05/nixos-26.05.10620.f5c082a40f75/nixexprs.tar.xz?narHash=sha256-7CLWYUrZU7w6X7y3VBohp2TUhQb0CjiEUbPE6WaOdK4%3D»/lib/customisation.nix:427:7:
          426|     // {
          427|       drvPath =
             |       ^
          428|         assert condition;

       … while calling the 'derivationStrict' builtin
         at «nix-internal»/derivation-internal.nix:37:12:
           36|
           37|   strict = derivationStrict drvAttrs;
             |            ^
           38|

       … while evaluating the option `driverConfiguration.vlans':

       … while evaluating definitions from `/nix/store/mz7g35d4m7d69sy6vc4iw6r11zp47fi3-source/nixos/lib/testing/driver-configuration.nix':

       … while evaluating the option `nodes.server.networking.interfaces':

       … while evaluating definitions from `/nix/store/mz7g35d4m7d69sy6vc4iw6r11zp47fi3-source/nixos/modules/hardware/facter/networking':

       … while evaluating the option `nodes.server.hardware.facter.enable':

       … while evaluating the option `nodes.server.hardware.facter.report':

       … while evaluating the option `nodes.server.hardware.facter.reportPath':

       … while evaluating definitions from `/nix/store/hq8q721jlz0mqramvlvyj8lqa0d7nxrk-source/nixosModules/clanCore/nixos-facter.nix':

       (stack trace truncated; use '--show-trace' to show the full, detailed trace)

       error: cannot open connection to remote store 'grpc://nix-store.geninf.io:50051': error: Nix daemon disconnected unexpectedly (maybe it crashed?)
failed eval checks.x86_64-linux.ncps —
error: … while evaluating the attribute 'drvPath' at «https://releases.nixos.org/nixos/26.05/nixos-26.05.10620.f5c082a40f75/nixexprs.tar.xz?narH …
error:
       … while evaluating the attribute 'drvPath'
         at «https://releases.nixos.org/nixos/26.05/nixos-26.05.10620.f5c082a40f75/nixexprs.tar.xz?narHash=sha256-7CLWYUrZU7w6X7y3VBohp2TUhQb0CjiEUbPE6WaOdK4%3D»/lib/customisation.nix:427:7:
          426|     // {
          427|       drvPath =
             |       ^
          428|         assert condition;

       … while calling the 'derivationStrict' builtin
         at «nix-internal»/derivation-internal.nix:37:12:
           36|
           37|   strict = derivationStrict drvAttrs;
             |            ^
           38|

       … while evaluating the option `nodes.alice.networking.interfaces':

       … while evaluating definitions from `/nix/store/mz7g35d4m7d69sy6vc4iw6r11zp47fi3-source/nixos/modules/hardware/facter/networking':

       … while evaluating the option `nodes.alice.hardware.facter.enable':

       … while evaluating the option `nodes.alice.hardware.facter.report':

       … while evaluating the option `nodes.alice.hardware.facter.reportPath':

       … while evaluating definitions from `/nix/store/hq8q721jlz0mqramvlvyj8lqa0d7nxrk-source/nixosModules/clanCore/nixos-facter.nix':

       (stack trace truncated; use '--show-trace' to show the full, detailed trace)

       error: opening a connection to remote store 'grpc://nix-store.geninf.io:50051' previously failed
failed eval checks.x86_64-linux.nixos-test-password-store-mounts —
error: … while evaluating the attribute 'drvPath' at «https://releases.nixos.org/nixos/26.05/nixos-26.05.10620.f5c082a40f75/nixexprs.tar.xz?narH …
error:
       … while evaluating the attribute 'drvPath'
         at «https://releases.nixos.org/nixos/26.05/nixos-26.05.10620.f5c082a40f75/nixexprs.tar.xz?narHash=sha256-7CLWYUrZU7w6X7y3VBohp2TUhQb0CjiEUbPE6WaOdK4%3D»/lib/customisation.nix:427:7:
          426|     // {
          427|       drvPath =
             |       ^
          428|         assert condition;

       … while calling the 'derivationStrict' builtin
         at «nix-internal»/derivation-internal.nix:37:12:
           36|
           37|   strict = derivationStrict drvAttrs;
             |            ^
           38|

       … while evaluating the option `driverConfiguration.vlans':

       … while evaluating definitions from `/nix/store/mz7g35d4m7d69sy6vc4iw6r11zp47fi3-source/nixos/lib/testing/driver-configuration.nix':

       … while evaluating the option `nodes.machine.networking.interfaces':

       … while evaluating definitions from `/nix/store/mz7g35d4m7d69sy6vc4iw6r11zp47fi3-source/nixos/modules/hardware/facter/networking':

       … while evaluating the option `nodes.machine.hardware.facter.enable':

       … while evaluating the option `nodes.machine.hardware.facter.report':

       … while evaluating the option `nodes.machine.hardware.facter.reportPath':

       … while evaluating definitions from `/nix/store/hq8q721jlz0mqramvlvyj8lqa0d7nxrk-source/nixosModules/clanCore/nixos-facter.nix':

       (stack trace truncated; use '--show-trace' to show the full, detailed trace)

       error: opening a connection to remote store 'grpc://nix-store.geninf.io:50051' previously failed
failed eval checks.x86_64-linux.p2p-ssh-iroh —
error: … while evaluating the attribute 'drvPath' at «https://releases.nixos.org/nixos/26.05/nixos-26.05.10620.f5c082a40f75/nixexprs.tar.xz?narH …
error:
       … while evaluating the attribute 'drvPath'
         at «https://releases.nixos.org/nixos/26.05/nixos-26.05.10620.f5c082a40f75/nixexprs.tar.xz?narHash=sha256-7CLWYUrZU7w6X7y3VBohp2TUhQb0CjiEUbPE6WaOdK4%3D»/lib/customisation.nix:427:7:
          426|     // {
          427|       drvPath =
             |       ^
          428|         assert condition;

       … while calling the 'derivationStrict' builtin
         at «nix-internal»/derivation-internal.nix:37:12:
           36|
           37|   strict = derivationStrict drvAttrs;
             |            ^
           38|

       … while evaluating the option `nodes.client.networking.interfaces':

       … while evaluating definitions from `/nix/store/mz7g35d4m7d69sy6vc4iw6r11zp47fi3-source/nixos/modules/hardware/facter/networking':

       … while evaluating the option `nodes.client.hardware.facter.enable':

       … while evaluating the option `nodes.client.hardware.facter.report':

       … while evaluating the option `nodes.client.hardware.facter.reportPath':

       … while evaluating definitions from `/nix/store/hq8q721jlz0mqramvlvyj8lqa0d7nxrk-source/nixosModules/clanCore/nixos-facter.nix':

       (stack trace truncated; use '--show-trace' to show the full, detailed trace)

       error: opening a connection to remote store 'grpc://nix-store.geninf.io:50051' previously failed
failed eval checks.x86_64-linux.packages —
error: … while evaluating the attribute 'drvPath' at «https://releases.nixos.org/nixos/26.05/nixos-26.05.10620.f5c082a40f75/nixexprs.tar.xz?narH …
error:
       … while evaluating the attribute 'drvPath'
         at «https://releases.nixos.org/nixos/26.05/nixos-26.05.10620.f5c082a40f75/nixexprs.tar.xz?narHash=sha256-7CLWYUrZU7w6X7y3VBohp2TUhQb0CjiEUbPE6WaOdK4%3D»/lib/customisation.nix:427:7:
          426|     // {
          427|       drvPath =
             |       ^
          428|         assert condition;

       … while calling the 'derivationStrict' builtin
         at «nix-internal»/derivation-internal.nix:37:12:
           36|
           37|   strict = derivationStrict drvAttrs;
             |            ^
           38|

       … while evaluating the option `nodes.server.networking.interfaces':

       … while evaluating definitions from `/nix/store/mz7g35d4m7d69sy6vc4iw6r11zp47fi3-source/nixos/modules/hardware/facter/networking':

       … while evaluating the option `nodes.server.hardware.facter.enable':

       … while evaluating the option `nodes.server.hardware.facter.report':

       … while evaluating the option `nodes.server.hardware.facter.reportPath':

       … while evaluating definitions from `/nix/store/hq8q721jlz0mqramvlvyj8lqa0d7nxrk-source/nixosModules/clanCore/nixos-facter.nix':

       (stack trace truncated; use '--show-trace' to show the full, detailed trace)

       error: cannot open connection to remote store 'grpc://nix-store.geninf.io:50051': error: Nix daemon disconnected unexpectedly (maybe it crashed?)
failed eval checks.x86_64-linux.pki —
error: … while evaluating the attribute 'drvPath' at «https://releases.nixos.org/nixos/26.05/nixos-26.05.10620.f5c082a40f75/nixexprs.tar.xz?narH …
error:
       … while evaluating the attribute 'drvPath'
         at «https://releases.nixos.org/nixos/26.05/nixos-26.05.10620.f5c082a40f75/nixexprs.tar.xz?narHash=sha256-7CLWYUrZU7w6X7y3VBohp2TUhQb0CjiEUbPE6WaOdK4%3D»/lib/customisation.nix:427:7:
          426|     // {
          427|       drvPath =
             |       ^
          428|         assert condition;

       … while calling the 'derivationStrict' builtin
         at «nix-internal»/derivation-internal.nix:37:12:
           36|
           37|   strict = derivationStrict drvAttrs;
             |            ^
           38|

       … while evaluating the option `driverConfiguration.vlans':

       … while evaluating definitions from `/nix/store/mz7g35d4m7d69sy6vc4iw6r11zp47fi3-source/nixos/lib/testing/driver-configuration.nix':

       … while evaluating the option `nodes.caddy.networking.interfaces':

       … while evaluating definitions from `/nix/store/mz7g35d4m7d69sy6vc4iw6r11zp47fi3-source/nixos/modules/hardware/facter/networking':

       … while evaluating the option `nodes.caddy.hardware.facter.enable':

       … while evaluating the option `nodes.caddy.hardware.facter.report':

       … while evaluating the option `nodes.caddy.hardware.facter.reportPath':

       … while evaluating definitions from `/nix/store/hq8q721jlz0mqramvlvyj8lqa0d7nxrk-source/nixosModules/clanCore/nixos-facter.nix':

       (stack trace truncated; use '--show-trace' to show the full, detailed trace)

       error: cannot open connection to remote store 'grpc://nix-store.geninf.io:50051': error: Nix daemon disconnected unexpectedly (maybe it crashed?)
failed eval checks.x86_64-linux.postgresql —
error: … while evaluating the attribute 'drvPath' at «https://releases.nixos.org/nixos/26.05/nixos-26.05.10620.f5c082a40f75/nixexprs.tar.xz?narH …
error:
       … while evaluating the attribute 'drvPath'
         at «https://releases.nixos.org/nixos/26.05/nixos-26.05.10620.f5c082a40f75/nixexprs.tar.xz?narHash=sha256-7CLWYUrZU7w6X7y3VBohp2TUhQb0CjiEUbPE6WaOdK4%3D»/lib/customisation.nix:427:7:
          426|     // {
          427|       drvPath =
             |       ^
          428|         assert condition;

       … while calling the 'derivationStrict' builtin
         at «nix-internal»/derivation-internal.nix:37:12:
           36|
           37|   strict = derivationStrict drvAttrs;
             |            ^
           38|

       … while evaluating the option `nodes.machine.networking.interfaces':

       … while evaluating definitions from `/nix/store/mz7g35d4m7d69sy6vc4iw6r11zp47fi3-source/nixos/modules/hardware/facter/networking':

       … while evaluating the option `nodes.machine.hardware.facter.enable':

       … while evaluating the option `nodes.machine.hardware.facter.report':

       … while evaluating the option `nodes.machine.hardware.facter.reportPath':

       … while evaluating definitions from `/nix/store/hq8q721jlz0mqramvlvyj8lqa0d7nxrk-source/nixosModules/clanCore/nixos-facter.nix':

       (stack trace truncated; use '--show-trace' to show the full, detailed trace)

       error: cannot open connection to remote store 'grpc://nix-store.geninf.io:50051': error: Nix daemon disconnected unexpectedly (maybe it crashed?)
failed eval checks.x86_64-linux.service-dummy-test —
error: … while evaluating the attribute 'drvPath' at «https://releases.nixos.org/nixos/26.05/nixos-26.05.10620.f5c082a40f75/nixexprs.tar.xz?narH …
error:
       … while evaluating the attribute 'drvPath'
         at «https://releases.nixos.org/nixos/26.05/nixos-26.05.10620.f5c082a40f75/nixexprs.tar.xz?narHash=sha256-7CLWYUrZU7w6X7y3VBohp2TUhQb0CjiEUbPE6WaOdK4%3D»/lib/customisation.nix:427:7:
          426|     // {
          427|       drvPath =
             |       ^
          428|         assert condition;

       … while calling the 'derivationStrict' builtin
         at «nix-internal»/derivation-internal.nix:37:12:
           36|
           37|   strict = derivationStrict drvAttrs;
             |            ^
           38|

       … while evaluating the option `nodes.admin1.networking.interfaces':

       … while evaluating definitions from `/nix/store/mz7g35d4m7d69sy6vc4iw6r11zp47fi3-source/nixos/modules/hardware/facter/networking':

       … while evaluating the option `nodes.admin1.hardware.facter.enable':

       … while evaluating the option `nodes.admin1.hardware.facter.report':

       … while evaluating the option `nodes.admin1.hardware.facter.reportPath':

       … while evaluating definitions from `/nix/store/hq8q721jlz0mqramvlvyj8lqa0d7nxrk-source/nixosModules/clanCore/nixos-facter.nix':

       (stack trace truncated; use '--show-trace' to show the full, detailed trace)

       error: opening a connection to remote store 'grpc://nix-store.geninf.io:50051' previously failed
failed eval checks.x86_64-linux.service-dummy-test-from-flake —
error: … while evaluating the attribute 'drvPath' at «https://releases.nixos.org/nixos/26.05/nixos-26.05.10620.f5c082a40f75/nixexprs.tar.xz?narH …
error:
       … while evaluating the attribute 'drvPath'
         at «https://releases.nixos.org/nixos/26.05/nixos-26.05.10620.f5c082a40f75/nixexprs.tar.xz?narHash=sha256-7CLWYUrZU7w6X7y3VBohp2TUhQb0CjiEUbPE6WaOdK4%3D»/lib/customisation.nix:427:7:
          426|     // {
          427|       drvPath =
             |       ^
          428|         assert condition;

       … while calling the 'derivationStrict' builtin
         at «nix-internal»/derivation-internal.nix:37:12:
           36|
           37|   strict = derivationStrict drvAttrs;
             |            ^
           38|

       … while evaluating the option `nodes.admin1.networking.interfaces':

       … while evaluating definitions from `/nix/store/mz7g35d4m7d69sy6vc4iw6r11zp47fi3-source/nixos/modules/hardware/facter/networking':

       … while evaluating the option `nodes.admin1.hardware.facter.enable':

       … while evaluating the option `nodes.admin1.hardware.facter.report':

       … while evaluating the option `nodes.admin1.hardware.facter.reportPath':

       … while evaluating definitions from `/nix/store/hq8q721jlz0mqramvlvyj8lqa0d7nxrk-source/nixosModules/clanCore/nixos-facter.nix':

       (stack trace truncated; use '--show-trace' to show the full, detailed trace)

       error: opening a connection to remote store 'grpc://nix-store.geninf.io:50051' previously failed
failed eval checks.x86_64-linux.sshd —
error: … while evaluating the attribute 'drvPath' at «https://releases.nixos.org/nixos/26.05/nixos-26.05.10620.f5c082a40f75/nixexprs.tar.xz?narH …
error:
       … while evaluating the attribute 'drvPath'
         at «https://releases.nixos.org/nixos/26.05/nixos-26.05.10620.f5c082a40f75/nixexprs.tar.xz?narHash=sha256-7CLWYUrZU7w6X7y3VBohp2TUhQb0CjiEUbPE6WaOdK4%3D»/lib/customisation.nix:427:7:
          426|     // {
          427|       drvPath =
             |       ^
          428|         assert condition;

       … while calling the 'derivationStrict' builtin
         at «nix-internal»/derivation-internal.nix:37:12:
           36|
           37|   strict = derivationStrict drvAttrs;
             |            ^
           38|

       … while evaluating the option `nodes.client.networking.interfaces':

       … while evaluating definitions from `/nix/store/mz7g35d4m7d69sy6vc4iw6r11zp47fi3-source/nixos/modules/hardware/facter/networking':

       … while evaluating the option `nodes.client.hardware.facter.enable':

       … while evaluating the option `nodes.client.hardware.facter.report':

       … while evaluating the option `nodes.client.hardware.facter.reportPath':

       … while evaluating definitions from `/nix/store/hq8q721jlz0mqramvlvyj8lqa0d7nxrk-source/nixosModules/clanCore/nixos-facter.nix':

       (stack trace truncated; use '--show-trace' to show the full, detailed trace)

       error: opening a connection to remote store 'grpc://nix-store.geninf.io:50051' previously failed
failed eval checks.x86_64-linux.sshd-no-ca —
error: … while evaluating the attribute 'drvPath' at «https://releases.nixos.org/nixos/26.05/nixos-26.05.10620.f5c082a40f75/nixexprs.tar.xz?narH …
error:
       … while evaluating the attribute 'drvPath'
         at «https://releases.nixos.org/nixos/26.05/nixos-26.05.10620.f5c082a40f75/nixexprs.tar.xz?narHash=sha256-7CLWYUrZU7w6X7y3VBohp2TUhQb0CjiEUbPE6WaOdK4%3D»/lib/customisation.nix:427:7:
          426|     // {
          427|       drvPath =
             |       ^
          428|         assert condition;

       … while calling the 'derivationStrict' builtin
         at «nix-internal»/derivation-internal.nix:37:12:
           36|
           37|   strict = derivationStrict drvAttrs;
             |            ^
           38|

       … while evaluating the option `nodes.client.networking.interfaces':

       … while evaluating definitions from `/nix/store/mz7g35d4m7d69sy6vc4iw6r11zp47fi3-source/nixos/modules/hardware/facter/networking':

       … while evaluating the option `nodes.client.hardware.facter.enable':

       … while evaluating the option `nodes.client.hardware.facter.report':

       … while evaluating the option `nodes.client.hardware.facter.reportPath':

       … while evaluating definitions from `/nix/store/hq8q721jlz0mqramvlvyj8lqa0d7nxrk-source/nixosModules/clanCore/nixos-facter.nix':

       (stack trace truncated; use '--show-trace' to show the full, detailed trace)

       error: cannot open connection to remote store 'grpc://nix-store.geninf.io:50051': error: Nix daemon disconnected unexpectedly (maybe it crashed?)
failed eval checks.x86_64-linux.state-version —
error: … while evaluating the attribute 'drvPath' at «https://releases.nixos.org/nixos/26.05/nixos-26.05.10620.f5c082a40f75/nixexprs.tar.xz?narH …
error:
       … while evaluating the attribute 'drvPath'
         at «https://releases.nixos.org/nixos/26.05/nixos-26.05.10620.f5c082a40f75/nixexprs.tar.xz?narHash=sha256-7CLWYUrZU7w6X7y3VBohp2TUhQb0CjiEUbPE6WaOdK4%3D»/lib/customisation.nix:427:7:
          426|     // {
          427|       drvPath =
             |       ^
          428|         assert condition;

       … while calling the 'derivationStrict' builtin
         at «nix-internal»/derivation-internal.nix:37:12:
           36|
           37|   strict = derivationStrict drvAttrs;
             |            ^
           38|

       … while evaluating the option `nodes.server.networking.interfaces':

       … while evaluating definitions from `/nix/store/mz7g35d4m7d69sy6vc4iw6r11zp47fi3-source/nixos/modules/hardware/facter/networking':

       … while evaluating the option `nodes.server.hardware.facter.enable':

       … while evaluating the option `nodes.server.hardware.facter.report':

       … while evaluating the option `nodes.server.hardware.facter.reportPath':

       … while evaluating definitions from `/nix/store/hq8q721jlz0mqramvlvyj8lqa0d7nxrk-source/nixosModules/clanCore/nixos-facter.nix':

       (stack trace truncated; use '--show-trace' to show the full, detailed trace)

       error: cannot open connection to remote store 'grpc://nix-store.geninf.io:50051': error: Nix daemon disconnected unexpectedly (maybe it crashed?)
failed eval checks.x86_64-linux.syncthing-service —
error: … while evaluating the attribute 'drvPath' at «https://releases.nixos.org/nixos/26.05/nixos-26.05.10620.f5c082a40f75/nixexprs.tar.xz?narH …
error:
       … while evaluating the attribute 'drvPath'
         at «https://releases.nixos.org/nixos/26.05/nixos-26.05.10620.f5c082a40f75/nixexprs.tar.xz?narHash=sha256-7CLWYUrZU7w6X7y3VBohp2TUhQb0CjiEUbPE6WaOdK4%3D»/lib/customisation.nix:427:7:
          426|     // {
          427|       drvPath =
             |       ^
          428|         assert condition;

       … while calling the 'derivationStrict' builtin
         at «nix-internal»/derivation-internal.nix:37:12:
           36|
           37|   strict = derivationStrict drvAttrs;
             |            ^
           38|

       … while evaluating the option `nodes.machine1.networking.interfaces':

       … while evaluating definitions from `/nix/store/mz7g35d4m7d69sy6vc4iw6r11zp47fi3-source/nixos/modules/hardware/facter/networking':

       … while evaluating the option `nodes.machine1.hardware.facter.enable':

       … while evaluating the option `nodes.machine1.hardware.facter.report':

       … while evaluating the option `nodes.machine1.hardware.facter.reportPath':

       … while evaluating definitions from `/nix/store/hq8q721jlz0mqramvlvyj8lqa0d7nxrk-source/nixosModules/clanCore/nixos-facter.nix':

       (stack trace truncated; use '--show-trace' to show the full, detailed trace)

       error: opening a connection to remote store 'grpc://nix-store.geninf.io:50051' previously failed
failed eval checks.x86_64-linux.template-minimal —
error: … while calling the 'import' builtin at «git+file:///var/lib/nixbot/worktrees/5-8e2bb678808f-25?ref=HEAD&rev=081673e7c96f164598038f55f341 …
error:
       … while calling the 'import' builtin
         at «git+file:///var/lib/nixbot/worktrees/5-8e2bb678808f-25?ref=HEAD&rev=081673e7c96f164598038f55f341253e752185f1»/templates/flake-module.nix:50:19:
           49|         '';
           50|         evaled = (import "${initialized}/flake.nix").outputs {
             |                   ^
           51|           self = evaled // {

       … while realising the context of path '/nix/store/x2q145mibgkhzfwp4s1d7bya012n1n4y-minimal-clan-flake/flake.nix'

       error: cannot open connection to remote store 'grpc://nix-store.geninf.io:50051': error: Nix daemon disconnected unexpectedly (maybe it crashed?)
failed eval checks.x86_64-linux.trusted-nix-caches —
error: … while evaluating the attribute 'drvPath' at «https://releases.nixos.org/nixos/26.05/nixos-26.05.10620.f5c082a40f75/nixexprs.tar.xz?narH …
error:
       … while evaluating the attribute 'drvPath'
         at «https://releases.nixos.org/nixos/26.05/nixos-26.05.10620.f5c082a40f75/nixexprs.tar.xz?narHash=sha256-7CLWYUrZU7w6X7y3VBohp2TUhQb0CjiEUbPE6WaOdK4%3D»/lib/customisation.nix:427:7:
          426|     // {
          427|       drvPath =
             |       ^
          428|         assert condition;

       … while calling the 'derivationStrict' builtin
         at «nix-internal»/derivation-internal.nix:37:12:
           36|
           37|   strict = derivationStrict drvAttrs;
             |            ^
           38|

       … while evaluating the option `nodes.server.networking.interfaces':

       … while evaluating definitions from `/nix/store/mz7g35d4m7d69sy6vc4iw6r11zp47fi3-source/nixos/modules/hardware/facter/networking':

       … while evaluating the option `nodes.server.hardware.facter.enable':

       … while evaluating the option `nodes.server.hardware.facter.report':

       … while evaluating the option `nodes.server.hardware.facter.reportPath':

       … while evaluating definitions from `/nix/store/hq8q721jlz0mqramvlvyj8lqa0d7nxrk-source/nixosModules/clanCore/nixos-facter.nix':

       (stack trace truncated; use '--show-trace' to show the full, detailed trace)

       error: opening a connection to remote store 'grpc://nix-store.geninf.io:50051' previously failed
failed eval checks.x86_64-linux.users —
error: … while evaluating the attribute 'drvPath' at «https://releases.nixos.org/nixos/26.05/nixos-26.05.10620.f5c082a40f75/nixexprs.tar.xz?narH …
error:
       … while evaluating the attribute 'drvPath'
         at «https://releases.nixos.org/nixos/26.05/nixos-26.05.10620.f5c082a40f75/nixexprs.tar.xz?narHash=sha256-7CLWYUrZU7w6X7y3VBohp2TUhQb0CjiEUbPE6WaOdK4%3D»/lib/customisation.nix:427:7:
          426|     // {
          427|       drvPath =
             |       ^
          428|         assert condition;

       … while calling the 'derivationStrict' builtin
         at «nix-internal»/derivation-internal.nix:37:12:
           36|
           37|   strict = derivationStrict drvAttrs;
             |            ^
           38|

       … while evaluating the option `nodes.server.networking.interfaces':

       … while evaluating definitions from `/nix/store/mz7g35d4m7d69sy6vc4iw6r11zp47fi3-source/nixos/modules/hardware/facter/networking':

       … while evaluating the option `nodes.server.hardware.facter.enable':

       … while evaluating the option `nodes.server.hardware.facter.report':

       … while evaluating the option `nodes.server.hardware.facter.reportPath':

       … while evaluating definitions from `/nix/store/hq8q721jlz0mqramvlvyj8lqa0d7nxrk-source/nixosModules/clanCore/nixos-facter.nix':

       (stack trace truncated; use '--show-trace' to show the full, detailed trace)

       error: opening a connection to remote store 'grpc://nix-store.geninf.io:50051' previously failed
failed eval checks.x86_64-linux.wifi —
error: … while evaluating the attribute 'drvPath' at «https://releases.nixos.org/nixos/26.05/nixos-26.05.10620.f5c082a40f75/nixexprs.tar.xz?narH …
error:
       … while evaluating the attribute 'drvPath'
         at «https://releases.nixos.org/nixos/26.05/nixos-26.05.10620.f5c082a40f75/nixexprs.tar.xz?narHash=sha256-7CLWYUrZU7w6X7y3VBohp2TUhQb0CjiEUbPE6WaOdK4%3D»/lib/customisation.nix:427:7:
          426|     // {
          427|       drvPath =
             |       ^
          428|         assert condition;

       … while calling the 'derivationStrict' builtin
         at «nix-internal»/derivation-internal.nix:37:12:
           36|
           37|   strict = derivationStrict drvAttrs;
             |            ^
           38|

       … while evaluating the option `driverConfiguration.vlans':

       … while evaluating definitions from `/nix/store/mz7g35d4m7d69sy6vc4iw6r11zp47fi3-source/nixos/lib/testing/driver-configuration.nix':

       … while evaluating the option `nodes.second.networking.interfaces':

       … while evaluating definitions from `/nix/store/mz7g35d4m7d69sy6vc4iw6r11zp47fi3-source/nixos/modules/hardware/facter/networking':

       … while evaluating the option `nodes.second.hardware.facter.enable':

       … while evaluating the option `nodes.second.hardware.facter.report':

       … while evaluating the option `nodes.second.hardware.facter.reportPath':

       … while evaluating definitions from `/nix/store/hq8q721jlz0mqramvlvyj8lqa0d7nxrk-source/nixosModules/clanCore/nixos-facter.nix':

       (stack trace truncated; use '--show-trace' to show the full, detailed trace)

       error: opening a connection to remote store 'grpc://nix-store.geninf.io:50051' previously failed
failed eval checks.x86_64-linux.wireguard —
error: … while evaluating the attribute 'drvPath' at «https://releases.nixos.org/nixos/26.05/nixos-26.05.10620.f5c082a40f75/nixexprs.tar.xz?narH …
error:
       … while evaluating the attribute 'drvPath'
         at «https://releases.nixos.org/nixos/26.05/nixos-26.05.10620.f5c082a40f75/nixexprs.tar.xz?narHash=sha256-7CLWYUrZU7w6X7y3VBohp2TUhQb0CjiEUbPE6WaOdK4%3D»/lib/customisation.nix:427:7:
          426|     // {
          427|       drvPath =
             |       ^
          428|         assert condition;

       … while calling the 'derivationStrict' builtin
         at «nix-internal»/derivation-internal.nix:37:12:
           36|
           37|   strict = derivationStrict drvAttrs;
             |            ^
           38|

       … while evaluating the option `nodes.controller1.networking.interfaces':

       … while evaluating definitions from `/nix/store/mz7g35d4m7d69sy6vc4iw6r11zp47fi3-source/nixos/modules/hardware/facter/networking':

       … while evaluating the option `nodes.controller1.hardware.facter.enable':

       … while evaluating the option `nodes.controller1.hardware.facter.report':

       … while evaluating the option `nodes.controller1.hardware.facter.reportPath':

       … while evaluating definitions from `/nix/store/hq8q721jlz0mqramvlvyj8lqa0d7nxrk-source/nixosModules/clanCore/nixos-facter.nix':

       (stack trace truncated; use '--show-trace' to show the full, detailed trace)

       error: opening a connection to remote store 'grpc://nix-store.geninf.io:50051' previously failed
failed eval checks.x86_64-linux.yggdrasil —
error: … while evaluating the attribute 'drvPath' at «https://releases.nixos.org/nixos/26.05/nixos-26.05.10620.f5c082a40f75/nixexprs.tar.xz?narH …
error:
       … while evaluating the attribute 'drvPath'
         at «https://releases.nixos.org/nixos/26.05/nixos-26.05.10620.f5c082a40f75/nixexprs.tar.xz?narHash=sha256-7CLWYUrZU7w6X7y3VBohp2TUhQb0CjiEUbPE6WaOdK4%3D»/lib/customisation.nix:427:7:
          426|     // {
          427|       drvPath =
             |       ^
          428|         assert condition;

       … while calling the 'derivationStrict' builtin
         at «nix-internal»/derivation-internal.nix:37:12:
           36|
           37|   strict = derivationStrict drvAttrs;
             |            ^
           38|

       … while evaluating the option `driverConfiguration.vlans':

       … while evaluating definitions from `/nix/store/mz7g35d4m7d69sy6vc4iw6r11zp47fi3-source/nixos/lib/testing/driver-configuration.nix':

       … while evaluating the option `nodes.outsider.networking.interfaces':

       … while evaluating definitions from `/nix/store/mz7g35d4m7d69sy6vc4iw6r11zp47fi3-source/nixos/modules/hardware/facter/networking':

       … while evaluating the option `nodes.outsider.hardware.facter.enable':

       … while evaluating the option `nodes.outsider.hardware.facter.report':

       … while evaluating the option `nodes.outsider.hardware.facter.reportPath':

       … while evaluating definitions from `/nix/store/hq8q721jlz0mqramvlvyj8lqa0d7nxrk-source/nixosModules/clanCore/nixos-facter.nix':

       (stack trace truncated; use '--show-trace' to show the full, detailed trace)

       error: cannot open connection to remote store 'grpc://nix-store.geninf.io:50051': error: Nix daemon disconnected unexpectedly (maybe it crashed?)
failed eval checks.x86_64-linux.zerotier —
error: … while evaluating the attribute 'drvPath' at «https://releases.nixos.org/nixos/26.05/nixos-26.05.10620.f5c082a40f75/nixexprs.tar.xz?narH …
error:
       … while evaluating the attribute 'drvPath'
         at «https://releases.nixos.org/nixos/26.05/nixos-26.05.10620.f5c082a40f75/nixexprs.tar.xz?narHash=sha256-7CLWYUrZU7w6X7y3VBohp2TUhQb0CjiEUbPE6WaOdK4%3D»/lib/customisation.nix:427:7:
          426|     // {
          427|       drvPath =
             |       ^
          428|         assert condition;

       … while calling the 'derivationStrict' builtin
         at «nix-internal»/derivation-internal.nix:37:12:
           36|
           37|   strict = derivationStrict drvAttrs;
             |            ^
           38|

       … while evaluating the option `driverConfiguration.vlans':

       … while evaluating definitions from `/nix/store/mz7g35d4m7d69sy6vc4iw6r11zp47fi3-source/nixos/lib/testing/driver-configuration.nix':

       … while evaluating the option `nodes.controller.networking.interfaces':

       … while evaluating definitions from `/nix/store/mz7g35d4m7d69sy6vc4iw6r11zp47fi3-source/nixos/modules/hardware/facter/networking':

       … while evaluating the option `nodes.controller.hardware.facter.enable':

       … while evaluating the option `nodes.controller.hardware.facter.report':

       … while evaluating the option `nodes.controller.hardware.facter.reportPath':

       … while evaluating definitions from `/nix/store/hq8q721jlz0mqramvlvyj8lqa0d7nxrk-source/nixosModules/clanCore/nixos-facter.nix':

       (stack trace truncated; use '--show-trace' to show the full, detailed trace)

       error: cannot open connection to remote store 'grpc://nix-store.geninf.io:50051': error: Nix daemon disconnected unexpectedly (maybe it crashed?)
failed eval checks.x86_64-linux.zerotier-multi-instance —
error: … while evaluating the attribute 'drvPath' at «https://releases.nixos.org/nixos/26.05/nixos-26.05.10620.f5c082a40f75/nixexprs.tar.xz?narH …
error:
       … while evaluating the attribute 'drvPath'
         at «https://releases.nixos.org/nixos/26.05/nixos-26.05.10620.f5c082a40f75/nixexprs.tar.xz?narHash=sha256-7CLWYUrZU7w6X7y3VBohp2TUhQb0CjiEUbPE6WaOdK4%3D»/lib/customisation.nix:427:7:
          426|     // {
          427|       drvPath =
             |       ^
          428|         assert condition;

       … while calling the 'derivationStrict' builtin
         at «nix-internal»/derivation-internal.nix:37:12:
           36|
           37|   strict = derivationStrict drvAttrs;
             |            ^
           38|

       … while evaluating the option `driverConfiguration.vlans':

       … while evaluating definitions from `/nix/store/mz7g35d4m7d69sy6vc4iw6r11zp47fi3-source/nixos/lib/testing/driver-configuration.nix':

       … while evaluating the option `nodes.alpha.networking.interfaces':

       … while evaluating definitions from `/nix/store/mz7g35d4m7d69sy6vc4iw6r11zp47fi3-source/nixos/modules/hardware/facter/networking':

       … while evaluating the option `nodes.alpha.hardware.facter.enable':

       … while evaluating the option `nodes.alpha.hardware.facter.report':

       … while evaluating the option `nodes.alpha.hardware.facter.reportPath':

       … while evaluating definitions from `/nix/store/hq8q721jlz0mqramvlvyj8lqa0d7nxrk-source/nixosModules/clanCore/nixos-facter.nix':

       (stack trace truncated; use '--show-trace' to show the full, detailed trace)

       error: opening a connection to remote store 'grpc://nix-store.geninf.io:50051' previously failed
65 succeeded
succeeded attributes
status attribute duration
loading…
22 already built
skipped attributes
status attribute duration
loading…