nixbot

builds

clan/clan-core build #917 failed

branch 26.05 · PR #8177 · commit fde48e0e2d · · took 12m 2s · eval 6m 46s

eval warnings 50 kinds · 358 occurrences
  • error …-merged-test-dir-borgbackup.drv: gi-build-x86-02: gi-build-x86-02: input not substitutable: error: path '/nix/store/…-test-vars-generated' is required, but there is no substituter that can build it, asking the scheduler again ×17
  • error ×43
  • error build of '/nix/store/…-merged-test-dir-borgbackup.drv^out' failed: error: gave up after 9 reschedules ×2
  • error Refusing to evaluate package 'pnpm-10.34.0' in /nix/store/…-source/pkgs/development/tools/pnpm/generic.nix:170 because it is marked as insecure ×10
  • error …-merged-test-dir-certificates.drv: gi-build-x86-02: gi-build-x86-02: input not substitutable: error: path '/nix/store/…-test-vars-generated' is required, but there is no substituter that can build it, asking the scheduler again ×18
  • error …-merged-test-dir-data-mesher.drv: gi-build-x86-02: gi-build-x86-02: input not substitutable: error: path '/nix/store/…-test-vars-generated' is required, but there is no substituter that can build it, asking the scheduler again ×16
  • error …-merged-test-dir-garage.drv: build-x86-01: build-x86-01: input not substitutable: error: path '/nix/store/…-test-vars-generated' is required, but there is no substituter that can build it, asking the scheduler again ×3
  • error …-merged-test-dir-kde.drv: build-x86-01: build-x86-01: input not substitutable: error: path '/nix/store/…-test-vars-generated' is required, but there is no substituter that can build it, asking the scheduler again ×16
  • error …-merged-test-dir-garage.drv: gi-build-x86-02: gi-build-x86-02: input not substitutable: error: path '/nix/store/…-test-vars-generated' is required, but there is no substituter that can build it, asking the scheduler again ×15
  • error build of '/nix/store/…-merged-test-dir-kde.drv^out' failed: error: gave up after 9 reschedules ×2
  • error …-merged-test-dir-data-mesher.drv: build-x86-01: build-x86-01: input not substitutable: error: path '/nix/store/…-test-vars-generated' is required, but there is no substituter that can build it, asking the scheduler again ×2
  • error build of '/nix/store/…-merged-test-dir-data-mesher.drv^out' failed: error: gave up after 9 reschedules ×2
  • error build of '/nix/store/…-merged-test-dir-garage.drv^out' failed: error: gave up after 9 reschedules ×2
  • error build of '/nix/store/…-merged-test-dir-certificates.drv^out' failed: error: gave up after 9 reschedules ×2
  • error …-merged-test-dir-service-dummy-test.drv: gi-build-x86-02: gi-build-x86-02: input not substitutable: error: path '/nix/store/…-test-vars-generated' is required, but there is no substituter that can build it, asking the scheduler again ×14
  • error …-merged-test-dir-pki.drv: gi-build-x86-02: gi-build-x86-02: input not substitutable: error: path '/nix/store/…-test-vars-generated' is required, but there is no substituter that can build it, asking the scheduler again ×9
  • error …-test-vars-generated.drv: build-x86-01: build-x86-01: input not substitutable: error: path '/nix/store/…-generator-test-secret' is required, but there is no substituter that can build it, asking the scheduler again ×9
  • error …-merged-test-dir-packages.drv: build-x86-01: build-x86-01: input not substitutable: error: path '/nix/store/…-test-vars-generated' is required, but there is no substituter that can build it, asking the scheduler again ×9
  • error build of '/nix/store/…-merged-test-dir-service-dummy-test.drv^out' failed: error: gave up after 9 reschedules ×1
  • error build of '/nix/store/…-merged-test-dir-pki.drv^out' failed: error: gave up after 9 reschedules ×2
  • error build of '/nix/store/…-merged-test-dir-packages.drv^out' failed: error: gave up after 9 reschedules ×2
  • error …-merged-test-dir-sshd.drv: build-x86-01: build-x86-01: input not substitutable: error: path '/nix/store/…-test-vars-generated' is required, but there is no substituter that can build it, asking the scheduler again ×8
  • error …-merged-test-dir-dyndns.drv: build-x86-01: build-x86-01: input not substitutable: error: path '/nix/store/…-test-vars-generated' is required, but there is no substituter that can build it, asking the scheduler again ×2
  • error …-merged-test-dir-sshd.drv: gi-build-x86-02: gi-build-x86-02: input not substitutable: error: path '/nix/store/…-test-vars-generated' is required, but there is no substituter that can build it, asking the scheduler again ×1
  • error build of '/nix/store/…-merged-test-dir-sshd.drv^out' failed: error: gave up after 9 reschedules ×1
  • error …-merged-test-dir-dyndns.drv: gi-build-x86-02: gi-build-x86-02: input not substitutable: error: path '/nix/store/…-test-vars-generated' is required, but there is no substituter that can build it, asking the scheduler again ×16
  • error …-merged-test-dir-syncthing-service.drv: gi-build-x86-02: gi-build-x86-02: input not substitutable: error: path '/nix/store/…-test-vars-generated' is required, but there is no substituter that can build it, asking the scheduler again ×17
  • error …-merged-test-dir-trusted-nix-caches.drv: build-x86-01: build-x86-01: input not substitutable: error: path '/nix/store/…-test-vars-generated' is required, but there is no substituter that can build it, asking the scheduler again ×2
  • error …-merged-test-dir-syncthing-service.drv: build-x86-01: build-x86-01: input not substitutable: error: path '/nix/store/…-test-vars-generated' is required, but there is no substituter that can build it, asking the scheduler again ×1
  • error build of '/nix/store/…-merged-test-dir-dyndns.drv^out' failed: error: gave up after 9 reschedules ×2
  • error build of '/nix/store/…-merged-test-dir-syncthing-service.drv^out' failed: error: gave up after 9 reschedules ×2
  • error …-merged-test-dir-clan-test-p2p-ssh-iroh.drv: build-x86-01: build-x86-01: input not substitutable: error: path '/nix/store/…-test-vars-generated' is required, but there is no substituter that can build it, asking the scheduler again ×10
  • error build of '/nix/store/…-merged-test-dir-clan-test-p2p-ssh-iroh.drv^out' failed: error: gave up after 9 reschedules ×2
  • error …-merged-test-dir-service-postgresql.drv: build-x86-01: build-x86-01: input not substitutable: error: path '/nix/store/…-test-vars-generated' is required, but there is no substituter that can build it, asking the scheduler again ×1
  • error …-merged-test-dir-users.drv: build-x86-01: build-x86-01: input not substitutable: error: path '/nix/store/…-test-vars-generated' is required, but there is no substituter that can build it, asking the scheduler again ×4
  • error …-merged-test-dir-wifi.drv: gi-build-x86-02: gi-build-x86-02: input not substitutable: error: path '/nix/store/…-test-vars-generated' is required, but there is no substituter that can build it, asking the scheduler again ×14
  • error …-merged-test-dir-wireguard.drv: gi-build-x86-02: gi-build-x86-02: input not substitutable: error: path '/nix/store/…-test-vars-generated' is required, but there is no substituter that can build it, asking the scheduler again ×13
  • error …-test-vars-generated.drv: gi-build-x86-02: gi-build-x86-02: input not substitutable: error: path '/nix/store/…-generator-test-secret' is required, but there is no substituter that can build it, asking the scheduler again ×9
  • error …-merged-test-dir-wifi.drv: build-x86-01: build-x86-01: input not substitutable: error: path '/nix/store/…-test-vars-generated' is required, but there is no substituter that can build it, asking the scheduler again ×4
  • error …-merged-test-dir-trusted-nix-caches.drv: gi-build-x86-02: gi-build-x86-02: input not substitutable: error: path '/nix/store/…-test-vars-generated' is required, but there is no substituter that can build it, asking the scheduler again ×7
  • error build of '/nix/store/…-merged-test-dir-nixos-test-password-store-mounts.drv^out' failed: error: dependency '…-test-vars-generated.drv' failed ×2
  • error …-merged-test-dir-wireguard.drv: build-x86-01: build-x86-01: input not substitutable: error: path '/nix/store/…-test-vars-generated' is required, but there is no substituter that can build it, asking the scheduler again ×4
  • error build of '/nix/store/…-merged-test-dir-wireguard.drv^out' failed: error: gave up after 9 reschedules ×2
  • error build of '/nix/store/…-merged-test-dir-wifi.drv^out' failed: error: gave up after 9 reschedules ×2
  • error build of '/nix/store/…-merged-test-dir-trusted-nix-caches.drv^out' failed: error: gave up after 9 reschedules ×1
  • error …-merged-test-dir-users.drv: gi-build-x86-02: gi-build-x86-02: input not substitutable: error: path '/nix/store/…-test-vars-generated' is required, but there is no substituter that can build it, asking the scheduler again ×14
  • error build of '/nix/store/…-merged-test-dir-users.drv^out' failed: error: gave up after 9 reschedules ×2
  • error …-merged-test-dir-zerotier.drv: gi-build-x86-02: gi-build-x86-02: input not substitutable: error: path '/nix/store/…-test-vars-generated' is required, but there is no substituter that can build it, asking the scheduler again ×9
  • error build of '/nix/store/…-merged-test-dir-zerotier.drv^out' failed: error: gave up after 9 reschedules ×1
  • error …-merged-test-dir-clan-test-update.drv: build-x86-01: build-x86-01: input not substitutable: error: path '/nix/store/…-test-vars-generated' is required, but there is no substituter that can build it, asking the scheduler again ×9

87 failed
failed attributes
status attribute duration
failed eval checks.aarch64-darwin.all-packages —
error: … while calling the 'derivationStrict' builtin at «nix-internal»/derivation-internal.nix:37:12: 36| 37| strict = …
error:
       … while calling the 'derivationStrict' builtin
         at «nix-internal»/derivation-internal.nix:37:12:
           36|
           37|   strict = derivationStrict drvAttrs;
             |            ^
           38|

       … while evaluating derivation 'all-packages'
         whose name attribute is located at «https://releases.nixos.org/nixos/26.05/nixos-26.05.11576.7c8764b7c7b0/nixexprs.tar.xz?narHash=sha256-/hsaG8yWXZjTs6WJS2xnerd9VKBgJ8jN8e5ELHLt%2Bbs%3D»/pkgs/stdenv/generic/make-derivation.nix:647:11

       … while evaluating attribute 'buildCommand' of derivation 'all-packages'
         at «https://releases.nixos.org/nixos/26.05/nixos-26.05.11576.7c8764b7c7b0/nixexprs.tar.xz?narHash=sha256-/hsaG8yWXZjTs6WJS2xnerd9VKBgJ8jN8e5ELHLt%2Bbs%3D»/pkgs/build-support/trivial-builders/default.nix:81:17:
           80|         enableParallelBuilding = true;
           81|         inherit buildCommand name;
             |                 ^
           82|         passAsFile = [ "buildCommand" ] ++ (derivationArgs.passAsFile or [ ]);

       (stack trace truncated; use '--show-trace' to show the full, detailed trace)

       error: Refusing to evaluate package 'pnpm-10.34.0' in /nix/store/caswzvky10pm1m7rhdizrai4mh7wa6z4-source/pkgs/development/tools/pnpm/generic.nix:170 because it is marked as insecure

       Known issues:
        - CVE-2026-55487
        - CVE-2026-55698
        - CVE-2026-55180
        - CVE-2026-55697
        - CVE-2026-59194
        - CVE-2026-59195
        - CVE-2026-59196
        - CVE-2026-82392
        - CVE-2026-82393

       You can install it anyway by allowing this package, using the
       following methods:

       a) To temporarily allow all insecure packages, you can use an environment
          variable for a single invocation of the nix tools:

            $ export NIXPKGS_ALLOW_INSECURE=1

          Note: When using `nix shell`, `nix build`, `nix develop`, etc with a flake,
                then pass `--impure` in order to allow use of environment variables.

       b) for `nixos-rebuild` you can add ‘pnpm-10.34.0’ to
          `nixpkgs.config.permittedInsecurePackages` in the configuration.nix,
          like so:

            {
              nixpkgs.config.permittedInsecurePackages = [
                "pnpm-10.34.0"
              ];
            }

       c) For `nix-env`, `nix-build`, `nix-shell` or any other Nix command you can add
          ‘pnpm-10.34.0’ to `permittedInsecurePackages` in
          ~/.config/nixpkgs/config.nix, like so:

            {
              permittedInsecurePackages = [
                "pnpm-10.34.0"
              ];
            }
failed checks.aarch64-darwin.clan-app-pytest 2m 5s
setup: warning: ignoring the client-specified setting 'store', because it is a restricted setting and you are not a trusted user warning: 2vq97vcpv3x4banc8r1vpz …
setup:
warning: ignoring the client-specified setting 'store', because it is a restricted setting and you are not a trusted user
warning: 2vq97vcpv3x4banc8r1vpzlpf4zzlfky-webview-nightly.drv: no connected, non-draining worker for system 'aarch64-darwin' offers features {}, the workers offer {}, waiting up to 120s for a worker
warning: q1qgvwm3lcfpsk9zbl566bfa2y5ilwk5-python3-3.13.15-env.drv: no connected, non-draining worker for system 'aarch64-darwin' offers features {}, the workers offer {}, waiting up to 120s for a worker
warning: vsjgx7bv36g1n0badmig6bdip498yb0v-clan-runtime.drv: no connected, non-draining worker for system 'aarch64-darwin' offers features {}, the workers offer {}, waiting up to 120s for a worker
2vq97vcpv3x4banc8r1vpzlpf4zzlfky-webview-nightly.drv: no connected, non-draining worker for system 'aarch64-darwin' offers features {}, the workers offer {}
q1qgvwm3lcfpsk9zbl566bfa2y5ilwk5-python3-3.13.15-env.drv: no connected, non-draining worker for system 'aarch64-darwin' offers features {}, the workers offer {}
vsjgx7bv36g1n0badmig6bdip498yb0v-clan-runtime.drv: no connected, non-draining worker for system 'aarch64-darwin' offers features {}, the workers offer {}
error: dependency '2vq97vcpv3x4banc8r1vpzlpf4zzlfky-webview-nightly.drv' failed
failed checks.aarch64-darwin.clan-app-ui-lint 2m 7s
setup: warning: kzdw7zw5nv08894mwk1v82wk3rbp36y5-unknown.drv: no connected, non-draining worker for system 'aarch64-darwin' offers features {}, the workers offe …
setup:
warning: kzdw7zw5nv08894mwk1v82wk3rbp36y5-unknown.drv: no connected, non-draining worker for system 'aarch64-darwin' offers features {}, the workers offer {}, waiting up to 120s for a worker
warning: p4b96a9l12zifk49k0l49cadqyxfj945-clan-ts-api.drv: no connected, non-draining worker for system 'aarch64-darwin' offers features {}, the workers offer {}, waiting up to 120s for a worker
warning: v7cfvzx59d42d7insb9qfcdbyalw64zx-npm-config-hook.drv: no connected, non-draining worker for system 'aarch64-darwin' offers features {}, the workers offer {}, waiting up to 120s for a worker
3dp020c98sm3y9b9iz9jbifrgfqjrkp1--clan-ui-0.0.1-sources.drv: no connected, non-draining worker for system 'aarch64-darwin' offers features {}, the workers offer {}
kzdw7zw5nv08894mwk1v82wk3rbp36y5-unknown.drv: no connected, non-draining worker for system 'aarch64-darwin' offers features {}, the workers offer {}
p4b96a9l12zifk49k0l49cadqyxfj945-clan-ts-api.drv: no connected, non-draining worker for system 'aarch64-darwin' offers features {}, the workers offer {}
v7cfvzx59d42d7insb9qfcdbyalw64zx-npm-config-hook.drv: no connected, non-draining worker for system 'aarch64-darwin' offers features {}, the workers offer {}
error: dependency 'p4b96a9l12zifk49k0l49cadqyxfj945-clan-ts-api.drv' failed
failed checks.aarch64-darwin.clan-deps 2m 2s
setup: don't know how to build these paths: /nix/store/rzch3gyc5991ya2gvyazmglkwb47bnjm-clan-deps.drv warning: ignoring the client-specified setting 'store', …
setup:
don't know how to build these paths:
  /nix/store/rzch3gyc5991ya2gvyazmglkwb47bnjm-clan-deps.drv
warning: ignoring the client-specified setting 'store', because it is a restricted setting and you are not a trusted user
warning: rzch3gyc5991ya2gvyazmglkwb47bnjm-clan-deps.drv: no connected, non-draining worker for system 'aarch64-darwin' offers features {}, the workers offer {}, waiting up to 120s for a worker
rzch3gyc5991ya2gvyazmglkwb47bnjm-clan-deps.drv: no connected, non-draining worker for system 'aarch64-darwin' offers features {}, the workers offer {}
error: no connected, non-draining worker for system 'aarch64-darwin' offers features {}, the workers offer {}
failed checks.aarch64-darwin.clan-pytest-with-core 2m 19s
setup: 8adidamrvqdb2wxy93h3ng62qnm4vdk4-clan-core-flake.drv: no connected, non-draining worker for system 'aarch64-darwin' offers features {}, the workers offer …
setup:
8adidamrvqdb2wxy93h3ng62qnm4vdk4-clan-core-flake.drv: no connected, non-draining worker for system 'aarch64-darwin' offers features {}, the workers offer {}
i3q3lzz995ndkqbamgjkpsvz230c7mrf-zerotierone-1.16.0.drv: no connected, non-draining worker for system 'aarch64-darwin' offers features {}, the workers offer {}
pav0ikgjyv0ci86riqpsrlpk5mpwqcr6-closure-info.drv: no connected, non-draining worker for system 'aarch64-darwin' offers features {}, the workers offer {}
ra2927r70v9zjjz5z3rxcj7g5dh6mmnk-zerotierone-1.16.0.drv: no connected, non-draining worker for system 'aarch64-darwin' offers features {}, the workers offer {}
vsjgx7bv36g1n0badmig6bdip498yb0v-clan-runtime.drv: no connected, non-draining worker for system 'aarch64-darwin' offers features {}, the workers offer {}
xj2xqw5v2f9mmd748nwsigchzv9q9pzr-zerotier-tools-0.1.0.drv: no connected, non-draining worker for system 'aarch64-darwin' offers features {}, the workers offer {}
ym0w3fjav52jbam294jqn8zvbpndrjc9-python3-3.13.15-env.drv: no connected, non-draining worker for system 'aarch64-darwin' offers features {}, the workers offer {}
error: dependency '8adidamrvqdb2wxy93h3ng62qnm4vdk4-clan-core-flake.drv' failed
failed checks.aarch64-darwin.clan-pytest-without-core 2m 3s
setup: warning: ignoring the client-specified setting 'store', because it is a restricted setting and you are not a trusted user warning: pav0ikgjyv0ci86riqpsrl …
setup:
warning: ignoring the client-specified setting 'store', because it is a restricted setting and you are not a trusted user
warning: pav0ikgjyv0ci86riqpsrlpk5mpwqcr6-closure-info.drv: no connected, non-draining worker for system 'aarch64-darwin' offers features {}, the workers offer {}, waiting up to 120s for a worker
warning: vsjgx7bv36g1n0badmig6bdip498yb0v-clan-runtime.drv: no connected, non-draining worker for system 'aarch64-darwin' offers features {}, the workers offer {}, waiting up to 120s for a worker
warning: ym0w3fjav52jbam294jqn8zvbpndrjc9-python3-3.13.15-env.drv: no connected, non-draining worker for system 'aarch64-darwin' offers features {}, the workers offer {}, waiting up to 120s for a worker
pav0ikgjyv0ci86riqpsrlpk5mpwqcr6-closure-info.drv: no connected, non-draining worker for system 'aarch64-darwin' offers features {}, the workers offer {}
vsjgx7bv36g1n0badmig6bdip498yb0v-clan-runtime.drv: no connected, non-draining worker for system 'aarch64-darwin' offers features {}, the workers offer {}
ym0w3fjav52jbam294jqn8zvbpndrjc9-python3-3.13.15-env.drv: no connected, non-draining worker for system 'aarch64-darwin' offers features {}, the workers offer {}
error: dependency 'yqddka4q212hgbng042pi98za7man3i0-closure-info.drv' failed
failed checks.aarch64-darwin.darwin-test-darwin-machine 2m 7s
setup: q52zn986wach507sllk5f15iya7z5rgg-fonts.drv: no connected, non-draining worker for system 'aarch64-darwin' offers features {}, the workers offer {} qm4r6l …
setup:
q52zn986wach507sllk5f15iya7z5rgg-fonts.drv: no connected, non-draining worker for system 'aarch64-darwin' offers features {}, the workers offer {}
qm4r6lgv1ld1pdf52ndlra10gsm97mr8-darwin-rebuild.drv: no connected, non-draining worker for system 'aarch64-darwin' offers features {}, the workers offer {}
rjrx4i80iwd7xri74wfsfxi8fsal8gbp-set-environment.drv: no connected, non-draining worker for system 'aarch64-darwin' offers features {}, the workers offer {}
sszkycqia3vjcaw0fxfl1c70kn2gpk75-options.json.drv: no connected, non-draining worker for system 'aarch64-darwin' offers features {}, the workers offer {}
w4afz2impwxc5cqv08bsa2vh6gr5pl3d-patches.drv: no connected, non-draining worker for system 'aarch64-darwin' offers features {}, the workers offer {}
y5f294bglikn7b7gcnlchbaj9j1qmfjf-etc-099-host-keys.conf.drv: no connected, non-draining worker for system 'aarch64-darwin' offers features {}, the workers offer {}
y6v0x6ql68q9080awrq8ab9mw6l1gavh-launchd.drv: no connected, non-draining worker for system 'aarch64-darwin' offers features {}, the workers offer {}
error: dependency 'q52zn986wach507sllk5f15iya7z5rgg-fonts.drv' failed
dependency failed checks.aarch64-darwin.devshell —
failed checks.aarch64-darwin.devShell-clan-app 2m 5s
setup: 2vq97vcpv3x4banc8r1vpzlpf4zzlfky-webview-nightly.drv: no connected, non-draining worker for system 'aarch64-darwin' offers features {}, the workers offer …
setup:
2vq97vcpv3x4banc8r1vpzlpf4zzlfky-webview-nightly.drv: no connected, non-draining worker for system 'aarch64-darwin' offers features {}, the workers offer {}
ha5nmaqd434ys4fasq7b13nlkc4x2szx-python3-3.13.15-env.drv: no connected, non-draining worker for system 'aarch64-darwin' offers features {}, the workers offer {}
kzdw7zw5nv08894mwk1v82wk3rbp36y5-unknown.drv: no connected, non-draining worker for system 'aarch64-darwin' offers features {}, the workers offer {}
p4b96a9l12zifk49k0l49cadqyxfj945-clan-ts-api.drv: no connected, non-draining worker for system 'aarch64-darwin' offers features {}, the workers offer {}
v7cfvzx59d42d7insb9qfcdbyalw64zx-npm-config-hook.drv: no connected, non-draining worker for system 'aarch64-darwin' offers features {}, the workers offer {}
vsjgx7bv36g1n0badmig6bdip498yb0v-clan-runtime.drv: no connected, non-draining worker for system 'aarch64-darwin' offers features {}, the workers offer {}
xylhsnd1s92qvbm1481d9iddx8l8xing-playwright-browsers.drv: no connected, non-draining worker for system 'aarch64-darwin' offers features {}, the workers offer {}
error: dependency '2vq97vcpv3x4banc8r1vpzlpf4zzlfky-webview-nightly.drv' failed
failed checks.aarch64-darwin.devShell-clan-cli 2m 5s
setup: don't know how to build these paths: /nix/store/7vabqalq68ahq8hx1nwibhj180lsfbc1-clan-cli.drv warning: ignoring the client-specified setting 'store', b …
setup:
don't know how to build these paths:
  /nix/store/7vabqalq68ahq8hx1nwibhj180lsfbc1-clan-cli.drv
warning: ignoring the client-specified setting 'store', because it is a restricted setting and you are not a trusted user
warning: 7kdjqwgnmaar115ay7ci29nhqrx9jr3h-python3-3.13.15-env.drv: no connected, non-draining worker for system 'aarch64-darwin' offers features {}, the workers offer {}, waiting up to 120s for a worker
warning: vsjgx7bv36g1n0badmig6bdip498yb0v-clan-runtime.drv: no connected, non-draining worker for system 'aarch64-darwin' offers features {}, the workers offer {}, waiting up to 120s for a worker
7kdjqwgnmaar115ay7ci29nhqrx9jr3h-python3-3.13.15-env.drv: no connected, non-draining worker for system 'aarch64-darwin' offers features {}, the workers offer {}
vsjgx7bv36g1n0badmig6bdip498yb0v-clan-runtime.drv: no connected, non-draining worker for system 'aarch64-darwin' offers features {}, the workers offer {}
error: dependency 'vsjgx7bv36g1n0badmig6bdip498yb0v-clan-runtime.drv' failed
failed eval checks.aarch64-darwin.devShell-clan-site —
error: … while calling the 'derivationStrict' builtin at «nix-internal»/derivation-internal.nix:37:12: 36| 37| strict = …
error:
       … while calling the 'derivationStrict' builtin
         at «nix-internal»/derivation-internal.nix:37:12:
           36|
           37|   strict = derivationStrict drvAttrs;
             |            ^
           38|

       … while evaluating derivation 'nix-shell'
         whose name attribute is located at «https://releases.nixos.org/nixos/26.05/nixos-26.05.11576.7c8764b7c7b0/nixexprs.tar.xz?narHash=sha256-/hsaG8yWXZjTs6WJS2xnerd9VKBgJ8jN8e5ELHLt%2Bbs%3D»/pkgs/stdenv/generic/make-derivation.nix:647:11

       … while evaluating attribute '__impureHostDeps' of derivation 'nix-shell'
         at «https://releases.nixos.org/nixos/26.05/nixos-26.05.11576.7c8764b7c7b0/nixexprs.tar.xz?narHash=sha256-/hsaG8yWXZjTs6WJS2xnerd9VKBgJ8jN8e5ELHLt%2Bbs%3D»/pkgs/stdenv/generic/make-derivation.nix:816:11:
          815|             unique (computedPropagatedSandboxProfile ++ [ propagatedSandboxProfile ]);
          816|           ${if buildIsDarwin then "__impureHostDeps" else null} =
             |           ^
          817|             let

       (stack trace truncated; use '--show-trace' to show the full, detailed trace)

       error: Refusing to evaluate package 'pnpm-10.34.0' in /nix/store/caswzvky10pm1m7rhdizrai4mh7wa6z4-source/pkgs/development/tools/pnpm/generic.nix:170 because it is marked as insecure

       Known issues:
        - CVE-2026-55487
        - CVE-2026-55698
        - CVE-2026-55180
        - CVE-2026-55697
        - CVE-2026-59194
        - CVE-2026-59195
        - CVE-2026-59196
        - CVE-2026-82392
        - CVE-2026-82393

       You can install it anyway by allowing this package, using the
       following methods:

       a) To temporarily allow all insecure packages, you can use an environment
          variable for a single invocation of the nix tools:

            $ export NIXPKGS_ALLOW_INSECURE=1

          Note: When using `nix shell`, `nix build`, `nix develop`, etc with a flake,
                then pass `--impure` in order to allow use of environment variables.

       b) for `nixos-rebuild` you can add ‘pnpm-10.34.0’ to
          `nixpkgs.config.permittedInsecurePackages` in the configuration.nix,
          like so:

            {
              nixpkgs.config.permittedInsecurePackages = [
                "pnpm-10.34.0"
              ];
            }

       c) For `nix-env`, `nix-build`, `nix-shell` or any other Nix command you can add
          ‘pnpm-10.34.0’ to `permittedInsecurePackages` in
          ~/.config/nixpkgs/config.nix, like so:

            {
              permittedInsecurePackages = [
                "pnpm-10.34.0"
              ];
            }
failed checks.aarch64-darwin.devShell-default 2m 4s
setup: don't know how to build these paths: /nix/store/qbjr85xw7x4nd15xj7ms82sgnn8l6v33-clan.drv warning: ignoring the client-specified setting 'store', becau …
setup:
don't know how to build these paths:
  /nix/store/qbjr85xw7x4nd15xj7ms82sgnn8l6v33-clan.drv
warning: ignoring the client-specified setting 'store', because it is a restricted setting and you are not a trusted user
warning: vsjgx7bv36g1n0badmig6bdip498yb0v-clan-runtime.drv: no connected, non-draining worker for system 'aarch64-darwin' offers features {}, the workers offer {}, waiting up to 120s for a worker
vsjgx7bv36g1n0badmig6bdip498yb0v-clan-runtime.drv: no connected, non-draining worker for system 'aarch64-darwin' offers features {}, the workers offer {}
error: dependency 'vsjgx7bv36g1n0badmig6bdip498yb0v-clan-runtime.drv' failed
failed checks.aarch64-darwin.devShell-inventory-schema 2m 5s
setup: don't know how to build these paths: /nix/store/38yi2p4iy70484laj3xjwwap1gkjwm93-clan-inventory-schema.drv warning: ignoring the client-specified setti …
setup:
don't know how to build these paths:
  /nix/store/38yi2p4iy70484laj3xjwwap1gkjwm93-clan-inventory-schema.drv
warning: ignoring the client-specified setting 'store', because it is a restricted setting and you are not a trusted user
warning: vsjgx7bv36g1n0badmig6bdip498yb0v-clan-runtime.drv: no connected, non-draining worker for system 'aarch64-darwin' offers features {}, the workers offer {}, waiting up to 120s for a worker
vsjgx7bv36g1n0badmig6bdip498yb0v-clan-runtime.drv: no connected, non-draining worker for system 'aarch64-darwin' offers features {}, the workers offer {}
error: dependency 'vsjgx7bv36g1n0badmig6bdip498yb0v-clan-runtime.drv' failed
failed checks.aarch64-darwin.eval-tests 2m 7s
setup: fgrydzvnipfr61cdq6n586yvr7qnj9ya-evalCheck-eval-lib-values.drv: no connected, non-draining worker for system 'aarch64-darwin' offers features {}, the wor …
setup:
fgrydzvnipfr61cdq6n586yvr7qnj9ya-evalCheck-eval-lib-values.drv: no connected, non-draining worker for system 'aarch64-darwin' offers features {}, the workers offer {}
i7g0sip1qvrf3rsawgk3spcc1d75wpj3-evalCheck-lib-jsonschema-unit-tests.drv: no connected, non-draining worker for system 'aarch64-darwin' offers features {}, the workers offer {}
n4b8fx2lph1y27j635k0d7fzdh990yj4-evalCheck-eval-tests-types.drv: no connected, non-draining worker for system 'aarch64-darwin' offers features {}, the workers offer {}
nwxpwg3wqcyan39cdpr5pnbxvhda55kq-evalCheck-eval-module-clan-vars.drv: no connected, non-draining worker for system 'aarch64-darwin' offers features {}, the workers offer {}
r3mjd45rdh303c17rkd3jl6ail1pphgj-evalCheck-eval-lib-relativeDir.drv: no connected, non-draining worker for system 'aarch64-darwin' offers features {}, the workers offer {}
v36vzbz1m4hmgpk1fpla96hx9sny4a8y-evalCheck-eval-tests-syncthing.drv: no connected, non-draining worker for system 'aarch64-darwin' offers features {}, the workers offer {}
wfs5yggyk3s53kzfayqp30dza00fdl3k-evalCheck-eval-lib-build-clan.drv: no connected, non-draining worker for system 'aarch64-darwin' offers features {}, the workers offer {}
error: dependency '67x9nlxrwghkrcdmcim5wb1q39mn6r48-evalCheck-eval-lib-exports.drv' failed
failed checks.aarch64-darwin.treefmt 2m 5s
setup: warning: rx5pxikcvm5z95kx61w8wa6m06zrqb4w-Terms.yml.drv: no connected, non-draining worker for system 'aarch64-darwin' offers features {}, the workers of …
setup:
warning: rx5pxikcvm5z95kx61w8wa6m06zrqb4w-Terms.yml.drv: no connected, non-draining worker for system 'aarch64-darwin' offers features {}, the workers offer {}, waiting up to 120s for a worker
warning: zbapc0x7k24x20sq2k0m2zcpdxzlzgnp-sizelint.toml.drv: no connected, non-draining worker for system 'aarch64-darwin' offers features {}, the workers offer {}, waiting up to 120s for a worker
0a2plmf8sq4rii1i3qxdmyiwnfqzfhqy-flake-edit.toml.drv: no connected, non-draining worker for system 'aarch64-darwin' offers features {}, the workers offer {}
9bm3fnyv1px2rcxyb7bjdfibg5vd3nj3-fmt-nix-codeblocks.drv: no connected, non-draining worker for system 'aarch64-darwin' offers features {}, the workers offer {}
qgyz1jxvkphwlgf9kz6bh68r8p8ywgk5-lint-cross-compat.drv: no connected, non-draining worker for system 'aarch64-darwin' offers features {}, the workers offer {}
rx5pxikcvm5z95kx61w8wa6m06zrqb4w-Terms.yml.drv: no connected, non-draining worker for system 'aarch64-darwin' offers features {}, the workers offer {}
zbapc0x7k24x20sq2k0m2zcpdxzlzgnp-sizelint.toml.drv: no connected, non-draining worker for system 'aarch64-darwin' offers features {}, the workers offer {}
error: dependency 'pj4hkazr33izi551si79kdj3q40ypiq3-treefmt.drv' failed
failed checks.aarch64-linux.admin 2m 19s
setup: g66fdvinfjr78qvdxgz9b314sw4gszc3-decrypt-age-secrets.drv: build01: build01: input not substitutable: error: path '/nix/store/xqmbsf4zbphr1657ibx6smxqy01k …
setup:
g66fdvinfjr78qvdxgz9b314sw4gszc3-decrypt-age-secrets.drv: build01: build01: input not substitutable: error: path '/nix/store/xqmbsf4zbphr1657ibx6smxqy01k1p69-mount-secret-fs' is required, but there is no substituter that can build it, asking the scheduler again
ahwky2imndrhg86zbs119ldh71fs54x8-X-Restart-Triggers-nix-daemon.drv: build01: build01: input not substitutable: error: path '/nix/store/9d7gg64nc7x6cp7p8baznwr3agibzmfr-nix.conf' is required, but there is no substituter that can build it, asking the scheduler again
g66fdvinfjr78qvdxgz9b314sw4gszc3-decrypt-age-secrets.drv: build01: build01: input not substitutable: error: path '/nix/store/xqmbsf4zbphr1657ibx6smxqy01k1p69-mount-secret-fs' is required, but there is no substituter that can build it, asking the scheduler again
ahwky2imndrhg86zbs119ldh71fs54x8-X-Restart-Triggers-nix-daemon.drv: build01: build01: input not substitutable: error: path '/nix/store/9d7gg64nc7x6cp7p8baznwr3agibzmfr-nix.conf' is required, but there is no substituter that can build it, asking the scheduler again
y8w6xrp7xpgzg6md1hvbfplzhpy26q11-decrypt-age-secrets.drv: build01: build01: input not substitutable: error: path '/nix/store/xqmbsf4zbphr1657ibx6smxqy01k1p69-mount-secret-fs' is required, but there is no substituter that can build it, asking the scheduler again
g66fdvinfjr78qvdxgz9b314sw4gszc3-decrypt-age-secrets.drv: build01: build01: input not substitutable: error: path '/nix/store/xqmbsf4zbphr1657ibx6smxqy01k1p69-mount-secret-fs' is required, but there is no substituter that can build it, asking the scheduler again
ahwky2imndrhg86zbs119ldh71fs54x8-X-Restart-Triggers-nix-daemon.drv: build01: build01: input not substitutable: error: path '/nix/store/9d7gg64nc7x6cp7p8baznwr3agibzmfr-nix.conf' is required, but there is no substituter that can build it, asking the scheduler again
error: dependency 'i2fwc9z7pl8459iknxsxpsg3vam6a4bx-nixos-test-driver-admin.drv' failed
failed eval checks.aarch64-linux.all-packages —
error: … while calling the 'derivationStrict' builtin at «nix-internal»/derivation-internal.nix:37:12: 36| 37| strict = …
error:
       … while calling the 'derivationStrict' builtin
         at «nix-internal»/derivation-internal.nix:37:12:
           36|
           37|   strict = derivationStrict drvAttrs;
             |            ^
           38|

       … while evaluating derivation 'all-packages'
         whose name attribute is located at «https://releases.nixos.org/nixos/26.05/nixos-26.05.11576.7c8764b7c7b0/nixexprs.tar.xz?narHash=sha256-/hsaG8yWXZjTs6WJS2xnerd9VKBgJ8jN8e5ELHLt%2Bbs%3D»/pkgs/stdenv/generic/make-derivation.nix:647:11

       … while evaluating attribute 'buildCommand' of derivation 'all-packages'
         at «https://releases.nixos.org/nixos/26.05/nixos-26.05.11576.7c8764b7c7b0/nixexprs.tar.xz?narHash=sha256-/hsaG8yWXZjTs6WJS2xnerd9VKBgJ8jN8e5ELHLt%2Bbs%3D»/pkgs/build-support/trivial-builders/default.nix:81:17:
           80|         enableParallelBuilding = true;
           81|         inherit buildCommand name;
             |                 ^
           82|         passAsFile = [ "buildCommand" ] ++ (derivationArgs.passAsFile or [ ]);

       (stack trace truncated; use '--show-trace' to show the full, detailed trace)

       error: Refusing to evaluate package 'pnpm-10.34.0' in /nix/store/caswzvky10pm1m7rhdizrai4mh7wa6z4-source/pkgs/development/tools/pnpm/generic.nix:170 because it is marked as insecure

       Known issues:
        - CVE-2026-55487
        - CVE-2026-55698
        - CVE-2026-55180
        - CVE-2026-55697
        - CVE-2026-59194
        - CVE-2026-59195
        - CVE-2026-59196
        - CVE-2026-82392
        - CVE-2026-82393

       You can install it anyway by allowing this package, using the
       following methods:

       a) To temporarily allow all insecure packages, you can use an environment
          variable for a single invocation of the nix tools:

            $ export NIXPKGS_ALLOW_INSECURE=1

          Note: When using `nix shell`, `nix build`, `nix develop`, etc with a flake,
                then pass `--impure` in order to allow use of environment variables.

       b) for `nixos-rebuild` you can add ‘pnpm-10.34.0’ to
          `nixpkgs.config.permittedInsecurePackages` in the configuration.nix,
          like so:

            {
              nixpkgs.config.permittedInsecurePackages = [
                "pnpm-10.34.0"
              ];
            }

       c) For `nix-env`, `nix-build`, `nix-shell` or any other Nix command you can add
          ‘pnpm-10.34.0’ to `permittedInsecurePackages` in
          ~/.config/nixpkgs/config.nix, like so:

            {
              permittedInsecurePackages = [
                "pnpm-10.34.0"
              ];
            }
failed eval checks.aarch64-linux.borgbackup —
error: … while evaluating the attribute 'drvPath' at «https://releases.nixos.org/nixos/26.05/nixos-26.05.11576.7c8764b7c7b0/nixexprs.tar.xz?narH …
error:
       … while evaluating the attribute 'drvPath'
         at «https://releases.nixos.org/nixos/26.05/nixos-26.05.11576.7c8764b7c7b0/nixexprs.tar.xz?narHash=sha256-/hsaG8yWXZjTs6WJS2xnerd9VKBgJ8jN8e5ELHLt%2Bbs%3D»/lib/customisation.nix:427:7:
          426|     // {
          427|       drvPath =
             |       ^
          428|         assert condition;

       … while calling the 'derivationStrict' builtin
         at «nix-internal»/derivation-internal.nix:37:12:
           36|
           37|   strict = derivationStrict drvAttrs;
             |            ^
           38|

       … while evaluating the option `nodes.clientone.networking.interfaces':

       … while evaluating definitions from `/nix/store/caswzvky10pm1m7rhdizrai4mh7wa6z4-source/nixos/modules/hardware/facter/networking':

       … while evaluating the option `nodes.clientone.hardware.facter.enable':

       … while evaluating the option `nodes.clientone.hardware.facter.report':

       … while evaluating the option `nodes.clientone.hardware.facter.reportPath':

       … while evaluating definitions from `/nix/store/pwmb9rwn0zk87bkxk2w1jmkahrsqlvzh-source/nixosModules/clanCore/nixos-facter.nix':

       (stack trace truncated; use '--show-trace' to show the full, detailed trace)

       error: build of '/nix/store/iymk7adx6w7kdzk12m8yl90s7n15qava-merged-test-dir-borgbackup.drv^out' failed: error: gave up after 9 reschedules
failed eval checks.aarch64-linux.certificates —
error: … while evaluating the attribute 'drvPath' at «https://releases.nixos.org/nixos/26.05/nixos-26.05.11576.7c8764b7c7b0/nixexprs.tar.xz?narH …
error:
       … while evaluating the attribute 'drvPath'
         at «https://releases.nixos.org/nixos/26.05/nixos-26.05.11576.7c8764b7c7b0/nixexprs.tar.xz?narHash=sha256-/hsaG8yWXZjTs6WJS2xnerd9VKBgJ8jN8e5ELHLt%2Bbs%3D»/lib/customisation.nix:427:7:
          426|     // {
          427|       drvPath =
             |       ^
          428|         assert condition;

       … while calling the 'derivationStrict' builtin
         at «nix-internal»/derivation-internal.nix:37:12:
           36|
           37|   strict = derivationStrict drvAttrs;
             |            ^
           38|

       … while evaluating the option `nodes.ca.networking.interfaces':

       … while evaluating definitions from `/nix/store/caswzvky10pm1m7rhdizrai4mh7wa6z4-source/nixos/modules/hardware/facter/networking':

       … while evaluating the option `nodes.ca.hardware.facter.enable':

       … while evaluating the option `nodes.ca.hardware.facter.report':

       … while evaluating the option `nodes.ca.hardware.facter.reportPath':

       … while evaluating definitions from `/nix/store/pwmb9rwn0zk87bkxk2w1jmkahrsqlvzh-source/nixosModules/clanCore/nixos-facter.nix':

       (stack trace truncated; use '--show-trace' to show the full, detailed trace)

       error: build of '/nix/store/4l0b6fay94iqq24kqzjr0340hb8isk8v-merged-test-dir-certificates.drv^out' failed: error: gave up after 9 reschedules
failed checks.aarch64-linux.clan-app-ui-lint 13s
setup: 1n8a0wc7kqz3cdkynvb7s04vfglk3d6r--clan-ui-0.0.1-sources.drv: build01: build01: input not substitutable: error: path '/nix/store/2x6as2a8nf5m8kkx73jq4g17n …
setup:
1n8a0wc7kqz3cdkynvb7s04vfglk3d6r--clan-ui-0.0.1-sources.drv: build01: build01: input not substitutable: error: path '/nix/store/2x6as2a8nf5m8kkx73jq4g17n430s2m6-autoprefixer-10.4.21.tgz' is required, but there is no substituter that can build it, asking the scheduler again
1n8a0wc7kqz3cdkynvb7s04vfglk3d6r--clan-ui-0.0.1-sources.drv: build01: build01: input not substitutable: error: path '/nix/store/2x6as2a8nf5m8kkx73jq4g17n430s2m6-autoprefixer-10.4.21.tgz' is required, but there is no substituter that can build it, asking the scheduler again
1n8a0wc7kqz3cdkynvb7s04vfglk3d6r--clan-ui-0.0.1-sources.drv: build01: build01: input not substitutable: error: path '/nix/store/2x6as2a8nf5m8kkx73jq4g17n430s2m6-autoprefixer-10.4.21.tgz' is required, but there is no substituter that can build it, asking the scheduler again
1n8a0wc7kqz3cdkynvb7s04vfglk3d6r--clan-ui-0.0.1-sources.drv: build01: build01: input not substitutable: error: path '/nix/store/2x6as2a8nf5m8kkx73jq4g17n430s2m6-autoprefixer-10.4.21.tgz' is required, but there is no substituter that can build it, asking the scheduler again
1n8a0wc7kqz3cdkynvb7s04vfglk3d6r--clan-ui-0.0.1-sources.drv: build01: build01: input not substitutable: error: path '/nix/store/2x6as2a8nf5m8kkx73jq4g17n430s2m6-autoprefixer-10.4.21.tgz' is required, but there is no substituter that can build it, asking the scheduler again
1n8a0wc7kqz3cdkynvb7s04vfglk3d6r--clan-ui-0.0.1-sources.drv: build01: build01: input not substitutable: error: path '/nix/store/2x6as2a8nf5m8kkx73jq4g17n430s2m6-autoprefixer-10.4.21.tgz' is required, but there is no substituter that can build it, asking the scheduler again
1n8a0wc7kqz3cdkynvb7s04vfglk3d6r--clan-ui-0.0.1-sources.drv: build01: build01: input not substitutable: error: path '/nix/store/2x6as2a8nf5m8kkx73jq4g17n430s2m6-autoprefixer-10.4.21.tgz' is required, but there is no substituter that can build it, asking the scheduler again
error: dependency '1n8a0wc7kqz3cdkynvb7s04vfglk3d6r--clan-ui-0.0.1-sources.drv' failed
failed checks.aarch64-linux.clan-pytest-with-core 6m 11s
setup: gjxgivg6ksjpkyjlphcm665hgxz5smmg-closure-info.drv: build01: build01: input not substitutable: error: path '/nix/store/hqn7y2zlq6f99ikrmrqhgcc19pvmqc10-ze …
setup:
gjxgivg6ksjpkyjlphcm665hgxz5smmg-closure-info.drv: build01: build01: input not substitutable: error: path '/nix/store/hqn7y2zlq6f99ikrmrqhgcc19pvmqc10-zerotierone-1.16.0' is required, but there is no substituter that can build it, asking the scheduler again
gjxgivg6ksjpkyjlphcm665hgxz5smmg-closure-info.drv: build01: build01: input not substitutable: error: path '/nix/store/hqn7y2zlq6f99ikrmrqhgcc19pvmqc10-zerotierone-1.16.0' is required, but there is no substituter that can build it, asking the scheduler again
gjxgivg6ksjpkyjlphcm665hgxz5smmg-closure-info.drv: build01: build01: input not substitutable: error: path '/nix/store/hqn7y2zlq6f99ikrmrqhgcc19pvmqc10-zerotierone-1.16.0' is required, but there is no substituter that can build it, asking the scheduler again
gjxgivg6ksjpkyjlphcm665hgxz5smmg-closure-info.drv: build01: build01: input not substitutable: error: path '/nix/store/hqn7y2zlq6f99ikrmrqhgcc19pvmqc10-zerotierone-1.16.0' is required, but there is no substituter that can build it, asking the scheduler again
gjxgivg6ksjpkyjlphcm665hgxz5smmg-closure-info.drv: build01: build01: input not substitutable: error: path '/nix/store/hqn7y2zlq6f99ikrmrqhgcc19pvmqc10-zerotierone-1.16.0' is required, but there is no substituter that can build it, asking the scheduler again
gjxgivg6ksjpkyjlphcm665hgxz5smmg-closure-info.drv: build01: build01: input not substitutable: error: path '/nix/store/hqn7y2zlq6f99ikrmrqhgcc19pvmqc10-zerotierone-1.16.0' is required, but there is no substituter that can build it, asking the scheduler again
gjxgivg6ksjpkyjlphcm665hgxz5smmg-closure-info.drv: build01: build01: input not substitutable: error: path '/nix/store/hqn7y2zlq6f99ikrmrqhgcc19pvmqc10-zerotierone-1.16.0' is required, but there is no substituter that can build it, asking the scheduler again
error: dependency 'gjxgivg6ksjpkyjlphcm665hgxz5smmg-closure-info.drv' failed
failed eval checks.aarch64-linux.clan-site-lint —
error: … while calling the 'derivationStrict' builtin at «nix-internal»/derivation-internal.nix:37:12: 36| 37| strict = …
error:
       … while calling the 'derivationStrict' builtin
         at «nix-internal»/derivation-internal.nix:37:12:
           36|
           37|   strict = derivationStrict drvAttrs;
             |            ^
           38|

       … while evaluating derivation 'clan-site-lint'
         whose name attribute is located at «https://releases.nixos.org/nixos/26.05/nixos-26.05.11576.7c8764b7c7b0/nixexprs.tar.xz?narHash=sha256-/hsaG8yWXZjTs6WJS2xnerd9VKBgJ8jN8e5ELHLt%2Bbs%3D»/pkgs/stdenv/generic/make-derivation.nix:647:11

       … while evaluating attribute 'nativeBuildInputs' of derivation 'clan-site-lint'
         at «https://releases.nixos.org/nixos/26.05/nixos-26.05.11576.7c8764b7c7b0/nixexprs.tar.xz?narHash=sha256-/hsaG8yWXZjTs6WJS2xnerd9VKBgJ8jN8e5ELHLt%2Bbs%3D»/pkgs/stdenv/generic/make-derivation.nix:715:11:
          714|           depsBuildBuild = buildBuildOutputs;
          715|           nativeBuildInputs = buildHostOutputs;
             |           ^
          716|           depsBuildTarget = buildTargetOutputs;

       (stack trace truncated; use '--show-trace' to show the full, detailed trace)

       error: Refusing to evaluate package 'pnpm-10.34.0' in /nix/store/caswzvky10pm1m7rhdizrai4mh7wa6z4-source/pkgs/development/tools/pnpm/generic.nix:170 because it is marked as insecure

       Known issues:
        - CVE-2026-55487
        - CVE-2026-55698
        - CVE-2026-55180
        - CVE-2026-55697
        - CVE-2026-59194
        - CVE-2026-59195
        - CVE-2026-59196
        - CVE-2026-82392
        - CVE-2026-82393

       You can install it anyway by allowing this package, using the
       following methods:

       a) To temporarily allow all insecure packages, you can use an environment
          variable for a single invocation of the nix tools:

            $ export NIXPKGS_ALLOW_INSECURE=1

          Note: When using `nix shell`, `nix build`, `nix develop`, etc with a flake,
                then pass `--impure` in order to allow use of environment variables.

       b) for `nixos-rebuild` you can add ‘pnpm-10.34.0’ to
          `nixpkgs.config.permittedInsecurePackages` in the configuration.nix,
          like so:

            {
              nixpkgs.config.permittedInsecurePackages = [
                "pnpm-10.34.0"
              ];
            }

       c) For `nix-env`, `nix-build`, `nix-shell` or any other Nix command you can add
          ‘pnpm-10.34.0’ to `permittedInsecurePackages` in
          ~/.config/nixpkgs/config.nix, like so:

            {
              permittedInsecurePackages = [
                "pnpm-10.34.0"
              ];
            }
failed checks.aarch64-linux.clan-test-iso 5m 56s
setup: vqk9ng4gqqiisrsgyqkq1zjgirssljf5-command-not-found.drv: build01: build01: input not substitutable: error: path '/nix/store/5fdmcpd1nqkzidxc440jdix6z98n16 …
setup:
vqk9ng4gqqiisrsgyqkq1zjgirssljf5-command-not-found.drv: build01: build01: input not substitutable: error: path '/nix/store/5fdmcpd1nqkzidxc440jdix6z98n16gc-perl-5.42.3-env' is required, but there is no substituter that can build it, asking the scheduler again
vqk9ng4gqqiisrsgyqkq1zjgirssljf5-command-not-found.drv: build01: the build this call attached to did not finish, retry, asking the scheduler again
vqk9ng4gqqiisrsgyqkq1zjgirssljf5-command-not-found.drv: build01: the build this call attached to did not finish, retry, asking the scheduler again
vqk9ng4gqqiisrsgyqkq1zjgirssljf5-command-not-found.drv: build01: the build this call attached to did not finish, retry, asking the scheduler again
hzkwmqmykz12yzi97lrghcv5rbvkpcil-etc-nix-registry.json.drv: build01: not scheduled here: hzkwmqmykz12yzi97lrghcv5rbvkpcil-etc-nix-registry.json.drv, asking the scheduler again
7x37g76scwxnzj1z0f3046szz2hldw38-clan-runtime.drv: build01: not scheduled here: 7x37g76scwxnzj1z0f3046szz2hldw38-clan-runtime.drv, asking the scheduler again
i1y82mrhmxm0bhm7jskzycqyp9rgqfzi-offline-flake-for-test-clan-test-iso.drv: build01: not scheduled here: i1y82mrhmxm0bhm7jskzycqyp9rgqfzi-offline-flake-for-test-clan-test-iso.drv, asking the scheduler again
error: dependency 'gv0rdhgmnrjwya0qcn1ckypikpc3g2cd-nixos-test-driver-clan-test-iso.drv' failed
failed checks.aarch64-linux.darwin-test-darwin-machine 2m 3s
setup: q52zn986wach507sllk5f15iya7z5rgg-fonts.drv: no connected, non-draining worker for system 'aarch64-darwin' offers features {}, the workers offer {} qm4r6l …
setup:
q52zn986wach507sllk5f15iya7z5rgg-fonts.drv: no connected, non-draining worker for system 'aarch64-darwin' offers features {}, the workers offer {}
qm4r6lgv1ld1pdf52ndlra10gsm97mr8-darwin-rebuild.drv: no connected, non-draining worker for system 'aarch64-darwin' offers features {}, the workers offer {}
rjrx4i80iwd7xri74wfsfxi8fsal8gbp-set-environment.drv: no connected, non-draining worker for system 'aarch64-darwin' offers features {}, the workers offer {}
sszkycqia3vjcaw0fxfl1c70kn2gpk75-options.json.drv: no connected, non-draining worker for system 'aarch64-darwin' offers features {}, the workers offer {}
w4afz2impwxc5cqv08bsa2vh6gr5pl3d-patches.drv: no connected, non-draining worker for system 'aarch64-darwin' offers features {}, the workers offer {}
y5f294bglikn7b7gcnlchbaj9j1qmfjf-etc-099-host-keys.conf.drv: no connected, non-draining worker for system 'aarch64-darwin' offers features {}, the workers offer {}
y6v0x6ql68q9080awrq8ab9mw6l1gavh-launchd.drv: no connected, non-draining worker for system 'aarch64-darwin' offers features {}, the workers offer {}
error: dependency 'j1mh3425y39c8nbwfm2i1gyv7ngmr50w-darwin-version.json.drv' failed
failed eval checks.aarch64-linux.data-mesher —
error: … while evaluating the attribute 'drvPath' at «https://releases.nixos.org/nixos/26.05/nixos-26.05.11576.7c8764b7c7b0/nixexprs.tar.xz?narH …
error:
       … while evaluating the attribute 'drvPath'
         at «https://releases.nixos.org/nixos/26.05/nixos-26.05.11576.7c8764b7c7b0/nixexprs.tar.xz?narHash=sha256-/hsaG8yWXZjTs6WJS2xnerd9VKBgJ8jN8e5ELHLt%2Bbs%3D»/lib/customisation.nix:427:7:
          426|     // {
          427|       drvPath =
             |       ^
          428|         assert condition;

       … while calling the 'derivationStrict' builtin
         at «nix-internal»/derivation-internal.nix:37:12:
           36|
           37|   strict = derivationStrict drvAttrs;
             |            ^
           38|

       … while evaluating the option `nodes.alpha.networking.interfaces':

       … while evaluating definitions from `/nix/store/caswzvky10pm1m7rhdizrai4mh7wa6z4-source/nixos/modules/hardware/facter/networking':

       … while evaluating the option `nodes.alpha.hardware.facter.enable':

       … while evaluating the option `nodes.alpha.hardware.facter.report':

       … while evaluating the option `nodes.alpha.hardware.facter.reportPath':

       … while evaluating definitions from `/nix/store/pwmb9rwn0zk87bkxk2w1jmkahrsqlvzh-source/nixosModules/clanCore/nixos-facter.nix':

       (stack trace truncated; use '--show-trace' to show the full, detailed trace)

       error: build of '/nix/store/lxif27z7q5sh1w5ml9zwwai1q3fm5005-merged-test-dir-data-mesher.drv^out' failed: error: gave up after 9 reschedules
failed eval checks.aarch64-linux.devShell-clan-site —
error: … while calling the 'derivationStrict' builtin at «nix-internal»/derivation-internal.nix:37:12: 36| 37| strict = …
error:
       … while calling the 'derivationStrict' builtin
         at «nix-internal»/derivation-internal.nix:37:12:
           36|
           37|   strict = derivationStrict drvAttrs;
             |            ^
           38|

       … while evaluating derivation 'nix-shell'
         whose name attribute is located at «https://releases.nixos.org/nixos/26.05/nixos-26.05.11576.7c8764b7c7b0/nixexprs.tar.xz?narHash=sha256-/hsaG8yWXZjTs6WJS2xnerd9VKBgJ8jN8e5ELHLt%2Bbs%3D»/pkgs/stdenv/generic/make-derivation.nix:647:11

       … while evaluating attribute 'nativeBuildInputs' of derivation 'nix-shell'
         at «https://releases.nixos.org/nixos/26.05/nixos-26.05.11576.7c8764b7c7b0/nixexprs.tar.xz?narHash=sha256-/hsaG8yWXZjTs6WJS2xnerd9VKBgJ8jN8e5ELHLt%2Bbs%3D»/pkgs/stdenv/generic/make-derivation.nix:715:11:
          714|           depsBuildBuild = buildBuildOutputs;
          715|           nativeBuildInputs = buildHostOutputs;
             |           ^
          716|           depsBuildTarget = buildTargetOutputs;

       (stack trace truncated; use '--show-trace' to show the full, detailed trace)

       error: Refusing to evaluate package 'pnpm-10.34.0' in /nix/store/caswzvky10pm1m7rhdizrai4mh7wa6z4-source/pkgs/development/tools/pnpm/generic.nix:170 because it is marked as insecure

       Known issues:
        - CVE-2026-55487
        - CVE-2026-55698
        - CVE-2026-55180
        - CVE-2026-55697
        - CVE-2026-59194
        - CVE-2026-59195
        - CVE-2026-59196
        - CVE-2026-82392
        - CVE-2026-82393

       You can install it anyway by allowing this package, using the
       following methods:

       a) To temporarily allow all insecure packages, you can use an environment
          variable for a single invocation of the nix tools:

            $ export NIXPKGS_ALLOW_INSECURE=1

          Note: When using `nix shell`, `nix build`, `nix develop`, etc with a flake,
                then pass `--impure` in order to allow use of environment variables.

       b) for `nixos-rebuild` you can add ‘pnpm-10.34.0’ to
          `nixpkgs.config.permittedInsecurePackages` in the configuration.nix,
          like so:

            {
              nixpkgs.config.permittedInsecurePackages = [
                "pnpm-10.34.0"
              ];
            }

       c) For `nix-env`, `nix-build`, `nix-shell` or any other Nix command you can add
          ‘pnpm-10.34.0’ to `permittedInsecurePackages` in
          ~/.config/nixpkgs/config.nix, like so:

            {
              permittedInsecurePackages = [
                "pnpm-10.34.0"
              ];
            }
failed eval checks.aarch64-linux.devShell-docs —
error: … while calling the 'derivationStrict' builtin at «nix-internal»/derivation-internal.nix:37:12: 36| 37| strict = …
error:
       … while calling the 'derivationStrict' builtin
         at «nix-internal»/derivation-internal.nix:37:12:
           36|
           37|   strict = derivationStrict drvAttrs;
             |            ^
           38|

       … while evaluating derivation 'nix-shell'
         whose name attribute is located at «https://releases.nixos.org/nixos/26.05/nixos-26.05.11576.7c8764b7c7b0/nixexprs.tar.xz?narHash=sha256-/hsaG8yWXZjTs6WJS2xnerd9VKBgJ8jN8e5ELHLt%2Bbs%3D»/pkgs/stdenv/generic/make-derivation.nix:647:11

       … while evaluating attribute 'nativeBuildInputs' of derivation 'nix-shell'
         at «https://releases.nixos.org/nixos/26.05/nixos-26.05.11576.7c8764b7c7b0/nixexprs.tar.xz?narHash=sha256-/hsaG8yWXZjTs6WJS2xnerd9VKBgJ8jN8e5ELHLt%2Bbs%3D»/pkgs/stdenv/generic/make-derivation.nix:715:11:
          714|           depsBuildBuild = buildBuildOutputs;
          715|           nativeBuildInputs = buildHostOutputs;
             |           ^
          716|           depsBuildTarget = buildTargetOutputs;

       (stack trace truncated; use '--show-trace' to show the full, detailed trace)

       error: Refusing to evaluate package 'pnpm-10.34.0' in /nix/store/caswzvky10pm1m7rhdizrai4mh7wa6z4-source/pkgs/development/tools/pnpm/generic.nix:170 because it is marked as insecure

       Known issues:
        - CVE-2026-55487
        - CVE-2026-55698
        - CVE-2026-55180
        - CVE-2026-55697
        - CVE-2026-59194
        - CVE-2026-59195
        - CVE-2026-59196
        - CVE-2026-82392
        - CVE-2026-82393

       You can install it anyway by allowing this package, using the
       following methods:

       a) To temporarily allow all insecure packages, you can use an environment
          variable for a single invocation of the nix tools:

            $ export NIXPKGS_ALLOW_INSECURE=1

          Note: When using `nix shell`, `nix build`, `nix develop`, etc with a flake,
                then pass `--impure` in order to allow use of environment variables.

       b) for `nixos-rebuild` you can add ‘pnpm-10.34.0’ to
          `nixpkgs.config.permittedInsecurePackages` in the configuration.nix,
          like so:

            {
              nixpkgs.config.permittedInsecurePackages = [
                "pnpm-10.34.0"
              ];
            }

       c) For `nix-env`, `nix-build`, `nix-shell` or any other Nix command you can add
          ‘pnpm-10.34.0’ to `permittedInsecurePackages` in
          ~/.config/nixpkgs/config.nix, like so:

            {
              permittedInsecurePackages = [
                "pnpm-10.34.0"
              ];
            }
failed checks.aarch64-linux.dm-dns 1m 16s
setup: 3zplsckl0li4igishq6p8y8nhv3asc09-vars-check-dm-dns.drv: build01: build01: input not substitutable: error: path '/nix/store/sf9m1ashm741mnpq53p09j4ikpgnmk …
setup:
3zplsckl0li4igishq6p8y8nhv3asc09-vars-check-dm-dns.drv: build01: build01: input not substitutable: error: path '/nix/store/sf9m1ashm741mnpq53p09j4ikpgnmkbm-generator-state-version' is required, but there is no substituter that can build it, asking the scheduler again
vqk9ng4gqqiisrsgyqkq1zjgirssljf5-command-not-found.drv: build01: build01: input not substitutable: error: path '/nix/store/5fdmcpd1nqkzidxc440jdix6z98n16gc-perl-5.42.3-env' is required, but there is no substituter that can build it, asking the scheduler again
nhdnpsysj643yi6m3gkb04gkrj9795cl-decrypt-age-secrets.drv: build01: build01: input not substitutable: error: path '/nix/store/xqmbsf4zbphr1657ibx6smxqy01k1p69-mount-secret-fs' is required, but there is no substituter that can build it, asking the scheduler again
vqk9ng4gqqiisrsgyqkq1zjgirssljf5-command-not-found.drv: build01: build01: input not substitutable: error: path '/nix/store/5fdmcpd1nqkzidxc440jdix6z98n16gc-perl-5.42.3-env' is required, but there is no substituter that can build it, asking the scheduler again
nhdnpsysj643yi6m3gkb04gkrj9795cl-decrypt-age-secrets.drv: build01: build01: input not substitutable: error: path '/nix/store/xqmbsf4zbphr1657ibx6smxqy01k1p69-mount-secret-fs' is required, but there is no substituter that can build it, asking the scheduler again
5h3kimag6l6pljvnx39jphmb08pva54g-unit-nix-daemon.service.drv: build01: build01: input not substitutable: error: path '/nix/store/zc12x1yxf4yskzilqgq9ww7bfyfq1cvj-X-Restart-Triggers-nix-daemon' is required, but there is no substituter that can build it, asking the scheduler again
5h3kimag6l6pljvnx39jphmb08pva54g-unit-nix-daemon.service.drv: build01: build01: input not substitutable: error: path '/nix/store/zc12x1yxf4yskzilqgq9ww7bfyfq1cvj-X-Restart-Triggers-nix-daemon' is required, but there is no substituter that can build it, asking the scheduler again
error: dependency 'lsvx1yxxhd0hg24b9rrb8psgcanfcg2h-nixos-test-driver-dm-dns.drv' failed
failed eval checks.aarch64-linux.dyndns —
error: … while evaluating the attribute 'drvPath' at «https://releases.nixos.org/nixos/26.05/nixos-26.05.11576.7c8764b7c7b0/nixexprs.tar.xz?narH …
error:
       … while evaluating the attribute 'drvPath'
         at «https://releases.nixos.org/nixos/26.05/nixos-26.05.11576.7c8764b7c7b0/nixexprs.tar.xz?narHash=sha256-/hsaG8yWXZjTs6WJS2xnerd9VKBgJ8jN8e5ELHLt%2Bbs%3D»/lib/customisation.nix:427:7:
          426|     // {
          427|       drvPath =
             |       ^
          428|         assert condition;

       … while calling the 'derivationStrict' builtin
         at «nix-internal»/derivation-internal.nix:37:12:
           36|
           37|   strict = derivationStrict drvAttrs;
             |            ^
           38|

       … while evaluating the option `nodes.server.networking.interfaces':

       … while evaluating definitions from `/nix/store/caswzvky10pm1m7rhdizrai4mh7wa6z4-source/nixos/modules/hardware/facter/networking':

       … while evaluating the option `nodes.server.hardware.facter.enable':

       … while evaluating the option `nodes.server.hardware.facter.report':

       … while evaluating the option `nodes.server.hardware.facter.reportPath':

       … while evaluating definitions from `/nix/store/pwmb9rwn0zk87bkxk2w1jmkahrsqlvzh-source/nixosModules/clanCore/nixos-facter.nix':

       (stack trace truncated; use '--show-trace' to show the full, detailed trace)

       error: build of '/nix/store/darq811dz7hhr938i5kb7cj0n8b00y8d-merged-test-dir-dyndns.drv^out' failed: error: gave up after 9 reschedules
failed eval checks.aarch64-linux.garage —
error: … while evaluating the attribute 'drvPath' at «https://releases.nixos.org/nixos/26.05/nixos-26.05.11576.7c8764b7c7b0/nixexprs.tar.xz?narH …
error:
       … while evaluating the attribute 'drvPath'
         at «https://releases.nixos.org/nixos/26.05/nixos-26.05.11576.7c8764b7c7b0/nixexprs.tar.xz?narHash=sha256-/hsaG8yWXZjTs6WJS2xnerd9VKBgJ8jN8e5ELHLt%2Bbs%3D»/lib/customisation.nix:427:7:
          426|     // {
          427|       drvPath =
             |       ^
          428|         assert condition;

       … while calling the 'derivationStrict' builtin
         at «nix-internal»/derivation-internal.nix:37:12:
           36|
           37|   strict = derivationStrict drvAttrs;
             |            ^
           38|

       … while evaluating the option `nodes.server.networking.interfaces':

       … while evaluating definitions from `/nix/store/caswzvky10pm1m7rhdizrai4mh7wa6z4-source/nixos/modules/hardware/facter/networking':

       … while evaluating the option `nodes.server.hardware.facter.enable':

       … while evaluating the option `nodes.server.hardware.facter.report':

       … while evaluating the option `nodes.server.hardware.facter.reportPath':

       … while evaluating definitions from `/nix/store/pwmb9rwn0zk87bkxk2w1jmkahrsqlvzh-source/nixosModules/clanCore/nixos-facter.nix':

       (stack trace truncated; use '--show-trace' to show the full, detailed trace)

       error: build of '/nix/store/hz34jxpppz28hnd6rk3p7xy04y0dwlwl-merged-test-dir-garage.drv^out' failed: error: gave up after 9 reschedules
failed checks.aarch64-linux.hello-service 1m 12s
setup: 3akh5azr85730k55ds8iqrdg8cx5ifii-hosts.drv: build01: build01: input not substitutable: error: path '/nix/store/x0v0fw1nx8k364ixpd5r12k98p4j4w9k-string-ho …
setup:
3akh5azr85730k55ds8iqrdg8cx5ifii-hosts.drv: build01: build01: input not substitutable: error: path '/nix/store/x0v0fw1nx8k364ixpd5r12k98p4j4w9k-string-hosts' is required, but there is no substituter that can build it, asking the scheduler again
vqk9ng4gqqiisrsgyqkq1zjgirssljf5-command-not-found.drv: build01: the build this call attached to did not finish, retry, asking the scheduler again
4qxwipypv2pjyip0l49adj754y8x6i7h-vars-check-hello-service.drv: build01: build01: input not substitutable: error: path '/nix/store/sf9m1ashm741mnpq53p09j4ikpgnmkbm-generator-state-version' is required, but there is no substituter that can build it, asking the scheduler again
3yg3rm3psqz8fx3zdb33zil601d77a77-hosts.drv: build01: build01: input not substitutable: error: path '/nix/store/x11giw8xx9s5j7qc3nqkm46mcl9k0zl8-string-hosts' is required, but there is no substituter that can build it, asking the scheduler again
3akh5azr85730k55ds8iqrdg8cx5ifii-hosts.drv: build01: build01: input not substitutable: error: path '/nix/store/x0v0fw1nx8k364ixpd5r12k98p4j4w9k-string-hosts' is required, but there is no substituter that can build it, asking the scheduler again
4qxwipypv2pjyip0l49adj754y8x6i7h-vars-check-hello-service.drv: build01: build01: input not substitutable: error: path '/nix/store/sf9m1ashm741mnpq53p09j4ikpgnmkbm-generator-state-version' is required, but there is no substituter that can build it, asking the scheduler again
3yg3rm3psqz8fx3zdb33zil601d77a77-hosts.drv: build01: build01: input not substitutable: error: path '/nix/store/x11giw8xx9s5j7qc3nqkm46mcl9k0zl8-string-hosts' is required, but there is no substituter that can build it, asking the scheduler again
error: dependency 'y499danxin50snai201sdvizdq9hfs3y-nixos-test-driver-hello-service.drv' failed
failed eval checks.aarch64-linux.kde —
error: … while evaluating the attribute 'drvPath' at «https://releases.nixos.org/nixos/26.05/nixos-26.05.11576.7c8764b7c7b0/nixexprs.tar.xz?narH …
error:
       … while evaluating the attribute 'drvPath'
         at «https://releases.nixos.org/nixos/26.05/nixos-26.05.11576.7c8764b7c7b0/nixexprs.tar.xz?narHash=sha256-/hsaG8yWXZjTs6WJS2xnerd9VKBgJ8jN8e5ELHLt%2Bbs%3D»/lib/customisation.nix:427:7:
          426|     // {
          427|       drvPath =
             |       ^
          428|         assert condition;

       … while calling the 'derivationStrict' builtin
         at «nix-internal»/derivation-internal.nix:37:12:
           36|
           37|   strict = derivationStrict drvAttrs;
             |            ^
           38|

       … while evaluating the option `nodes.client.networking.interfaces':

       … while evaluating definitions from `/nix/store/caswzvky10pm1m7rhdizrai4mh7wa6z4-source/nixos/modules/hardware/facter/networking':

       … while evaluating the option `nodes.client.hardware.facter.enable':

       … while evaluating the option `nodes.client.hardware.facter.report':

       … while evaluating the option `nodes.client.hardware.facter.reportPath':

       … while evaluating definitions from `/nix/store/pwmb9rwn0zk87bkxk2w1jmkahrsqlvzh-source/nixosModules/clanCore/nixos-facter.nix':

       (stack trace truncated; use '--show-trace' to show the full, detailed trace)

       error: build of '/nix/store/4ipgq78dzbz4ddhb72ic0xh33l1ljcrd-merged-test-dir-kde.drv^out' failed: error: gave up after 9 reschedules
failed checks.aarch64-linux.localbackup 1m 34s
setup: g66fdvinfjr78qvdxgz9b314sw4gszc3-decrypt-age-secrets.drv: build01: build01: input not substitutable: error: path '/nix/store/xqmbsf4zbphr1657ibx6smxqy01k …
setup:
g66fdvinfjr78qvdxgz9b314sw4gszc3-decrypt-age-secrets.drv: build01: build01: input not substitutable: error: path '/nix/store/xqmbsf4zbphr1657ibx6smxqy01k1p69-mount-secret-fs' is required, but there is no substituter that can build it, asking the scheduler again
d1h1hxqcpbrrgi0vqfy0hxjy6xjhr7ml-unit-generate-shutdown-ramfs.service.drv: build01: build01: input not substitutable: error: path '/nix/store/4awk7klifj823kyjih5mcmd6r5pil3n6-shutdown-ramfs-contents.json' is required, but there is no substituter that can build it, asking the scheduler again
ahwky2imndrhg86zbs119ldh71fs54x8-X-Restart-Triggers-nix-daemon.drv: build01: the build this call attached to did not finish, retry, asking the scheduler again
vqk9ng4gqqiisrsgyqkq1zjgirssljf5-command-not-found.drv: build01: the build this call attached to did not finish, retry, asking the scheduler again
lyc46diqwapxp92s41yaag4yd0p74b0j-vars-check-localbackup.drv: build01: build01: input not substitutable: error: path '/nix/store/sf9m1ashm741mnpq53p09j4ikpgnmkbm-generator-state-version' is required, but there is no substituter that can build it, asking the scheduler again
d1h1hxqcpbrrgi0vqfy0hxjy6xjhr7ml-unit-generate-shutdown-ramfs.service.drv: build01: build01: input not substitutable: error: path '/nix/store/4awk7klifj823kyjih5mcmd6r5pil3n6-shutdown-ramfs-contents.json' is required, but there is no substituter that can build it, asking the scheduler again
ahwky2imndrhg86zbs119ldh71fs54x8-X-Restart-Triggers-nix-daemon.drv: build01: build01: input not substitutable: error: path '/nix/store/9d7gg64nc7x6cp7p8baznwr3agibzmfr-nix.conf' is required, but there is no substituter that can build it, asking the scheduler again
error: dependency 'lpq9vxdjmq4wkvbn236al9079zisq8vl-nixos-test-driver-localbackup.drv' failed
failed checks.aarch64-linux.machine-id 2m 26s
setup: g66fdvinfjr78qvdxgz9b314sw4gszc3-decrypt-age-secrets.drv: build01: build01: input not substitutable: error: path '/nix/store/xqmbsf4zbphr1657ibx6smxqy01k …
setup:
g66fdvinfjr78qvdxgz9b314sw4gszc3-decrypt-age-secrets.drv: build01: build01: input not substitutable: error: path '/nix/store/xqmbsf4zbphr1657ibx6smxqy01k1p69-mount-secret-fs' is required, but there is no substituter that can build it, asking the scheduler again
ahwky2imndrhg86zbs119ldh71fs54x8-X-Restart-Triggers-nix-daemon.drv: build01: build01: input not substitutable: error: path '/nix/store/9d7gg64nc7x6cp7p8baznwr3agibzmfr-nix.conf' is required, but there is no substituter that can build it, asking the scheduler again
qm6jbx3ja7qqj650zv7sv2jplvp8xkwb-shutdown-ramfs-contents.json.drv: build01: build01: input not substitutable: error: path '/nix/store/xgyfrbrvlxryqrlgd18rn6rpfzzv2awz-etc-os-release' is required, but there is no substituter that can build it, asking the scheduler again
36yc50wfxn26zipwcqjy5zvzq3gdywy2-vars-check-service-machine-id.drv: build01: build01: input not substitutable: error: path '/nix/store/sf9m1ashm741mnpq53p09j4ikpgnmkbm-generator-state-version' is required, but there is no substituter that can build it, asking the scheduler again
vqk9ng4gqqiisrsgyqkq1zjgirssljf5-command-not-found.drv: build01: build01: input not substitutable: error: path '/nix/store/5fdmcpd1nqkzidxc440jdix6z98n16gc-perl-5.42.3-env' is required, but there is no substituter that can build it, asking the scheduler again
g66fdvinfjr78qvdxgz9b314sw4gszc3-decrypt-age-secrets.drv: build01: build01: input not substitutable: error: path '/nix/store/xqmbsf4zbphr1657ibx6smxqy01k1p69-mount-secret-fs' is required, but there is no substituter that can build it, asking the scheduler again
ahwky2imndrhg86zbs119ldh71fs54x8-X-Restart-Triggers-nix-daemon.drv: build01: build01: input not substitutable: error: path '/nix/store/9d7gg64nc7x6cp7p8baznwr3agibzmfr-nix.conf' is required, but there is no substituter that can build it, asking the scheduler again
error: dependency 'n54fp9mwi6pch36s6hf0c2igi9fvh1da-nixos-test-driver-service-machine-id.drv' failed
failed checks.aarch64-linux.matrix-synapse 1m 1s
setup: 2vkvkfqamcs8yylj24vxir2rg9rrb0rv-decrypt-age-secrets.drv: build01: build01: input not substitutable: error: path '/nix/store/xqmbsf4zbphr1657ibx6smxqy01k …
setup:
2vkvkfqamcs8yylj24vxir2rg9rrb0rv-decrypt-age-secrets.drv: build01: build01: input not substitutable: error: path '/nix/store/xqmbsf4zbphr1657ibx6smxqy01k1p69-mount-secret-fs' is required, but there is no substituter that can build it, asking the scheduler again
8zwfnxd8p02k1wvx0jrkhcs0kygr38bx-vars-check-matrix-synapse.drv: build01: build01: input not substitutable: error: path '/nix/store/sf9m1ashm741mnpq53p09j4ikpgnmkbm-generator-state-version' is required, but there is no substituter that can build it, asking the scheduler again
5h3kimag6l6pljvnx39jphmb08pva54g-unit-nix-daemon.service.drv: build01: build01: input not substitutable: error: path '/nix/store/zc12x1yxf4yskzilqgq9ww7bfyfq1cvj-X-Restart-Triggers-nix-daemon' is required, but there is no substituter that can build it, asking the scheduler again
vqk9ng4gqqiisrsgyqkq1zjgirssljf5-command-not-found.drv: build01: build01: input not substitutable: error: path '/nix/store/5fdmcpd1nqkzidxc440jdix6z98n16gc-perl-5.42.3-env' is required, but there is no substituter that can build it, asking the scheduler again
2vkvkfqamcs8yylj24vxir2rg9rrb0rv-decrypt-age-secrets.drv: build01: build01: input not substitutable: error: path '/nix/store/xqmbsf4zbphr1657ibx6smxqy01k1p69-mount-secret-fs' is required, but there is no substituter that can build it, asking the scheduler again
8zwfnxd8p02k1wvx0jrkhcs0kygr38bx-vars-check-matrix-synapse.drv: build01: build01: input not substitutable: error: path '/nix/store/sf9m1ashm741mnpq53p09j4ikpgnmkbm-generator-state-version' is required, but there is no substituter that can build it, asking the scheduler again
5h3kimag6l6pljvnx39jphmb08pva54g-unit-nix-daemon.service.drv: build01: build01: input not substitutable: error: path '/nix/store/zc12x1yxf4yskzilqgq9ww7bfyfq1cvj-X-Restart-Triggers-nix-daemon' is required, but there is no substituter that can build it, asking the scheduler again
error: dependency '39y3czaizps4bswjwgb9x315prysyg85-nixos-test-driver-matrix-synapse.drv' failed
failed checks.aarch64-linux.monitoring 52s
setup: 8s0bwar8jf10c1sd991cngvwz2rmpi5x-vars-check-monitoring.drv: build01: build01: input not substitutable: error: path '/nix/store/sf9m1ashm741mnpq53p09j4ikp …
setup:
8s0bwar8jf10c1sd991cngvwz2rmpi5x-vars-check-monitoring.drv: build01: build01: input not substitutable: error: path '/nix/store/sf9m1ashm741mnpq53p09j4ikpgnmkbm-generator-state-version' is required, but there is no substituter that can build it, asking the scheduler again
ahwky2imndrhg86zbs119ldh71fs54x8-X-Restart-Triggers-nix-daemon.drv: build01: build01: input not substitutable: error: path '/nix/store/9d7gg64nc7x6cp7p8baznwr3agibzmfr-nix.conf' is required, but there is no substituter that can build it, asking the scheduler again
vqk9ng4gqqiisrsgyqkq1zjgirssljf5-command-not-found.drv: build01: build01: input not substitutable: error: path '/nix/store/5fdmcpd1nqkzidxc440jdix6z98n16gc-perl-5.42.3-env' is required, but there is no substituter that can build it, asking the scheduler again
xx690g9wcknk2ar3i95yc3ai7f9ljg45-decrypt-age-secrets.drv: build01: build01: input not substitutable: error: path '/nix/store/xqmbsf4zbphr1657ibx6smxqy01k1p69-mount-secret-fs' is required, but there is no substituter that can build it, asking the scheduler again
jad0j4v04vr7bnfavyl2lxzfr7yx9412-decrypt-age-secrets.drv: build01: build01: input not substitutable: error: path '/nix/store/xqmbsf4zbphr1657ibx6smxqy01k1p69-mount-secret-fs' is required, but there is no substituter that can build it, asking the scheduler again
d1h1hxqcpbrrgi0vqfy0hxjy6xjhr7ml-unit-generate-shutdown-ramfs.service.drv: build01: build01: input not substitutable: error: path '/nix/store/4awk7klifj823kyjih5mcmd6r5pil3n6-shutdown-ramfs-contents.json' is required, but there is no substituter that can build it, asking the scheduler again
ahwky2imndrhg86zbs119ldh71fs54x8-X-Restart-Triggers-nix-daemon.drv: build01: build01: input not substitutable: error: path '/nix/store/9d7gg64nc7x6cp7p8baznwr3agibzmfr-nix.conf' is required, but there is no substituter that can build it, asking the scheduler again
error: dependency '1rlg49k7mqm7r88aackhjrnpyv4vv00x-nixos-test-driver-monitoring.drv' failed
failed checks.aarch64-linux.mycelium 1m 11s
setup: 6h0img1xrssnshsawr94snk0crix5mf6-X-Reload-Triggers-systemd-networkd.drv: build01: build01: input not substitutable: error: path '/nix/store/czhvc93bj8zg5 …
setup:
6h0img1xrssnshsawr94snk0crix5mf6-X-Reload-Triggers-systemd-networkd.drv: build01: build01: input not substitutable: error: path '/nix/store/czhvc93bj8zg5vb8d1n0v4b5pzqp9025-unit-99-wireless-client-dhcp.network' is required, but there is no substituter that can build it, asking the scheduler again
ahwky2imndrhg86zbs119ldh71fs54x8-X-Restart-Triggers-nix-daemon.drv: build01: build01: input not substitutable: error: path '/nix/store/9d7gg64nc7x6cp7p8baznwr3agibzmfr-nix.conf' is required, but there is no substituter that can build it, asking the scheduler again
vqk9ng4gqqiisrsgyqkq1zjgirssljf5-command-not-found.drv: build01: the build this call attached to did not finish, retry, asking the scheduler again
qm6jbx3ja7qqj650zv7sv2jplvp8xkwb-shutdown-ramfs-contents.json.drv: build01: build01: input not substitutable: error: path '/nix/store/xgyfrbrvlxryqrlgd18rn6rpfzzv2awz-etc-os-release' is required, but there is no substituter that can build it, asking the scheduler again
lmqy64rxlsi772vfwz2mdh27317nkd5f-vars-check-mycelium.drv: build01: build01: input not substitutable: error: path '/nix/store/sf9m1ashm741mnpq53p09j4ikpgnmkbm-generator-state-version' is required, but there is no substituter that can build it, asking the scheduler again
6iaj3ylgwdlj60q3msjqgydjbfbr84ks-decrypt-age-secrets.drv: build01: build01: input not substitutable: error: path '/nix/store/xqmbsf4zbphr1657ibx6smxqy01k1p69-mount-secret-fs' is required, but there is no substituter that can build it, asking the scheduler again
ahwky2imndrhg86zbs119ldh71fs54x8-X-Restart-Triggers-nix-daemon.drv: build01: build01: input not substitutable: error: path '/nix/store/9d7gg64nc7x6cp7p8baznwr3agibzmfr-nix.conf' is required, but there is no substituter that can build it, asking the scheduler again
error: dependency 'c62ljhx1ih0m35nkgmxsp0kf3l6vgklk-nixos-test-driver-mycelium.drv' failed
failed checks.aarch64-linux.ncps 36s
setup: g66fdvinfjr78qvdxgz9b314sw4gszc3-decrypt-age-secrets.drv: build01: build01: input not substitutable: error: path '/nix/store/xqmbsf4zbphr1657ibx6smxqy01k …
setup:
g66fdvinfjr78qvdxgz9b314sw4gszc3-decrypt-age-secrets.drv: build01: build01: input not substitutable: error: path '/nix/store/xqmbsf4zbphr1657ibx6smxqy01k1p69-mount-secret-fs' is required, but there is no substituter that can build it, asking the scheduler again
jr2cy2nq73m6a16cp6i2qpm2lwxwb2y9-decrypt-age-secrets.drv: build01: build01: input not substitutable: error: path '/nix/store/xqmbsf4zbphr1657ibx6smxqy01k1p69-mount-secret-fs' is required, but there is no substituter that can build it, asking the scheduler again
ahwky2imndrhg86zbs119ldh71fs54x8-X-Restart-Triggers-nix-daemon.drv: build01: build01: input not substitutable: error: path '/nix/store/9d7gg64nc7x6cp7p8baznwr3agibzmfr-nix.conf' is required, but there is no substituter that can build it, asking the scheduler again
vqk9ng4gqqiisrsgyqkq1zjgirssljf5-command-not-found.drv: build01: build01: input not substitutable: error: path '/nix/store/5fdmcpd1nqkzidxc440jdix6z98n16gc-perl-5.42.3-env' is required, but there is no substituter that can build it, asking the scheduler again
w1k220d437wngmb9wx7mm3q8drm94bsy-vars-check-ncps.drv: build01: build01: input not substitutable: error: path '/nix/store/sf9m1ashm741mnpq53p09j4ikpgnmkbm-generator-state-version' is required, but there is no substituter that can build it, asking the scheduler again
jr2cy2nq73m6a16cp6i2qpm2lwxwb2y9-decrypt-age-secrets.drv: build01: build01: input not substitutable: error: path '/nix/store/xqmbsf4zbphr1657ibx6smxqy01k1p69-mount-secret-fs' is required, but there is no substituter that can build it, asking the scheduler again
jr2cy2nq73m6a16cp6i2qpm2lwxwb2y9-decrypt-age-secrets.drv: build01: build01: input not substitutable: error: path '/nix/store/xqmbsf4zbphr1657ibx6smxqy01k1p69-mount-secret-fs' is required, but there is no substituter that can build it, asking the scheduler again
error: dependency 'ma3m4bsf9f3vq0a6kn7dvyrs2v3x18d0-nixos-test-driver-ncps.drv' failed
failed checks.aarch64-linux.nixos-systemd-abstraction 4m 24s
setup: vqk9ng4gqqiisrsgyqkq1zjgirssljf5-command-not-found.drv: build01: build01: input not substitutable: error: path '/nix/store/5fdmcpd1nqkzidxc440jdix6z98n16 …
setup:
vqk9ng4gqqiisrsgyqkq1zjgirssljf5-command-not-found.drv: build01: build01: input not substitutable: error: path '/nix/store/5fdmcpd1nqkzidxc440jdix6z98n16gc-perl-5.42.3-env' is required, but there is no substituter that can build it, asking the scheduler again
vqk9ng4gqqiisrsgyqkq1zjgirssljf5-command-not-found.drv: build01: the build this call attached to did not finish, retry, asking the scheduler again
vqk9ng4gqqiisrsgyqkq1zjgirssljf5-command-not-found.drv: build01: build01: input not substitutable: error: path '/nix/store/5fdmcpd1nqkzidxc440jdix6z98n16gc-perl-5.42.3-env' is required, but there is no substituter that can build it, asking the scheduler again
vqk9ng4gqqiisrsgyqkq1zjgirssljf5-command-not-found.drv: build01: the build this call attached to did not finish, retry, asking the scheduler again
vqk9ng4gqqiisrsgyqkq1zjgirssljf5-command-not-found.drv: build01: the build this call attached to did not finish, retry, asking the scheduler again
vqk9ng4gqqiisrsgyqkq1zjgirssljf5-command-not-found.drv: build01: the build this call attached to did not finish, retry, asking the scheduler again
vqk9ng4gqqiisrsgyqkq1zjgirssljf5-command-not-found.drv: build01: the build this call attached to did not finish, retry, asking the scheduler again
error: dependency '4vl2r2969z61xsbfrccxynqgbz6jm7kf-nixos-test-driver-systemd-abstraction.drv' failed
failed checks.aarch64-linux.nixos-test-age-backend 39s
setup: 0k7dvr3z30s0k16byb6ipnl5059mhps7-decrypt-age-secrets.drv: build01: build01: input not substitutable: error: path '/nix/store/xqmbsf4zbphr1657ibx6smxqy01k …
setup:
0k7dvr3z30s0k16byb6ipnl5059mhps7-decrypt-age-secrets.drv: build01: build01: input not substitutable: error: path '/nix/store/xqmbsf4zbphr1657ibx6smxqy01k1p69-mount-secret-fs' is required, but there is no substituter that can build it, asking the scheduler again
4bl9xk0k6dc0cm33mkzskgm7qpaxs5mk-nixos-test-driver-1.1.drv: build01: build01: input not substitutable: error: path '/nix/store/pb86p6qw5x76w730n2pjzilmbx1lzvrh-python3.13-nixos-test-lib-1.0.0' is required, but there is no substituter that can build it, asking the scheduler again
vqk9ng4gqqiisrsgyqkq1zjgirssljf5-command-not-found.drv: build01: the build this call attached to did not finish, retry, asking the scheduler again
ahwky2imndrhg86zbs119ldh71fs54x8-X-Restart-Triggers-nix-daemon.drv: build01: build01: input not substitutable: error: path '/nix/store/9d7gg64nc7x6cp7p8baznwr3agibzmfr-nix.conf' is required, but there is no substituter that can build it, asking the scheduler again
6h0img1xrssnshsawr94snk0crix5mf6-X-Reload-Triggers-systemd-networkd.drv: build01: build01: input not substitutable: error: path '/nix/store/czhvc93bj8zg5vb8d1n0v4b5pzqp9025-unit-99-wireless-client-dhcp.network' is required, but there is no substituter that can build it, asking the scheduler again
4bl9xk0k6dc0cm33mkzskgm7qpaxs5mk-nixos-test-driver-1.1.drv: build01: build01: input not substitutable: error: path '/nix/store/pb86p6qw5x76w730n2pjzilmbx1lzvrh-python3.13-nixos-test-lib-1.0.0' is required, but there is no substituter that can build it, asking the scheduler again
4bl9xk0k6dc0cm33mkzskgm7qpaxs5mk-nixos-test-driver-1.1.drv: build01: build01: input not substitutable: error: path '/nix/store/pb86p6qw5x76w730n2pjzilmbx1lzvrh-python3.13-nixos-test-lib-1.0.0' is required, but there is no substituter that can build it, asking the scheduler again
error: dependency 'nfp0cdy3q8bzvgyabv9f0rl6vxb46xlj-nixos-test-driver-nixos-test-age-backend.drv' failed
failed checks.aarch64-linux.nixos-test-container 1m 18s
setup: vqk9ng4gqqiisrsgyqkq1zjgirssljf5-command-not-found.drv: build01: the build this call attached to did not finish, retry, asking the scheduler again d1h1hx …
setup:
vqk9ng4gqqiisrsgyqkq1zjgirssljf5-command-not-found.drv: build01: the build this call attached to did not finish, retry, asking the scheduler again
d1h1hxqcpbrrgi0vqfy0hxjy6xjhr7ml-unit-generate-shutdown-ramfs.service.drv: build01: build01: input not substitutable: error: path '/nix/store/4awk7klifj823kyjih5mcmd6r5pil3n6-shutdown-ramfs-contents.json' is required, but there is no substituter that can build it, asking the scheduler again
d1h1hxqcpbrrgi0vqfy0hxjy6xjhr7ml-unit-generate-shutdown-ramfs.service.drv: build01: build01: input not substitutable: error: path '/nix/store/4awk7klifj823kyjih5mcmd6r5pil3n6-shutdown-ramfs-contents.json' is required, but there is no substituter that can build it, asking the scheduler again
vqk9ng4gqqiisrsgyqkq1zjgirssljf5-command-not-found.drv: build01: the build this call attached to did not finish, retry, asking the scheduler again
d1h1hxqcpbrrgi0vqfy0hxjy6xjhr7ml-unit-generate-shutdown-ramfs.service.drv: build01: build01: input not substitutable: error: path '/nix/store/4awk7klifj823kyjih5mcmd6r5pil3n6-shutdown-ramfs-contents.json' is required, but there is no substituter that can build it, asking the scheduler again
vqk9ng4gqqiisrsgyqkq1zjgirssljf5-command-not-found.drv: build01: the build this call attached to did not finish, retry, asking the scheduler again
d1h1hxqcpbrrgi0vqfy0hxjy6xjhr7ml-unit-generate-shutdown-ramfs.service.drv: build01: build01: input not substitutable: error: path '/nix/store/4awk7klifj823kyjih5mcmd6r5pil3n6-shutdown-ramfs-contents.json' is required, but there is no substituter that can build it, asking the scheduler again
error: dependency 's9kcs4zlbnp5lf6vil6nz89qnh7xnnzr-nixos-test-driver-container.drv' failed
failed checks.aarch64-linux.nixos-test-extra-python-packages 1m 55s
setup: vqk9ng4gqqiisrsgyqkq1zjgirssljf5-command-not-found.drv: build01: the build this call attached to did not finish, retry, asking the scheduler again vqk9ng …
setup:
vqk9ng4gqqiisrsgyqkq1zjgirssljf5-command-not-found.drv: build01: the build this call attached to did not finish, retry, asking the scheduler again
vqk9ng4gqqiisrsgyqkq1zjgirssljf5-command-not-found.drv: build01: build01: input not substitutable: error: path '/nix/store/5fdmcpd1nqkzidxc440jdix6z98n16gc-perl-5.42.3-env' is required, but there is no substituter that can build it, asking the scheduler again
vqk9ng4gqqiisrsgyqkq1zjgirssljf5-command-not-found.drv: build01: the build this call attached to did not finish, retry, asking the scheduler again
vqk9ng4gqqiisrsgyqkq1zjgirssljf5-command-not-found.drv: build01: build01: input not substitutable: error: path '/nix/store/5fdmcpd1nqkzidxc440jdix6z98n16gc-perl-5.42.3-env' is required, but there is no substituter that can build it, asking the scheduler again
vqk9ng4gqqiisrsgyqkq1zjgirssljf5-command-not-found.drv: build01: build01: input not substitutable: error: path '/nix/store/5fdmcpd1nqkzidxc440jdix6z98n16gc-perl-5.42.3-env' is required, but there is no substituter that can build it, asking the scheduler again
vqk9ng4gqqiisrsgyqkq1zjgirssljf5-command-not-found.drv: build01: the build this call attached to did not finish, retry, asking the scheduler again
vqk9ng4gqqiisrsgyqkq1zjgirssljf5-command-not-found.drv: build01: the build this call attached to did not finish, retry, asking the scheduler again
error: dependency '8rgs3gx3nlx55v3p22q86ha5y62172cd-nixos-test-driver-test-extra-python-packages.drv' failed
failed eval checks.aarch64-linux.nixos-test-password-store-mounts —
error: … while evaluating the attribute 'drvPath' at «https://releases.nixos.org/nixos/26.05/nixos-26.05.11576.7c8764b7c7b0/nixexprs.tar.xz?narH …
error:
       … while evaluating the attribute 'drvPath'
         at «https://releases.nixos.org/nixos/26.05/nixos-26.05.11576.7c8764b7c7b0/nixexprs.tar.xz?narHash=sha256-/hsaG8yWXZjTs6WJS2xnerd9VKBgJ8jN8e5ELHLt%2Bbs%3D»/lib/customisation.nix:427:7:
          426|     // {
          427|       drvPath =
             |       ^
          428|         assert condition;

       … while calling the 'derivationStrict' builtin
         at «nix-internal»/derivation-internal.nix:37:12:
           36|
           37|   strict = derivationStrict drvAttrs;
             |            ^
           38|

       … while evaluating the option `driverConfiguration.vlans':

       … while evaluating definitions from `/nix/store/caswzvky10pm1m7rhdizrai4mh7wa6z4-source/nixos/lib/testing/driver-configuration.nix':

       … while evaluating the option `nodes.machine.networking.interfaces':

       … while evaluating definitions from `/nix/store/caswzvky10pm1m7rhdizrai4mh7wa6z4-source/nixos/modules/hardware/facter/networking':

       … while evaluating the option `nodes.machine.hardware.facter.enable':

       … while evaluating the option `nodes.machine.hardware.facter.report':

       … while evaluating the option `nodes.machine.hardware.facter.reportPath':

       … while evaluating definitions from `/nix/store/pwmb9rwn0zk87bkxk2w1jmkahrsqlvzh-source/nixosModules/clanCore/nixos-facter.nix':

       (stack trace truncated; use '--show-trace' to show the full, detailed trace)

       error: build of '/nix/store/2npa8ksh6qq562d7ydcvxg18h7hkjc3v-merged-test-dir-nixos-test-password-store-mounts.drv^out' failed: error: dependency 'kzq24jlnnp1gdcb31rnf2d2cznvp794d-test-vars-generated.drv' failed
failed checks.aarch64-linux.nixos-test-secrets 2m 14s
setup: qm6jbx3ja7qqj650zv7sv2jplvp8xkwb-shutdown-ramfs-contents.json.drv: build01: build01: input not substitutable: error: path '/nix/store/xgyfrbrvlxryqrlgd18 …
setup:
qm6jbx3ja7qqj650zv7sv2jplvp8xkwb-shutdown-ramfs-contents.json.drv: build01: build01: input not substitutable: error: path '/nix/store/xgyfrbrvlxryqrlgd18rn6rpfzzv2awz-etc-os-release' is required, but there is no substituter that can build it, asking the scheduler again
6h0img1xrssnshsawr94snk0crix5mf6-X-Reload-Triggers-systemd-networkd.drv: build01: build01: input not substitutable: error: path '/nix/store/czhvc93bj8zg5vb8d1n0v4b5pzqp9025-unit-99-wireless-client-dhcp.network' is required, but there is no substituter that can build it, asking the scheduler again
ahwky2imndrhg86zbs119ldh71fs54x8-X-Restart-Triggers-nix-daemon.drv: build01: build01: input not substitutable: error: path '/nix/store/9d7gg64nc7x6cp7p8baznwr3agibzmfr-nix.conf' is required, but there is no substituter that can build it, asking the scheduler again
vqk9ng4gqqiisrsgyqkq1zjgirssljf5-command-not-found.drv: build01: the build this call attached to did not finish, retry, asking the scheduler again
6h0img1xrssnshsawr94snk0crix5mf6-X-Reload-Triggers-systemd-networkd.drv: build01: build01: input not substitutable: error: path '/nix/store/czhvc93bj8zg5vb8d1n0v4b5pzqp9025-unit-99-wireless-client-dhcp.network' is required, but there is no substituter that can build it, asking the scheduler again
ahwky2imndrhg86zbs119ldh71fs54x8-X-Restart-Triggers-nix-daemon.drv: build01: the build this call attached to did not finish, retry, asking the scheduler again
6h0img1xrssnshsawr94snk0crix5mf6-X-Reload-Triggers-systemd-networkd.drv: build01: build01: input not substitutable: error: path '/nix/store/czhvc93bj8zg5vb8d1n0v4b5pzqp9025-unit-99-wireless-client-dhcp.network' is required, but there is no substituter that can build it, asking the scheduler again
error: dependency 'xwvw0a1ca5sg1fha2kv2xvzkncn9hlxf-nixos-test-driver-secrets.drv' failed
failed checks.aarch64-linux.nixos-test-user-firewall-iptables 33s
setup: vqk9ng4gqqiisrsgyqkq1zjgirssljf5-command-not-found.drv: build01: build01: input not substitutable: error: path '/nix/store/5fdmcpd1nqkzidxc440jdix6z98n16 …
setup:
vqk9ng4gqqiisrsgyqkq1zjgirssljf5-command-not-found.drv: build01: build01: input not substitutable: error: path '/nix/store/5fdmcpd1nqkzidxc440jdix6z98n16gc-perl-5.42.3-env' is required, but there is no substituter that can build it, asking the scheduler again
d1h1hxqcpbrrgi0vqfy0hxjy6xjhr7ml-unit-generate-shutdown-ramfs.service.drv: build01: build01: input not substitutable: error: path '/nix/store/4awk7klifj823kyjih5mcmd6r5pil3n6-shutdown-ramfs-contents.json' is required, but there is no substituter that can build it, asking the scheduler again
d1h1hxqcpbrrgi0vqfy0hxjy6xjhr7ml-unit-generate-shutdown-ramfs.service.drv: build01: build01: input not substitutable: error: path '/nix/store/4awk7klifj823kyjih5mcmd6r5pil3n6-shutdown-ramfs-contents.json' is required, but there is no substituter that can build it, asking the scheduler again
vqk9ng4gqqiisrsgyqkq1zjgirssljf5-command-not-found.drv: build01: build01: input not substitutable: error: path '/nix/store/5fdmcpd1nqkzidxc440jdix6z98n16gc-perl-5.42.3-env' is required, but there is no substituter that can build it, asking the scheduler again
vqk9ng4gqqiisrsgyqkq1zjgirssljf5-command-not-found.drv: build01: build01: input not substitutable: error: path '/nix/store/5fdmcpd1nqkzidxc440jdix6z98n16gc-perl-5.42.3-env' is required, but there is no substituter that can build it, asking the scheduler again
d1h1hxqcpbrrgi0vqfy0hxjy6xjhr7ml-unit-generate-shutdown-ramfs.service.drv: build01: the build this call attached to did not finish, retry, asking the scheduler again
d1h1hxqcpbrrgi0vqfy0hxjy6xjhr7ml-unit-generate-shutdown-ramfs.service.drv: build01: build01: input not substitutable: error: path '/nix/store/4awk7klifj823kyjih5mcmd6r5pil3n6-shutdown-ramfs-contents.json' is required, but there is no substituter that can build it, asking the scheduler again
error: dependency '2sfh4nnq4jg11jkwdhbn4cz2avz9aa56-nixos-test-driver-user-firewall-iptables.drv' failed
failed checks.aarch64-linux.nixos-test-user-firewall-nftables 39s
setup: d1h1hxqcpbrrgi0vqfy0hxjy6xjhr7ml-unit-generate-shutdown-ramfs.service.drv: build01: the build this call attached to did not finish, retry, asking the sch …
setup:
d1h1hxqcpbrrgi0vqfy0hxjy6xjhr7ml-unit-generate-shutdown-ramfs.service.drv: build01: the build this call attached to did not finish, retry, asking the scheduler again
vqk9ng4gqqiisrsgyqkq1zjgirssljf5-command-not-found.drv: build01: the build this call attached to did not finish, retry, asking the scheduler again
vqk9ng4gqqiisrsgyqkq1zjgirssljf5-command-not-found.drv: build01: build01: input not substitutable: error: path '/nix/store/5fdmcpd1nqkzidxc440jdix6z98n16gc-perl-5.42.3-env' is required, but there is no substituter that can build it, asking the scheduler again
d1h1hxqcpbrrgi0vqfy0hxjy6xjhr7ml-unit-generate-shutdown-ramfs.service.drv: build01: build01: input not substitutable: error: path '/nix/store/4awk7klifj823kyjih5mcmd6r5pil3n6-shutdown-ramfs-contents.json' is required, but there is no substituter that can build it, asking the scheduler again
vqk9ng4gqqiisrsgyqkq1zjgirssljf5-command-not-found.drv: build01: build01: input not substitutable: error: path '/nix/store/5fdmcpd1nqkzidxc440jdix6z98n16gc-perl-5.42.3-env' is required, but there is no substituter that can build it, asking the scheduler again
d1h1hxqcpbrrgi0vqfy0hxjy6xjhr7ml-unit-generate-shutdown-ramfs.service.drv: build01: build01: input not substitutable: error: path '/nix/store/4awk7klifj823kyjih5mcmd6r5pil3n6-shutdown-ramfs-contents.json' is required, but there is no substituter that can build it, asking the scheduler again
vqk9ng4gqqiisrsgyqkq1zjgirssljf5-command-not-found.drv: build01: build01: input not substitutable: error: path '/nix/store/5fdmcpd1nqkzidxc440jdix6z98n16gc-perl-5.42.3-env' is required, but there is no substituter that can build it, asking the scheduler again
error: dependency '96pbhq0mmhams7b4m4wvz2ch3qvdyvxz-nixos-test-driver-user-firewall-nftables.drv' failed
failed checks.aarch64-linux.nixos-test-wayland-proxy-virtwl 55s
setup: vqk9ng4gqqiisrsgyqkq1zjgirssljf5-command-not-found.drv: build01: build01: input not substitutable: error: path '/nix/store/5fdmcpd1nqkzidxc440jdix6z98n16 …
setup:
vqk9ng4gqqiisrsgyqkq1zjgirssljf5-command-not-found.drv: build01: build01: input not substitutable: error: path '/nix/store/5fdmcpd1nqkzidxc440jdix6z98n16gc-perl-5.42.3-env' is required, but there is no substituter that can build it, asking the scheduler again
6h0img1xrssnshsawr94snk0crix5mf6-X-Reload-Triggers-systemd-networkd.drv: build01: build01: input not substitutable: error: path '/nix/store/czhvc93bj8zg5vb8d1n0v4b5pzqp9025-unit-99-wireless-client-dhcp.network' is required, but there is no substituter that can build it, asking the scheduler again
narfm0vn9aibv663lar5hkdnjay1im3m-unit-nix-daemon.service.drv: build01: build01: input not substitutable: error: path '/nix/store/zc12x1yxf4yskzilqgq9ww7bfyfq1cvj-X-Restart-Triggers-nix-daemon' is required, but there is no substituter that can build it, asking the scheduler again
vqk9ng4gqqiisrsgyqkq1zjgirssljf5-command-not-found.drv: build01: build01: input not substitutable: error: path '/nix/store/5fdmcpd1nqkzidxc440jdix6z98n16gc-perl-5.42.3-env' is required, but there is no substituter that can build it, asking the scheduler again
narfm0vn9aibv663lar5hkdnjay1im3m-unit-nix-daemon.service.drv: build01: build01: input not substitutable: error: path '/nix/store/zc12x1yxf4yskzilqgq9ww7bfyfq1cvj-X-Restart-Triggers-nix-daemon' is required, but there is no substituter that can build it, asking the scheduler again
6h0img1xrssnshsawr94snk0crix5mf6-X-Reload-Triggers-systemd-networkd.drv: build01: build01: input not substitutable: error: path '/nix/store/czhvc93bj8zg5vb8d1n0v4b5pzqp9025-unit-99-wireless-client-dhcp.network' is required, but there is no substituter that can build it, asking the scheduler again
6h0img1xrssnshsawr94snk0crix5mf6-X-Reload-Triggers-systemd-networkd.drv: build01: build01: input not substitutable: error: path '/nix/store/czhvc93bj8zg5vb8d1n0v4b5pzqp9025-unit-99-wireless-client-dhcp.network' is required, but there is no substituter that can build it, asking the scheduler again
error: dependency '956wmlg4mcwiz355y9x6mia727hyxfya-nixos-test-driver-wayland-proxy-virtwl.drv' failed
failed eval checks.aarch64-linux.p2p-ssh-iroh —
error: … while evaluating the attribute 'drvPath' at «https://releases.nixos.org/nixos/26.05/nixos-26.05.11576.7c8764b7c7b0/nixexprs.tar.xz?narH …
error:
       … while evaluating the attribute 'drvPath'
         at «https://releases.nixos.org/nixos/26.05/nixos-26.05.11576.7c8764b7c7b0/nixexprs.tar.xz?narHash=sha256-/hsaG8yWXZjTs6WJS2xnerd9VKBgJ8jN8e5ELHLt%2Bbs%3D»/lib/customisation.nix:427:7:
          426|     // {
          427|       drvPath =
             |       ^
          428|         assert condition;

       … while calling the 'derivationStrict' builtin
         at «nix-internal»/derivation-internal.nix:37:12:
           36|
           37|   strict = derivationStrict drvAttrs;
             |            ^
           38|

       … while evaluating the option `nodes.client.networking.interfaces':

       … while evaluating definitions from `/nix/store/caswzvky10pm1m7rhdizrai4mh7wa6z4-source/nixos/modules/hardware/facter/networking':

       … while evaluating the option `nodes.client.hardware.facter.enable':

       … while evaluating the option `nodes.client.hardware.facter.report':

       … while evaluating the option `nodes.client.hardware.facter.reportPath':

       … while evaluating definitions from `/nix/store/pwmb9rwn0zk87bkxk2w1jmkahrsqlvzh-source/nixosModules/clanCore/nixos-facter.nix':

       (stack trace truncated; use '--show-trace' to show the full, detailed trace)

       error: build of '/nix/store/662y1c8sqnn6jw3x8w27n4i0dw0g0p85-merged-test-dir-clan-test-p2p-ssh-iroh.drv^out' failed: error: gave up after 9 reschedules
failed eval checks.aarch64-linux.packages —
error: … while evaluating the attribute 'drvPath' at «https://releases.nixos.org/nixos/26.05/nixos-26.05.11576.7c8764b7c7b0/nixexprs.tar.xz?narH …
error:
       … while evaluating the attribute 'drvPath'
         at «https://releases.nixos.org/nixos/26.05/nixos-26.05.11576.7c8764b7c7b0/nixexprs.tar.xz?narHash=sha256-/hsaG8yWXZjTs6WJS2xnerd9VKBgJ8jN8e5ELHLt%2Bbs%3D»/lib/customisation.nix:427:7:
          426|     // {
          427|       drvPath =
             |       ^
          428|         assert condition;

       … while calling the 'derivationStrict' builtin
         at «nix-internal»/derivation-internal.nix:37:12:
           36|
           37|   strict = derivationStrict drvAttrs;
             |            ^
           38|

       … while evaluating the option `nodes.server.networking.interfaces':

       … while evaluating definitions from `/nix/store/caswzvky10pm1m7rhdizrai4mh7wa6z4-source/nixos/modules/hardware/facter/networking':

       … while evaluating the option `nodes.server.hardware.facter.enable':

       … while evaluating the option `nodes.server.hardware.facter.report':

       … while evaluating the option `nodes.server.hardware.facter.reportPath':

       … while evaluating definitions from `/nix/store/pwmb9rwn0zk87bkxk2w1jmkahrsqlvzh-source/nixosModules/clanCore/nixos-facter.nix':

       (stack trace truncated; use '--show-trace' to show the full, detailed trace)

       error: build of '/nix/store/imk98z2jvvljdhlidvlp0j55sb5x9gnn-merged-test-dir-packages.drv^out' failed: error: gave up after 9 reschedules
failed eval checks.aarch64-linux.pki —
error: … while evaluating the attribute 'drvPath' at «https://releases.nixos.org/nixos/26.05/nixos-26.05.11576.7c8764b7c7b0/nixexprs.tar.xz?narH …
error:
       … while evaluating the attribute 'drvPath'
         at «https://releases.nixos.org/nixos/26.05/nixos-26.05.11576.7c8764b7c7b0/nixexprs.tar.xz?narHash=sha256-/hsaG8yWXZjTs6WJS2xnerd9VKBgJ8jN8e5ELHLt%2Bbs%3D»/lib/customisation.nix:427:7:
          426|     // {
          427|       drvPath =
             |       ^
          428|         assert condition;

       … while calling the 'derivationStrict' builtin
         at «nix-internal»/derivation-internal.nix:37:12:
           36|
           37|   strict = derivationStrict drvAttrs;
             |            ^
           38|

       … while evaluating the option `driverConfiguration.vlans':

       … while evaluating definitions from `/nix/store/caswzvky10pm1m7rhdizrai4mh7wa6z4-source/nixos/lib/testing/driver-configuration.nix':

       … while evaluating the option `nodes.caddy.networking.interfaces':

       … while evaluating definitions from `/nix/store/caswzvky10pm1m7rhdizrai4mh7wa6z4-source/nixos/modules/hardware/facter/networking':

       … while evaluating the option `nodes.caddy.hardware.facter.enable':

       … while evaluating the option `nodes.caddy.hardware.facter.report':

       … while evaluating the option `nodes.caddy.hardware.facter.reportPath':

       … while evaluating definitions from `/nix/store/pwmb9rwn0zk87bkxk2w1jmkahrsqlvzh-source/nixosModules/clanCore/nixos-facter.nix':

       (stack trace truncated; use '--show-trace' to show the full, detailed trace)

       error: build of '/nix/store/c32pzv31szhkqdd9nwbczdivmrjc0lil-merged-test-dir-pki.drv^out' failed: error: gave up after 9 reschedules
failed checks.aarch64-linux.postgresql 46s
setup: 5h3kimag6l6pljvnx39jphmb08pva54g-unit-nix-daemon.service.drv: build01: build01: input not substitutable: error: path '/nix/store/zc12x1yxf4yskzilqgq9ww7b …
setup:
5h3kimag6l6pljvnx39jphmb08pva54g-unit-nix-daemon.service.drv: build01: build01: input not substitutable: error: path '/nix/store/zc12x1yxf4yskzilqgq9ww7bfyfq1cvj-X-Restart-Triggers-nix-daemon' is required, but there is no substituter that can build it, asking the scheduler again
sgkbcqnb6wwghyfap5k4f7jmkgpz4hi3-vars-check-service-postgresql.drv: build01: build01: input not substitutable: error: path '/nix/store/sf9m1ashm741mnpq53p09j4ikpgnmkbm-generator-state-version' is required, but there is no substituter that can build it, asking the scheduler again
g66fdvinfjr78qvdxgz9b314sw4gszc3-decrypt-age-secrets.drv: build01: the build this call attached to did not finish, retry, asking the scheduler again
vqk9ng4gqqiisrsgyqkq1zjgirssljf5-command-not-found.drv: build01: the build this call attached to did not finish, retry, asking the scheduler again
sgkbcqnb6wwghyfap5k4f7jmkgpz4hi3-vars-check-service-postgresql.drv: build01: build01: input not substitutable: error: path '/nix/store/sf9m1ashm741mnpq53p09j4ikpgnmkbm-generator-state-version' is required, but there is no substituter that can build it, asking the scheduler again
g66fdvinfjr78qvdxgz9b314sw4gszc3-decrypt-age-secrets.drv: build01: the build this call attached to did not finish, retry, asking the scheduler again
5h3kimag6l6pljvnx39jphmb08pva54g-unit-nix-daemon.service.drv: build01: build01: input not substitutable: error: path '/nix/store/zc12x1yxf4yskzilqgq9ww7bfyfq1cvj-X-Restart-Triggers-nix-daemon' is required, but there is no substituter that can build it, asking the scheduler again
error: dependency 'h4r5p463jcdfs38xl2d9p06jmg6zy1i5-nixos-test-driver-service-postgresql.drv' failed
failed eval checks.aarch64-linux.service-dummy-test —
error: … while evaluating the attribute 'drvPath' at «https://releases.nixos.org/nixos/26.05/nixos-26.05.11576.7c8764b7c7b0/nixexprs.tar.xz?narH …
error:
       … while evaluating the attribute 'drvPath'
         at «https://releases.nixos.org/nixos/26.05/nixos-26.05.11576.7c8764b7c7b0/nixexprs.tar.xz?narHash=sha256-/hsaG8yWXZjTs6WJS2xnerd9VKBgJ8jN8e5ELHLt%2Bbs%3D»/lib/customisation.nix:427:7:
          426|     // {
          427|       drvPath =
             |       ^
          428|         assert condition;

       … while calling the 'derivationStrict' builtin
         at «nix-internal»/derivation-internal.nix:37:12:
           36|
           37|   strict = derivationStrict drvAttrs;
             |            ^
           38|

       … while evaluating the option `nodes.admin1.networking.interfaces':

       … while evaluating definitions from `/nix/store/caswzvky10pm1m7rhdizrai4mh7wa6z4-source/nixos/modules/hardware/facter/networking':

       … while evaluating the option `nodes.admin1.hardware.facter.enable':

       … while evaluating the option `nodes.admin1.hardware.facter.report':

       … while evaluating the option `nodes.admin1.hardware.facter.reportPath':

       … while evaluating definitions from `/nix/store/pwmb9rwn0zk87bkxk2w1jmkahrsqlvzh-source/nixosModules/clanCore/nixos-facter.nix':

       (stack trace truncated; use '--show-trace' to show the full, detailed trace)

       error: build of '/nix/store/xc048yfyfwckx12rf8a4r5nvbvnm4ij3-merged-test-dir-service-dummy-test.drv^out' failed: error: gave up after 9 reschedules
failed checks.aarch64-linux.service-dummy-test-from-flake 2m 34s
setup: 5h3kimag6l6pljvnx39jphmb08pva54g-unit-nix-daemon.service.drv: build01: build01: input not substitutable: error: path '/nix/store/zc12x1yxf4yskzilqgq9ww7b …
setup:
5h3kimag6l6pljvnx39jphmb08pva54g-unit-nix-daemon.service.drv: build01: build01: input not substitutable: error: path '/nix/store/zc12x1yxf4yskzilqgq9ww7bfyfq1cvj-X-Restart-Triggers-nix-daemon' is required, but there is no substituter that can build it, asking the scheduler again
g66fdvinfjr78qvdxgz9b314sw4gszc3-decrypt-age-secrets.drv: build01: build01: input not substitutable: error: path '/nix/store/xqmbsf4zbphr1657ibx6smxqy01k1p69-mount-secret-fs' is required, but there is no substituter that can build it, asking the scheduler again
ip6mlmksmg8vhrddxm3xgahc47iz6j99-vars-check-service-dummy-test-from-flake.drv: build01: build01: input not substitutable: error: path '/nix/store/sf9m1ashm741mnpq53p09j4ikpgnmkbm-generator-state-version' is required, but there is no substituter that can build it, asking the scheduler again
vqk9ng4gqqiisrsgyqkq1zjgirssljf5-command-not-found.drv: build01: build01: input not substitutable: error: path '/nix/store/5fdmcpd1nqkzidxc440jdix6z98n16gc-perl-5.42.3-env' is required, but there is no substituter that can build it, asking the scheduler again
ip6mlmksmg8vhrddxm3xgahc47iz6j99-vars-check-service-dummy-test-from-flake.drv: build01: build01: input not substitutable: error: path '/nix/store/sf9m1ashm741mnpq53p09j4ikpgnmkbm-generator-state-version' is required, but there is no substituter that can build it, asking the scheduler again
g66fdvinfjr78qvdxgz9b314sw4gszc3-decrypt-age-secrets.drv: build01: build01: input not substitutable: error: path '/nix/store/xqmbsf4zbphr1657ibx6smxqy01k1p69-mount-secret-fs' is required, but there is no substituter that can build it, asking the scheduler again
ip6mlmksmg8vhrddxm3xgahc47iz6j99-vars-check-service-dummy-test-from-flake.drv: build01: build01: input not substitutable: error: path '/nix/store/sf9m1ashm741mnpq53p09j4ikpgnmkbm-generator-state-version' is required, but there is no substituter that can build it, asking the scheduler again
error: dependency '7gjlc9ikjb4ck319fxaaqny9viihkyzd-nixos-test-driver-service-dummy-test-from-flake.drv' failed
failed eval checks.aarch64-linux.sshd —
error: … while evaluating the attribute 'drvPath' at «https://releases.nixos.org/nixos/26.05/nixos-26.05.11576.7c8764b7c7b0/nixexprs.tar.xz?narH …
error:
       … while evaluating the attribute 'drvPath'
         at «https://releases.nixos.org/nixos/26.05/nixos-26.05.11576.7c8764b7c7b0/nixexprs.tar.xz?narHash=sha256-/hsaG8yWXZjTs6WJS2xnerd9VKBgJ8jN8e5ELHLt%2Bbs%3D»/lib/customisation.nix:427:7:
          426|     // {
          427|       drvPath =
             |       ^
          428|         assert condition;

       … while calling the 'derivationStrict' builtin
         at «nix-internal»/derivation-internal.nix:37:12:
           36|
           37|   strict = derivationStrict drvAttrs;
             |            ^
           38|

       … while evaluating the option `nodes.client.networking.interfaces':

       … while evaluating definitions from `/nix/store/caswzvky10pm1m7rhdizrai4mh7wa6z4-source/nixos/modules/hardware/facter/networking':

       … while evaluating the option `nodes.client.hardware.facter.enable':

       … while evaluating the option `nodes.client.hardware.facter.report':

       … while evaluating the option `nodes.client.hardware.facter.reportPath':

       … while evaluating definitions from `/nix/store/pwmb9rwn0zk87bkxk2w1jmkahrsqlvzh-source/nixosModules/clanCore/nixos-facter.nix':

       (stack trace truncated; use '--show-trace' to show the full, detailed trace)

       error: build of '/nix/store/wmriznrqznanslskpl03apbisafk45gx-merged-test-dir-sshd.drv^out' failed: error: gave up after 9 reschedules
failed checks.aarch64-linux.sshd-no-ca 1m 57s
setup: 5h3kimag6l6pljvnx39jphmb08pva54g-unit-nix-daemon.service.drv: build01: build01: input not substitutable: error: path '/nix/store/zc12x1yxf4yskzilqgq9ww7b …
setup:
5h3kimag6l6pljvnx39jphmb08pva54g-unit-nix-daemon.service.drv: build01: build01: input not substitutable: error: path '/nix/store/zc12x1yxf4yskzilqgq9ww7bfyfq1cvj-X-Restart-Triggers-nix-daemon' is required, but there is no substituter that can build it, asking the scheduler again
3mlmhmj5nrs0idm56vx2rawc95lqmm54-decrypt-age-secrets.drv: build01: build01: input not substitutable: error: path '/nix/store/xqmbsf4zbphr1657ibx6smxqy01k1p69-mount-secret-fs' is required, but there is no substituter that can build it, asking the scheduler again
vqk9ng4gqqiisrsgyqkq1zjgirssljf5-command-not-found.drv: build01: build01: input not substitutable: error: path '/nix/store/5fdmcpd1nqkzidxc440jdix6z98n16gc-perl-5.42.3-env' is required, but there is no substituter that can build it, asking the scheduler again
qk8sn4fp6n48qvc6j5bb3cqyqlvidg1c-vars-check-sshd.drv: build01: build01: input not substitutable: error: path '/nix/store/sf9m1ashm741mnpq53p09j4ikpgnmkbm-generator-state-version' is required, but there is no substituter that can build it, asking the scheduler again
g66fdvinfjr78qvdxgz9b314sw4gszc3-decrypt-age-secrets.drv: build01: build01: input not substitutable: error: path '/nix/store/xqmbsf4zbphr1657ibx6smxqy01k1p69-mount-secret-fs' is required, but there is no substituter that can build it, asking the scheduler again
5h3kimag6l6pljvnx39jphmb08pva54g-unit-nix-daemon.service.drv: build01: build01: input not substitutable: error: path '/nix/store/zc12x1yxf4yskzilqgq9ww7bfyfq1cvj-X-Restart-Triggers-nix-daemon' is required, but there is no substituter that can build it, asking the scheduler again
3mlmhmj5nrs0idm56vx2rawc95lqmm54-decrypt-age-secrets.drv: build01: build01: input not substitutable: error: path '/nix/store/xqmbsf4zbphr1657ibx6smxqy01k1p69-mount-secret-fs' is required, but there is no substituter that can build it, asking the scheduler again
error: dependency 'z89ra8l783hi9afizz04dc3ymqkz8cqa-nixos-test-driver-sshd.drv' failed
failed checks.aarch64-linux.state-version 44s
setup: vqk9ng4gqqiisrsgyqkq1zjgirssljf5-command-not-found.drv: build01: the build this call attached to did not finish, retry, asking the scheduler again ahwky2 …
setup:
vqk9ng4gqqiisrsgyqkq1zjgirssljf5-command-not-found.drv: build01: the build this call attached to did not finish, retry, asking the scheduler again
ahwky2imndrhg86zbs119ldh71fs54x8-X-Restart-Triggers-nix-daemon.drv: build01: the build this call attached to did not finish, retry, asking the scheduler again
g66fdvinfjr78qvdxgz9b314sw4gszc3-decrypt-age-secrets.drv: build01: build01: input not substitutable: error: path '/nix/store/xqmbsf4zbphr1657ibx6smxqy01k1p69-mount-secret-fs' is required, but there is no substituter that can build it, asking the scheduler again
897i9d135gq28ibs7k1cwnsf3nj58cwj-vars-check-service-state-version.drv: build01: build01: input not substitutable: error: path '/nix/store/sf9m1ashm741mnpq53p09j4ikpgnmkbm-generator-state-version' is required, but there is no substituter that can build it, asking the scheduler again
ahwky2imndrhg86zbs119ldh71fs54x8-X-Restart-Triggers-nix-daemon.drv: build01: build01: input not substitutable: error: path '/nix/store/9d7gg64nc7x6cp7p8baznwr3agibzmfr-nix.conf' is required, but there is no substituter that can build it, asking the scheduler again
g66fdvinfjr78qvdxgz9b314sw4gszc3-decrypt-age-secrets.drv: build01: the build this call attached to did not finish, retry, asking the scheduler again
897i9d135gq28ibs7k1cwnsf3nj58cwj-vars-check-service-state-version.drv: build01: build01: input not substitutable: error: path '/nix/store/sf9m1ashm741mnpq53p09j4ikpgnmkbm-generator-state-version' is required, but there is no substituter that can build it, asking the scheduler again
error: dependency 'qriznz14fa9b67rvq37kz92jxb53an6b-nixos-test-driver-service-state-version.drv' failed
failed eval checks.aarch64-linux.syncthing-service —
error: … while evaluating the attribute 'drvPath' at «https://releases.nixos.org/nixos/26.05/nixos-26.05.11576.7c8764b7c7b0/nixexprs.tar.xz?narH …
error:
       … while evaluating the attribute 'drvPath'
         at «https://releases.nixos.org/nixos/26.05/nixos-26.05.11576.7c8764b7c7b0/nixexprs.tar.xz?narHash=sha256-/hsaG8yWXZjTs6WJS2xnerd9VKBgJ8jN8e5ELHLt%2Bbs%3D»/lib/customisation.nix:427:7:
          426|     // {
          427|       drvPath =
             |       ^
          428|         assert condition;

       … while calling the 'derivationStrict' builtin
         at «nix-internal»/derivation-internal.nix:37:12:
           36|
           37|   strict = derivationStrict drvAttrs;
             |            ^
           38|

       … while evaluating the option `nodes.machine1.networking.interfaces':

       … while evaluating definitions from `/nix/store/caswzvky10pm1m7rhdizrai4mh7wa6z4-source/nixos/modules/hardware/facter/networking':

       … while evaluating the option `nodes.machine1.hardware.facter.enable':

       … while evaluating the option `nodes.machine1.hardware.facter.report':

       … while evaluating the option `nodes.machine1.hardware.facter.reportPath':

       … while evaluating definitions from `/nix/store/pwmb9rwn0zk87bkxk2w1jmkahrsqlvzh-source/nixosModules/clanCore/nixos-facter.nix':

       (stack trace truncated; use '--show-trace' to show the full, detailed trace)

       error: build of '/nix/store/s0ffyljja91iyibg12pivpxdj7ipj3lh-merged-test-dir-syncthing-service.drv^out' failed: error: gave up after 9 reschedules
failed eval checks.aarch64-linux.trusted-nix-caches —
error: … while evaluating the attribute 'drvPath' at «https://releases.nixos.org/nixos/26.05/nixos-26.05.11576.7c8764b7c7b0/nixexprs.tar.xz?narH …
error:
       … while evaluating the attribute 'drvPath'
         at «https://releases.nixos.org/nixos/26.05/nixos-26.05.11576.7c8764b7c7b0/nixexprs.tar.xz?narHash=sha256-/hsaG8yWXZjTs6WJS2xnerd9VKBgJ8jN8e5ELHLt%2Bbs%3D»/lib/customisation.nix:427:7:
          426|     // {
          427|       drvPath =
             |       ^
          428|         assert condition;

       … while calling the 'derivationStrict' builtin
         at «nix-internal»/derivation-internal.nix:37:12:
           36|
           37|   strict = derivationStrict drvAttrs;
             |            ^
           38|

       … while evaluating the option `nodes.server.networking.interfaces':

       … while evaluating definitions from `/nix/store/caswzvky10pm1m7rhdizrai4mh7wa6z4-source/nixos/modules/hardware/facter/networking':

       … while evaluating the option `nodes.server.hardware.facter.enable':

       … while evaluating the option `nodes.server.hardware.facter.report':

       … while evaluating the option `nodes.server.hardware.facter.reportPath':

       … while evaluating definitions from `/nix/store/pwmb9rwn0zk87bkxk2w1jmkahrsqlvzh-source/nixosModules/clanCore/nixos-facter.nix':

       (stack trace truncated; use '--show-trace' to show the full, detailed trace)

       error: build of '/nix/store/1cc5czbri1rnyank9gp7q9b5s6vci83x-merged-test-dir-trusted-nix-caches.drv^out' failed: error: gave up after 9 reschedules
failed eval checks.aarch64-linux.users —
error: … while evaluating the attribute 'drvPath' at «https://releases.nixos.org/nixos/26.05/nixos-26.05.11576.7c8764b7c7b0/nixexprs.tar.xz?narH …
error:
       … while evaluating the attribute 'drvPath'
         at «https://releases.nixos.org/nixos/26.05/nixos-26.05.11576.7c8764b7c7b0/nixexprs.tar.xz?narHash=sha256-/hsaG8yWXZjTs6WJS2xnerd9VKBgJ8jN8e5ELHLt%2Bbs%3D»/lib/customisation.nix:427:7:
          426|     // {
          427|       drvPath =
             |       ^
          428|         assert condition;

       … while calling the 'derivationStrict' builtin
         at «nix-internal»/derivation-internal.nix:37:12:
           36|
           37|   strict = derivationStrict drvAttrs;
             |            ^
           38|

       … while evaluating the option `nodes.server.networking.interfaces':

       … while evaluating definitions from `/nix/store/caswzvky10pm1m7rhdizrai4mh7wa6z4-source/nixos/modules/hardware/facter/networking':

       … while evaluating the option `nodes.server.hardware.facter.enable':

       … while evaluating the option `nodes.server.hardware.facter.report':

       … while evaluating the option `nodes.server.hardware.facter.reportPath':

       … while evaluating definitions from `/nix/store/pwmb9rwn0zk87bkxk2w1jmkahrsqlvzh-source/nixosModules/clanCore/nixos-facter.nix':

       (stack trace truncated; use '--show-trace' to show the full, detailed trace)

       error: build of '/nix/store/wjj1csz796rsk9nfz1fb3ygmj54jqkb7-merged-test-dir-users.drv^out' failed: error: gave up after 9 reschedules
failed eval checks.aarch64-linux.wifi —
error: … while evaluating the attribute 'drvPath' at «https://releases.nixos.org/nixos/26.05/nixos-26.05.11576.7c8764b7c7b0/nixexprs.tar.xz?narH …
error:
       … while evaluating the attribute 'drvPath'
         at «https://releases.nixos.org/nixos/26.05/nixos-26.05.11576.7c8764b7c7b0/nixexprs.tar.xz?narHash=sha256-/hsaG8yWXZjTs6WJS2xnerd9VKBgJ8jN8e5ELHLt%2Bbs%3D»/lib/customisation.nix:427:7:
          426|     // {
          427|       drvPath =
             |       ^
          428|         assert condition;

       … while calling the 'derivationStrict' builtin
         at «nix-internal»/derivation-internal.nix:37:12:
           36|
           37|   strict = derivationStrict drvAttrs;
             |            ^
           38|

       … while evaluating the option `driverConfiguration.vlans':

       … while evaluating definitions from `/nix/store/caswzvky10pm1m7rhdizrai4mh7wa6z4-source/nixos/lib/testing/driver-configuration.nix':

       … while evaluating the option `nodes.second.networking.interfaces':

       … while evaluating definitions from `/nix/store/caswzvky10pm1m7rhdizrai4mh7wa6z4-source/nixos/modules/hardware/facter/networking':

       … while evaluating the option `nodes.second.hardware.facter.enable':

       … while evaluating the option `nodes.second.hardware.facter.report':

       … while evaluating the option `nodes.second.hardware.facter.reportPath':

       … while evaluating definitions from `/nix/store/pwmb9rwn0zk87bkxk2w1jmkahrsqlvzh-source/nixosModules/clanCore/nixos-facter.nix':

       (stack trace truncated; use '--show-trace' to show the full, detailed trace)

       error: build of '/nix/store/41vn8y52hxjggs8l3qfsclr3qpwr9w7x-merged-test-dir-wifi.drv^out' failed: error: gave up after 9 reschedules
failed eval checks.aarch64-linux.wireguard —
error: … while evaluating the attribute 'drvPath' at «https://releases.nixos.org/nixos/26.05/nixos-26.05.11576.7c8764b7c7b0/nixexprs.tar.xz?narH …
error:
       … while evaluating the attribute 'drvPath'
         at «https://releases.nixos.org/nixos/26.05/nixos-26.05.11576.7c8764b7c7b0/nixexprs.tar.xz?narHash=sha256-/hsaG8yWXZjTs6WJS2xnerd9VKBgJ8jN8e5ELHLt%2Bbs%3D»/lib/customisation.nix:427:7:
          426|     // {
          427|       drvPath =
             |       ^
          428|         assert condition;

       … while calling the 'derivationStrict' builtin
         at «nix-internal»/derivation-internal.nix:37:12:
           36|
           37|   strict = derivationStrict drvAttrs;
             |            ^
           38|

       … while evaluating the option `nodes.controller1.networking.interfaces':

       … while evaluating definitions from `/nix/store/caswzvky10pm1m7rhdizrai4mh7wa6z4-source/nixos/modules/hardware/facter/networking':

       … while evaluating the option `nodes.controller1.hardware.facter.enable':

       … while evaluating the option `nodes.controller1.hardware.facter.report':

       … while evaluating the option `nodes.controller1.hardware.facter.reportPath':

       … while evaluating definitions from `/nix/store/pwmb9rwn0zk87bkxk2w1jmkahrsqlvzh-source/nixosModules/clanCore/nixos-facter.nix':

       (stack trace truncated; use '--show-trace' to show the full, detailed trace)

       error: build of '/nix/store/bqv8zsy58v6f6jyz0lmdjxq33jvbjfwi-merged-test-dir-wireguard.drv^out' failed: error: gave up after 9 reschedules
failed checks.aarch64-linux.yggdrasil 3m 43s
setup: kinw3mgvmyps3dj89ypnxp1hwib31y5x-vars-check-yggdrasil.drv: build01: build01: input not substitutable: error: path '/nix/store/sf9m1ashm741mnpq53p09j4ikpg …
setup:
kinw3mgvmyps3dj89ypnxp1hwib31y5x-vars-check-yggdrasil.drv: build01: build01: input not substitutable: error: path '/nix/store/sf9m1ashm741mnpq53p09j4ikpgnmkbm-generator-state-version' is required, but there is no substituter that can build it, asking the scheduler again
assnbwckmsxhz1iqqmwkiwwrphg76can-decrypt-age-secrets.drv: build01: build01: input not substitutable: error: path '/nix/store/xqmbsf4zbphr1657ibx6smxqy01k1p69-mount-secret-fs' is required, but there is no substituter that can build it, asking the scheduler again
vqk9ng4gqqiisrsgyqkq1zjgirssljf5-command-not-found.drv: build01: build01: input not substitutable: error: path '/nix/store/5fdmcpd1nqkzidxc440jdix6z98n16gc-perl-5.42.3-env' is required, but there is no substituter that can build it, asking the scheduler again
abjnba7xshybjiwhin9jwdfi3wqxjaa2-decrypt-age-secrets.drv: build01: build01: input not substitutable: error: path '/nix/store/xqmbsf4zbphr1657ibx6smxqy01k1p69-mount-secret-fs' is required, but there is no substituter that can build it, asking the scheduler again
kllm2dnfpjc997y43d5iknilc3930xmg-decrypt-age-secrets.drv: build01: build01: input not substitutable: error: path '/nix/store/xqmbsf4zbphr1657ibx6smxqy01k1p69-mount-secret-fs' is required, but there is no substituter that can build it, asking the scheduler again
narfm0vn9aibv663lar5hkdnjay1im3m-unit-nix-daemon.service.drv: build01: build01: input not substitutable: error: path '/nix/store/zc12x1yxf4yskzilqgq9ww7bfyfq1cvj-X-Restart-Triggers-nix-daemon' is required, but there is no substituter that can build it, asking the scheduler again
abjnba7xshybjiwhin9jwdfi3wqxjaa2-decrypt-age-secrets.drv: build01: build01: input not substitutable: error: path '/nix/store/xqmbsf4zbphr1657ibx6smxqy01k1p69-mount-secret-fs' is required, but there is no substituter that can build it, asking the scheduler again
error: dependency 'dv5zr79kqaqfpwrd377ndfnhx8spkspf-nixos-test-driver-yggdrasil.drv' failed
failed eval checks.aarch64-linux.zerotier —
error: … while evaluating the attribute 'drvPath' at «https://releases.nixos.org/nixos/26.05/nixos-26.05.11576.7c8764b7c7b0/nixexprs.tar.xz?narH …
error:
       … while evaluating the attribute 'drvPath'
         at «https://releases.nixos.org/nixos/26.05/nixos-26.05.11576.7c8764b7c7b0/nixexprs.tar.xz?narHash=sha256-/hsaG8yWXZjTs6WJS2xnerd9VKBgJ8jN8e5ELHLt%2Bbs%3D»/lib/customisation.nix:427:7:
          426|     // {
          427|       drvPath =
             |       ^
          428|         assert condition;

       … while calling the 'derivationStrict' builtin
         at «nix-internal»/derivation-internal.nix:37:12:
           36|
           37|   strict = derivationStrict drvAttrs;
             |            ^
           38|

       … while evaluating the option `driverConfiguration.vlans':

       … while evaluating definitions from `/nix/store/caswzvky10pm1m7rhdizrai4mh7wa6z4-source/nixos/lib/testing/driver-configuration.nix':

       … while evaluating the option `nodes.controller.networking.interfaces':

       … while evaluating definitions from `/nix/store/caswzvky10pm1m7rhdizrai4mh7wa6z4-source/nixos/modules/hardware/facter/networking':

       … while evaluating the option `nodes.controller.hardware.facter.enable':

       … while evaluating the option `nodes.controller.hardware.facter.report':

       … while evaluating the option `nodes.controller.hardware.facter.reportPath':

       … while evaluating definitions from `/nix/store/pwmb9rwn0zk87bkxk2w1jmkahrsqlvzh-source/nixosModules/clanCore/nixos-facter.nix':

       (stack trace truncated; use '--show-trace' to show the full, detailed trace)

       error: build of '/nix/store/n2clkhsv8myx6lnlri8iyxmx1vc83vzy-merged-test-dir-zerotier.drv^out' failed: error: gave up after 9 reschedules
failed checks.aarch64-linux.zerotier-multi-instance 42s
setup: 8jlzycab74ppvwkpx8bmdnnsm09snmvq-decrypt-age-secrets.drv: build01: build01: input not substitutable: error: path '/nix/store/xqmbsf4zbphr1657ibx6smxqy01k …
setup:
8jlzycab74ppvwkpx8bmdnnsm09snmvq-decrypt-age-secrets.drv: build01: build01: input not substitutable: error: path '/nix/store/xqmbsf4zbphr1657ibx6smxqy01k1p69-mount-secret-fs' is required, but there is no substituter that can build it, asking the scheduler again
3s5xiw740m2y0fn5z1zfy4652arxcy4z-generator-zerotier-network-net-b.drv: build01: build01: input not substitutable: error: path '/nix/store/8q8jlijca9rcap0b4avx46mrrs5qlwf2-zerotier-tools-0.1.0' is required, but there is no substituter that can build it, asking the scheduler again
wy8ab96dlij4iyb55k2624hvbg6kfr83-generator-zerotier-identity-beta.drv: build01: build01: input not substitutable: error: path '/nix/store/8q8jlijca9rcap0b4avx46mrrs5qlwf2-zerotier-tools-0.1.0' is required, but there is no substituter that can build it, asking the scheduler again
bgzrki566389s3zclfasx3whp53jfjkp-zerotier-autoaccept-net-b.drv: build01: build01: input not substitutable: error: path '/nix/store/8q8jlijca9rcap0b4avx46mrrs5qlwf2-zerotier-tools-0.1.0' is required, but there is no substituter that can build it, asking the scheduler again
narfm0vn9aibv663lar5hkdnjay1im3m-unit-nix-daemon.service.drv: build01: build01: input not substitutable: error: path '/nix/store/zc12x1yxf4yskzilqgq9ww7bfyfq1cvj-X-Restart-Triggers-nix-daemon' is required, but there is no substituter that can build it, asking the scheduler again
cklsg868b0rciq2fvl1jhyc094kskp4q-whitelist-controller-net-a.drv: build01: build01: input not substitutable: error: path '/nix/store/8q8jlijca9rcap0b4avx46mrrs5qlwf2-zerotier-tools-0.1.0' is required, but there is no substituter that can build it, asking the scheduler again
bgzrki566389s3zclfasx3whp53jfjkp-zerotier-autoaccept-net-b.drv: build01: build01: input not substitutable: error: path '/nix/store/8q8jlijca9rcap0b4avx46mrrs5qlwf2-zerotier-tools-0.1.0' is required, but there is no substituter that can build it, asking the scheduler again
error: dependency 'bp4652lal4qyc27yx81zx9ccg79435a6-nixos-test-driver-zerotier-multi-instance.drv' failed
failed eval checks.x86_64-linux.all-packages —
error: … while calling the 'derivationStrict' builtin at «nix-internal»/derivation-internal.nix:37:12: 36| 37| strict = …
error:
       … while calling the 'derivationStrict' builtin
         at «nix-internal»/derivation-internal.nix:37:12:
           36|
           37|   strict = derivationStrict drvAttrs;
             |            ^
           38|

       … while evaluating derivation 'all-packages'
         whose name attribute is located at «https://releases.nixos.org/nixos/26.05/nixos-26.05.11576.7c8764b7c7b0/nixexprs.tar.xz?narHash=sha256-/hsaG8yWXZjTs6WJS2xnerd9VKBgJ8jN8e5ELHLt%2Bbs%3D»/pkgs/stdenv/generic/make-derivation.nix:647:11

       … while evaluating attribute 'buildCommand' of derivation 'all-packages'
         at «https://releases.nixos.org/nixos/26.05/nixos-26.05.11576.7c8764b7c7b0/nixexprs.tar.xz?narHash=sha256-/hsaG8yWXZjTs6WJS2xnerd9VKBgJ8jN8e5ELHLt%2Bbs%3D»/pkgs/build-support/trivial-builders/default.nix:81:17:
           80|         enableParallelBuilding = true;
           81|         inherit buildCommand name;
             |                 ^
           82|         passAsFile = [ "buildCommand" ] ++ (derivationArgs.passAsFile or [ ]);

       (stack trace truncated; use '--show-trace' to show the full, detailed trace)

       error: Refusing to evaluate package 'pnpm-10.34.0' in /nix/store/caswzvky10pm1m7rhdizrai4mh7wa6z4-source/pkgs/development/tools/pnpm/generic.nix:170 because it is marked as insecure

       Known issues:
        - CVE-2026-55487
        - CVE-2026-55698
        - CVE-2026-55180
        - CVE-2026-55697
        - CVE-2026-59194
        - CVE-2026-59195
        - CVE-2026-59196
        - CVE-2026-82392
        - CVE-2026-82393

       You can install it anyway by allowing this package, using the
       following methods:

       a) To temporarily allow all insecure packages, you can use an environment
          variable for a single invocation of the nix tools:

            $ export NIXPKGS_ALLOW_INSECURE=1

          Note: When using `nix shell`, `nix build`, `nix develop`, etc with a flake,
                then pass `--impure` in order to allow use of environment variables.

       b) for `nixos-rebuild` you can add ‘pnpm-10.34.0’ to
          `nixpkgs.config.permittedInsecurePackages` in the configuration.nix,
          like so:

            {
              nixpkgs.config.permittedInsecurePackages = [
                "pnpm-10.34.0"
              ];
            }

       c) For `nix-env`, `nix-build`, `nix-shell` or any other Nix command you can add
          ‘pnpm-10.34.0’ to `permittedInsecurePackages` in
          ~/.config/nixpkgs/config.nix, like so:

            {
              permittedInsecurePackages = [
                "pnpm-10.34.0"
              ];
            }
failed eval checks.x86_64-linux.borgbackup —
error: … while evaluating the attribute 'drvPath' at «https://releases.nixos.org/nixos/26.05/nixos-26.05.11576.7c8764b7c7b0/nixexprs.tar.xz?narH …
error:
       … while evaluating the attribute 'drvPath'
         at «https://releases.nixos.org/nixos/26.05/nixos-26.05.11576.7c8764b7c7b0/nixexprs.tar.xz?narHash=sha256-/hsaG8yWXZjTs6WJS2xnerd9VKBgJ8jN8e5ELHLt%2Bbs%3D»/lib/customisation.nix:427:7:
          426|     // {
          427|       drvPath =
             |       ^
          428|         assert condition;

       … while calling the 'derivationStrict' builtin
         at «nix-internal»/derivation-internal.nix:37:12:
           36|
           37|   strict = derivationStrict drvAttrs;
             |            ^
           38|

       … while evaluating the option `nodes.clientone.networking.interfaces':

       … while evaluating definitions from `/nix/store/caswzvky10pm1m7rhdizrai4mh7wa6z4-source/nixos/modules/hardware/facter/networking':

       … while evaluating the option `nodes.clientone.hardware.facter.enable':

       … while evaluating the option `nodes.clientone.hardware.facter.report':

       … while evaluating the option `nodes.clientone.hardware.facter.reportPath':

       … while evaluating definitions from `/nix/store/pwmb9rwn0zk87bkxk2w1jmkahrsqlvzh-source/nixosModules/clanCore/nixos-facter.nix':

       (stack trace truncated; use '--show-trace' to show the full, detailed trace)

       error: build of '/nix/store/iymk7adx6w7kdzk12m8yl90s7n15qava-merged-test-dir-borgbackup.drv^out' failed: error: gave up after 9 reschedules
failed eval checks.x86_64-linux.certificates —
error: … while evaluating the attribute 'drvPath' at «https://releases.nixos.org/nixos/26.05/nixos-26.05.11576.7c8764b7c7b0/nixexprs.tar.xz?narH …
error:
       … while evaluating the attribute 'drvPath'
         at «https://releases.nixos.org/nixos/26.05/nixos-26.05.11576.7c8764b7c7b0/nixexprs.tar.xz?narHash=sha256-/hsaG8yWXZjTs6WJS2xnerd9VKBgJ8jN8e5ELHLt%2Bbs%3D»/lib/customisation.nix:427:7:
          426|     // {
          427|       drvPath =
             |       ^
          428|         assert condition;

       … while calling the 'derivationStrict' builtin
         at «nix-internal»/derivation-internal.nix:37:12:
           36|
           37|   strict = derivationStrict drvAttrs;
             |            ^
           38|

       … while evaluating the option `nodes.ca.networking.interfaces':

       … while evaluating definitions from `/nix/store/caswzvky10pm1m7rhdizrai4mh7wa6z4-source/nixos/modules/hardware/facter/networking':

       … while evaluating the option `nodes.ca.hardware.facter.enable':

       … while evaluating the option `nodes.ca.hardware.facter.report':

       … while evaluating the option `nodes.ca.hardware.facter.reportPath':

       … while evaluating definitions from `/nix/store/pwmb9rwn0zk87bkxk2w1jmkahrsqlvzh-source/nixosModules/clanCore/nixos-facter.nix':

       (stack trace truncated; use '--show-trace' to show the full, detailed trace)

       error: build of '/nix/store/4l0b6fay94iqq24kqzjr0340hb8isk8v-merged-test-dir-certificates.drv^out' failed: error: gave up after 9 reschedules
failed eval checks.x86_64-linux.clan-site-lint —
error: … while calling the 'derivationStrict' builtin at «nix-internal»/derivation-internal.nix:37:12: 36| 37| strict = …
error:
       … while calling the 'derivationStrict' builtin
         at «nix-internal»/derivation-internal.nix:37:12:
           36|
           37|   strict = derivationStrict drvAttrs;
             |            ^
           38|

       … while evaluating derivation 'clan-site-lint'
         whose name attribute is located at «https://releases.nixos.org/nixos/26.05/nixos-26.05.11576.7c8764b7c7b0/nixexprs.tar.xz?narHash=sha256-/hsaG8yWXZjTs6WJS2xnerd9VKBgJ8jN8e5ELHLt%2Bbs%3D»/pkgs/stdenv/generic/make-derivation.nix:647:11

       … while evaluating attribute 'nativeBuildInputs' of derivation 'clan-site-lint'
         at «https://releases.nixos.org/nixos/26.05/nixos-26.05.11576.7c8764b7c7b0/nixexprs.tar.xz?narHash=sha256-/hsaG8yWXZjTs6WJS2xnerd9VKBgJ8jN8e5ELHLt%2Bbs%3D»/pkgs/stdenv/generic/make-derivation.nix:715:11:
          714|           depsBuildBuild = buildBuildOutputs;
          715|           nativeBuildInputs = buildHostOutputs;
             |           ^
          716|           depsBuildTarget = buildTargetOutputs;

       (stack trace truncated; use '--show-trace' to show the full, detailed trace)

       error: Refusing to evaluate package 'pnpm-10.34.0' in /nix/store/caswzvky10pm1m7rhdizrai4mh7wa6z4-source/pkgs/development/tools/pnpm/generic.nix:170 because it is marked as insecure

       Known issues:
        - CVE-2026-55487
        - CVE-2026-55698
        - CVE-2026-55180
        - CVE-2026-55697
        - CVE-2026-59194
        - CVE-2026-59195
        - CVE-2026-59196
        - CVE-2026-82392
        - CVE-2026-82393

       You can install it anyway by allowing this package, using the
       following methods:

       a) To temporarily allow all insecure packages, you can use an environment
          variable for a single invocation of the nix tools:

            $ export NIXPKGS_ALLOW_INSECURE=1

          Note: When using `nix shell`, `nix build`, `nix develop`, etc with a flake,
                then pass `--impure` in order to allow use of environment variables.

       b) for `nixos-rebuild` you can add ‘pnpm-10.34.0’ to
          `nixpkgs.config.permittedInsecurePackages` in the configuration.nix,
          like so:

            {
              nixpkgs.config.permittedInsecurePackages = [
                "pnpm-10.34.0"
              ];
            }

       c) For `nix-env`, `nix-build`, `nix-shell` or any other Nix command you can add
          ‘pnpm-10.34.0’ to `permittedInsecurePackages` in
          ~/.config/nixpkgs/config.nix, like so:

            {
              permittedInsecurePackages = [
                "pnpm-10.34.0"
              ];
            }
failed eval checks.x86_64-linux.clan-test-update —
error: … while evaluating the attribute 'drvPath' at «https://releases.nixos.org/nixos/26.05/nixos-26.05.11576.7c8764b7c7b0/nixexprs.tar.xz?narH …
error:
       … while evaluating the attribute 'drvPath'
         at «https://releases.nixos.org/nixos/26.05/nixos-26.05.11576.7c8764b7c7b0/nixexprs.tar.xz?narHash=sha256-/hsaG8yWXZjTs6WJS2xnerd9VKBgJ8jN8e5ELHLt%2Bbs%3D»/lib/customisation.nix:427:7:
          426|     // {
          427|       drvPath =
             |       ^
          428|         assert condition;

       … while calling the 'derivationStrict' builtin
         at «nix-internal»/derivation-internal.nix:37:12:
           36|
           37|   strict = derivationStrict drvAttrs;
             |            ^
           38|

       … while evaluating the option `nodes.test-update-machine.networking.interfaces':

       … while evaluating definitions from `/nix/store/caswzvky10pm1m7rhdizrai4mh7wa6z4-source/nixos/modules/hardware/facter/networking':

       … while evaluating the option `nodes.test-update-machine.hardware.facter.enable':

       … while evaluating the option `nodes.test-update-machine.hardware.facter.report':

       … while evaluating the option `nodes.test-update-machine.hardware.facter.reportPath':

       … while evaluating definitions from `/nix/store/pwmb9rwn0zk87bkxk2w1jmkahrsqlvzh-source/nixosModules/clanCore/nixos-facter.nix':

       (stack trace truncated; use '--show-trace' to show the full, detailed trace)

       error: build of '/nix/store/b5f4q1fh9dspb0qhw9qx8m5xklqndmai-merged-test-dir-clan-test-update.drv^out' failed: error: gave up after 9 reschedules
failed checks.x86_64-linux.darwin-test-darwin-machine 2m 3s
setup: q52zn986wach507sllk5f15iya7z5rgg-fonts.drv: no connected, non-draining worker for system 'aarch64-darwin' offers features {}, the workers offer {} qm4r6l …
setup:
q52zn986wach507sllk5f15iya7z5rgg-fonts.drv: no connected, non-draining worker for system 'aarch64-darwin' offers features {}, the workers offer {}
qm4r6lgv1ld1pdf52ndlra10gsm97mr8-darwin-rebuild.drv: no connected, non-draining worker for system 'aarch64-darwin' offers features {}, the workers offer {}
rjrx4i80iwd7xri74wfsfxi8fsal8gbp-set-environment.drv: no connected, non-draining worker for system 'aarch64-darwin' offers features {}, the workers offer {}
sszkycqia3vjcaw0fxfl1c70kn2gpk75-options.json.drv: no connected, non-draining worker for system 'aarch64-darwin' offers features {}, the workers offer {}
w4afz2impwxc5cqv08bsa2vh6gr5pl3d-patches.drv: no connected, non-draining worker for system 'aarch64-darwin' offers features {}, the workers offer {}
y5f294bglikn7b7gcnlchbaj9j1qmfjf-etc-099-host-keys.conf.drv: no connected, non-draining worker for system 'aarch64-darwin' offers features {}, the workers offer {}
y6v0x6ql68q9080awrq8ab9mw6l1gavh-launchd.drv: no connected, non-draining worker for system 'aarch64-darwin' offers features {}, the workers offer {}
error: dependency 'xy9nk01gn6xbq091f24a4ivhdb03fk4x-launchd.drv' failed
failed eval checks.x86_64-linux.data-mesher —
error: … while evaluating the attribute 'drvPath' at «https://releases.nixos.org/nixos/26.05/nixos-26.05.11576.7c8764b7c7b0/nixexprs.tar.xz?narH …
error:
       … while evaluating the attribute 'drvPath'
         at «https://releases.nixos.org/nixos/26.05/nixos-26.05.11576.7c8764b7c7b0/nixexprs.tar.xz?narHash=sha256-/hsaG8yWXZjTs6WJS2xnerd9VKBgJ8jN8e5ELHLt%2Bbs%3D»/lib/customisation.nix:427:7:
          426|     // {
          427|       drvPath =
             |       ^
          428|         assert condition;

       … while calling the 'derivationStrict' builtin
         at «nix-internal»/derivation-internal.nix:37:12:
           36|
           37|   strict = derivationStrict drvAttrs;
             |            ^
           38|

       … while evaluating the option `nodes.alpha.networking.interfaces':

       … while evaluating definitions from `/nix/store/caswzvky10pm1m7rhdizrai4mh7wa6z4-source/nixos/modules/hardware/facter/networking':

       … while evaluating the option `nodes.alpha.hardware.facter.enable':

       … while evaluating the option `nodes.alpha.hardware.facter.report':

       … while evaluating the option `nodes.alpha.hardware.facter.reportPath':

       … while evaluating definitions from `/nix/store/pwmb9rwn0zk87bkxk2w1jmkahrsqlvzh-source/nixosModules/clanCore/nixos-facter.nix':

       (stack trace truncated; use '--show-trace' to show the full, detailed trace)

       error: build of '/nix/store/lxif27z7q5sh1w5ml9zwwai1q3fm5005-merged-test-dir-data-mesher.drv^out' failed: error: gave up after 9 reschedules
dependency failed checks.x86_64-linux.devshell —
failed eval checks.x86_64-linux.devShell-clan-site —
error: … while calling the 'derivationStrict' builtin at «nix-internal»/derivation-internal.nix:37:12: 36| 37| strict = …
error:
       … while calling the 'derivationStrict' builtin
         at «nix-internal»/derivation-internal.nix:37:12:
           36|
           37|   strict = derivationStrict drvAttrs;
             |            ^
           38|

       … while evaluating derivation 'nix-shell'
         whose name attribute is located at «https://releases.nixos.org/nixos/26.05/nixos-26.05.11576.7c8764b7c7b0/nixexprs.tar.xz?narHash=sha256-/hsaG8yWXZjTs6WJS2xnerd9VKBgJ8jN8e5ELHLt%2Bbs%3D»/pkgs/stdenv/generic/make-derivation.nix:647:11

       … while evaluating attribute 'nativeBuildInputs' of derivation 'nix-shell'
         at «https://releases.nixos.org/nixos/26.05/nixos-26.05.11576.7c8764b7c7b0/nixexprs.tar.xz?narHash=sha256-/hsaG8yWXZjTs6WJS2xnerd9VKBgJ8jN8e5ELHLt%2Bbs%3D»/pkgs/stdenv/generic/make-derivation.nix:715:11:
          714|           depsBuildBuild = buildBuildOutputs;
          715|           nativeBuildInputs = buildHostOutputs;
             |           ^
          716|           depsBuildTarget = buildTargetOutputs;

       (stack trace truncated; use '--show-trace' to show the full, detailed trace)

       error: Refusing to evaluate package 'pnpm-10.34.0' in /nix/store/caswzvky10pm1m7rhdizrai4mh7wa6z4-source/pkgs/development/tools/pnpm/generic.nix:170 because it is marked as insecure

       Known issues:
        - CVE-2026-55487
        - CVE-2026-55698
        - CVE-2026-55180
        - CVE-2026-55697
        - CVE-2026-59194
        - CVE-2026-59195
        - CVE-2026-59196
        - CVE-2026-82392
        - CVE-2026-82393

       You can install it anyway by allowing this package, using the
       following methods:

       a) To temporarily allow all insecure packages, you can use an environment
          variable for a single invocation of the nix tools:

            $ export NIXPKGS_ALLOW_INSECURE=1

          Note: When using `nix shell`, `nix build`, `nix develop`, etc with a flake,
                then pass `--impure` in order to allow use of environment variables.

       b) for `nixos-rebuild` you can add ‘pnpm-10.34.0’ to
          `nixpkgs.config.permittedInsecurePackages` in the configuration.nix,
          like so:

            {
              nixpkgs.config.permittedInsecurePackages = [
                "pnpm-10.34.0"
              ];
            }

       c) For `nix-env`, `nix-build`, `nix-shell` or any other Nix command you can add
          ‘pnpm-10.34.0’ to `permittedInsecurePackages` in
          ~/.config/nixpkgs/config.nix, like so:

            {
              permittedInsecurePackages = [
                "pnpm-10.34.0"
              ];
            }
failed checks.x86_64-linux.devShell-default 2m 20s
setup: zzkwyvsppn0lz4y786zcmrw2p5dn7qqk-clan.drv: web01: web01: input not substitutable: error: some references of path '/nix/store/1bx1bp2y5wpf909w9c0pxkhbqdkh …
setup:
zzkwyvsppn0lz4y786zcmrw2p5dn7qqk-clan.drv: web01: web01: input not substitutable: error: some references of path '/nix/store/1bx1bp2y5wpf909w9c0pxkhbqdkhv61z-treefmt' could not be realised, asking the scheduler again
zzkwyvsppn0lz4y786zcmrw2p5dn7qqk-clan.drv: web01: web01: input not substitutable: error: some references of path '/nix/store/1bx1bp2y5wpf909w9c0pxkhbqdkhv61z-treefmt' could not be realised, asking the scheduler again
zzkwyvsppn0lz4y786zcmrw2p5dn7qqk-clan.drv: web01: web01: input not substitutable: error: some references of path '/nix/store/1bx1bp2y5wpf909w9c0pxkhbqdkhv61z-treefmt' could not be realised, asking the scheduler again
zzkwyvsppn0lz4y786zcmrw2p5dn7qqk-clan.drv: web01: web01: input not substitutable: error: some references of path '/nix/store/1bx1bp2y5wpf909w9c0pxkhbqdkhv61z-treefmt' could not be realised, asking the scheduler again
zzkwyvsppn0lz4y786zcmrw2p5dn7qqk-clan.drv: web01: web01: input not substitutable: error: some references of path '/nix/store/1bx1bp2y5wpf909w9c0pxkhbqdkhv61z-treefmt' could not be realised, asking the scheduler again
zzkwyvsppn0lz4y786zcmrw2p5dn7qqk-clan.drv: web01: web01: input not substitutable: error: some references of path '/nix/store/1bx1bp2y5wpf909w9c0pxkhbqdkhv61z-treefmt' could not be realised, asking the scheduler again
zzkwyvsppn0lz4y786zcmrw2p5dn7qqk-clan.drv: web01: web01: input not substitutable: error: some references of path '/nix/store/1bx1bp2y5wpf909w9c0pxkhbqdkhv61z-treefmt' could not be realised, asking the scheduler again
error: gave up after 9 reschedules
failed eval checks.x86_64-linux.devShell-docs —
error: … while calling the 'derivationStrict' builtin at «nix-internal»/derivation-internal.nix:37:12: 36| 37| strict = …
error:
       … while calling the 'derivationStrict' builtin
         at «nix-internal»/derivation-internal.nix:37:12:
           36|
           37|   strict = derivationStrict drvAttrs;
             |            ^
           38|

       … while evaluating derivation 'nix-shell'
         whose name attribute is located at «https://releases.nixos.org/nixos/26.05/nixos-26.05.11576.7c8764b7c7b0/nixexprs.tar.xz?narHash=sha256-/hsaG8yWXZjTs6WJS2xnerd9VKBgJ8jN8e5ELHLt%2Bbs%3D»/pkgs/stdenv/generic/make-derivation.nix:647:11

       … while evaluating attribute 'nativeBuildInputs' of derivation 'nix-shell'
         at «https://releases.nixos.org/nixos/26.05/nixos-26.05.11576.7c8764b7c7b0/nixexprs.tar.xz?narHash=sha256-/hsaG8yWXZjTs6WJS2xnerd9VKBgJ8jN8e5ELHLt%2Bbs%3D»/pkgs/stdenv/generic/make-derivation.nix:715:11:
          714|           depsBuildBuild = buildBuildOutputs;
          715|           nativeBuildInputs = buildHostOutputs;
             |           ^
          716|           depsBuildTarget = buildTargetOutputs;

       (stack trace truncated; use '--show-trace' to show the full, detailed trace)

       error: Refusing to evaluate package 'pnpm-10.34.0' in /nix/store/caswzvky10pm1m7rhdizrai4mh7wa6z4-source/pkgs/development/tools/pnpm/generic.nix:170 because it is marked as insecure

       Known issues:
        - CVE-2026-55487
        - CVE-2026-55698
        - CVE-2026-55180
        - CVE-2026-55697
        - CVE-2026-59194
        - CVE-2026-59195
        - CVE-2026-59196
        - CVE-2026-82392
        - CVE-2026-82393

       You can install it anyway by allowing this package, using the
       following methods:

       a) To temporarily allow all insecure packages, you can use an environment
          variable for a single invocation of the nix tools:

            $ export NIXPKGS_ALLOW_INSECURE=1

          Note: When using `nix shell`, `nix build`, `nix develop`, etc with a flake,
                then pass `--impure` in order to allow use of environment variables.

       b) for `nixos-rebuild` you can add ‘pnpm-10.34.0’ to
          `nixpkgs.config.permittedInsecurePackages` in the configuration.nix,
          like so:

            {
              nixpkgs.config.permittedInsecurePackages = [
                "pnpm-10.34.0"
              ];
            }

       c) For `nix-env`, `nix-build`, `nix-shell` or any other Nix command you can add
          ‘pnpm-10.34.0’ to `permittedInsecurePackages` in
          ~/.config/nixpkgs/config.nix, like so:

            {
              permittedInsecurePackages = [
                "pnpm-10.34.0"
              ];
            }
failed eval checks.x86_64-linux.dyndns —
error: … while evaluating the attribute 'drvPath' at «https://releases.nixos.org/nixos/26.05/nixos-26.05.11576.7c8764b7c7b0/nixexprs.tar.xz?narH …
error:
       … while evaluating the attribute 'drvPath'
         at «https://releases.nixos.org/nixos/26.05/nixos-26.05.11576.7c8764b7c7b0/nixexprs.tar.xz?narHash=sha256-/hsaG8yWXZjTs6WJS2xnerd9VKBgJ8jN8e5ELHLt%2Bbs%3D»/lib/customisation.nix:427:7:
          426|     // {
          427|       drvPath =
             |       ^
          428|         assert condition;

       … while calling the 'derivationStrict' builtin
         at «nix-internal»/derivation-internal.nix:37:12:
           36|
           37|   strict = derivationStrict drvAttrs;
             |            ^
           38|

       … while evaluating the option `nodes.server.networking.interfaces':

       … while evaluating definitions from `/nix/store/caswzvky10pm1m7rhdizrai4mh7wa6z4-source/nixos/modules/hardware/facter/networking':

       … while evaluating the option `nodes.server.hardware.facter.enable':

       … while evaluating the option `nodes.server.hardware.facter.report':

       … while evaluating the option `nodes.server.hardware.facter.reportPath':

       … while evaluating definitions from `/nix/store/pwmb9rwn0zk87bkxk2w1jmkahrsqlvzh-source/nixosModules/clanCore/nixos-facter.nix':

       (stack trace truncated; use '--show-trace' to show the full, detailed trace)

       error: build of '/nix/store/darq811dz7hhr938i5kb7cj0n8b00y8d-merged-test-dir-dyndns.drv^out' failed: error: gave up after 9 reschedules
failed eval checks.x86_64-linux.garage —
error: … while evaluating the attribute 'drvPath' at «https://releases.nixos.org/nixos/26.05/nixos-26.05.11576.7c8764b7c7b0/nixexprs.tar.xz?narH …
error:
       … while evaluating the attribute 'drvPath'
         at «https://releases.nixos.org/nixos/26.05/nixos-26.05.11576.7c8764b7c7b0/nixexprs.tar.xz?narHash=sha256-/hsaG8yWXZjTs6WJS2xnerd9VKBgJ8jN8e5ELHLt%2Bbs%3D»/lib/customisation.nix:427:7:
          426|     // {
          427|       drvPath =
             |       ^
          428|         assert condition;

       … while calling the 'derivationStrict' builtin
         at «nix-internal»/derivation-internal.nix:37:12:
           36|
           37|   strict = derivationStrict drvAttrs;
             |            ^
           38|

       … while evaluating the option `nodes.server.networking.interfaces':

       … while evaluating definitions from `/nix/store/caswzvky10pm1m7rhdizrai4mh7wa6z4-source/nixos/modules/hardware/facter/networking':

       … while evaluating the option `nodes.server.hardware.facter.enable':

       … while evaluating the option `nodes.server.hardware.facter.report':

       … while evaluating the option `nodes.server.hardware.facter.reportPath':

       … while evaluating definitions from `/nix/store/pwmb9rwn0zk87bkxk2w1jmkahrsqlvzh-source/nixosModules/clanCore/nixos-facter.nix':

       (stack trace truncated; use '--show-trace' to show the full, detailed trace)

       error: build of '/nix/store/hz34jxpppz28hnd6rk3p7xy04y0dwlwl-merged-test-dir-garage.drv^out' failed: error: gave up after 9 reschedules
failed eval checks.x86_64-linux.kde —
error: … while evaluating the attribute 'drvPath' at «https://releases.nixos.org/nixos/26.05/nixos-26.05.11576.7c8764b7c7b0/nixexprs.tar.xz?narH …
error:
       … while evaluating the attribute 'drvPath'
         at «https://releases.nixos.org/nixos/26.05/nixos-26.05.11576.7c8764b7c7b0/nixexprs.tar.xz?narHash=sha256-/hsaG8yWXZjTs6WJS2xnerd9VKBgJ8jN8e5ELHLt%2Bbs%3D»/lib/customisation.nix:427:7:
          426|     // {
          427|       drvPath =
             |       ^
          428|         assert condition;

       … while calling the 'derivationStrict' builtin
         at «nix-internal»/derivation-internal.nix:37:12:
           36|
           37|   strict = derivationStrict drvAttrs;
             |            ^
           38|

       … while evaluating the option `nodes.client.networking.interfaces':

       … while evaluating definitions from `/nix/store/caswzvky10pm1m7rhdizrai4mh7wa6z4-source/nixos/modules/hardware/facter/networking':

       … while evaluating the option `nodes.client.hardware.facter.enable':

       … while evaluating the option `nodes.client.hardware.facter.report':

       … while evaluating the option `nodes.client.hardware.facter.reportPath':

       … while evaluating definitions from `/nix/store/pwmb9rwn0zk87bkxk2w1jmkahrsqlvzh-source/nixosModules/clanCore/nixos-facter.nix':

       (stack trace truncated; use '--show-trace' to show the full, detailed trace)

       error: build of '/nix/store/4ipgq78dzbz4ddhb72ic0xh33l1ljcrd-merged-test-dir-kde.drv^out' failed: error: gave up after 9 reschedules
failed eval checks.x86_64-linux.nixos-test-password-store-mounts —
error: … while evaluating the attribute 'drvPath' at «https://releases.nixos.org/nixos/26.05/nixos-26.05.11576.7c8764b7c7b0/nixexprs.tar.xz?narH …
error:
       … while evaluating the attribute 'drvPath'
         at «https://releases.nixos.org/nixos/26.05/nixos-26.05.11576.7c8764b7c7b0/nixexprs.tar.xz?narHash=sha256-/hsaG8yWXZjTs6WJS2xnerd9VKBgJ8jN8e5ELHLt%2Bbs%3D»/lib/customisation.nix:427:7:
          426|     // {
          427|       drvPath =
             |       ^
          428|         assert condition;

       … while calling the 'derivationStrict' builtin
         at «nix-internal»/derivation-internal.nix:37:12:
           36|
           37|   strict = derivationStrict drvAttrs;
             |            ^
           38|

       … while evaluating the option `driverConfiguration.vlans':

       … while evaluating definitions from `/nix/store/caswzvky10pm1m7rhdizrai4mh7wa6z4-source/nixos/lib/testing/driver-configuration.nix':

       … while evaluating the option `nodes.machine.networking.interfaces':

       … while evaluating definitions from `/nix/store/caswzvky10pm1m7rhdizrai4mh7wa6z4-source/nixos/modules/hardware/facter/networking':

       … while evaluating the option `nodes.machine.hardware.facter.enable':

       … while evaluating the option `nodes.machine.hardware.facter.report':

       … while evaluating the option `nodes.machine.hardware.facter.reportPath':

       … while evaluating definitions from `/nix/store/pwmb9rwn0zk87bkxk2w1jmkahrsqlvzh-source/nixosModules/clanCore/nixos-facter.nix':

       (stack trace truncated; use '--show-trace' to show the full, detailed trace)

       error: build of '/nix/store/2npa8ksh6qq562d7ydcvxg18h7hkjc3v-merged-test-dir-nixos-test-password-store-mounts.drv^out' failed: error: dependency 'kzq24jlnnp1gdcb31rnf2d2cznvp794d-test-vars-generated.drv' failed
failed eval checks.x86_64-linux.p2p-ssh-iroh —
error: … while evaluating the attribute 'drvPath' at «https://releases.nixos.org/nixos/26.05/nixos-26.05.11576.7c8764b7c7b0/nixexprs.tar.xz?narH …
error:
       … while evaluating the attribute 'drvPath'
         at «https://releases.nixos.org/nixos/26.05/nixos-26.05.11576.7c8764b7c7b0/nixexprs.tar.xz?narHash=sha256-/hsaG8yWXZjTs6WJS2xnerd9VKBgJ8jN8e5ELHLt%2Bbs%3D»/lib/customisation.nix:427:7:
          426|     // {
          427|       drvPath =
             |       ^
          428|         assert condition;

       … while calling the 'derivationStrict' builtin
         at «nix-internal»/derivation-internal.nix:37:12:
           36|
           37|   strict = derivationStrict drvAttrs;
             |            ^
           38|

       … while evaluating the option `nodes.client.networking.interfaces':

       … while evaluating definitions from `/nix/store/caswzvky10pm1m7rhdizrai4mh7wa6z4-source/nixos/modules/hardware/facter/networking':

       … while evaluating the option `nodes.client.hardware.facter.enable':

       … while evaluating the option `nodes.client.hardware.facter.report':

       … while evaluating the option `nodes.client.hardware.facter.reportPath':

       … while evaluating definitions from `/nix/store/pwmb9rwn0zk87bkxk2w1jmkahrsqlvzh-source/nixosModules/clanCore/nixos-facter.nix':

       (stack trace truncated; use '--show-trace' to show the full, detailed trace)

       error: build of '/nix/store/662y1c8sqnn6jw3x8w27n4i0dw0g0p85-merged-test-dir-clan-test-p2p-ssh-iroh.drv^out' failed: error: gave up after 9 reschedules
failed eval checks.x86_64-linux.packages —
error: … while evaluating the attribute 'drvPath' at «https://releases.nixos.org/nixos/26.05/nixos-26.05.11576.7c8764b7c7b0/nixexprs.tar.xz?narH …
error:
       … while evaluating the attribute 'drvPath'
         at «https://releases.nixos.org/nixos/26.05/nixos-26.05.11576.7c8764b7c7b0/nixexprs.tar.xz?narHash=sha256-/hsaG8yWXZjTs6WJS2xnerd9VKBgJ8jN8e5ELHLt%2Bbs%3D»/lib/customisation.nix:427:7:
          426|     // {
          427|       drvPath =
             |       ^
          428|         assert condition;

       … while calling the 'derivationStrict' builtin
         at «nix-internal»/derivation-internal.nix:37:12:
           36|
           37|   strict = derivationStrict drvAttrs;
             |            ^
           38|

       … while evaluating the option `nodes.server.networking.interfaces':

       … while evaluating definitions from `/nix/store/caswzvky10pm1m7rhdizrai4mh7wa6z4-source/nixos/modules/hardware/facter/networking':

       … while evaluating the option `nodes.server.hardware.facter.enable':

       … while evaluating the option `nodes.server.hardware.facter.report':

       … while evaluating the option `nodes.server.hardware.facter.reportPath':

       … while evaluating definitions from `/nix/store/pwmb9rwn0zk87bkxk2w1jmkahrsqlvzh-source/nixosModules/clanCore/nixos-facter.nix':

       (stack trace truncated; use '--show-trace' to show the full, detailed trace)

       error: build of '/nix/store/imk98z2jvvljdhlidvlp0j55sb5x9gnn-merged-test-dir-packages.drv^out' failed: error: gave up after 9 reschedules
failed eval checks.x86_64-linux.pki —
error: … while evaluating the attribute 'drvPath' at «https://releases.nixos.org/nixos/26.05/nixos-26.05.11576.7c8764b7c7b0/nixexprs.tar.xz?narH …
error:
       … while evaluating the attribute 'drvPath'
         at «https://releases.nixos.org/nixos/26.05/nixos-26.05.11576.7c8764b7c7b0/nixexprs.tar.xz?narHash=sha256-/hsaG8yWXZjTs6WJS2xnerd9VKBgJ8jN8e5ELHLt%2Bbs%3D»/lib/customisation.nix:427:7:
          426|     // {
          427|       drvPath =
             |       ^
          428|         assert condition;

       … while calling the 'derivationStrict' builtin
         at «nix-internal»/derivation-internal.nix:37:12:
           36|
           37|   strict = derivationStrict drvAttrs;
             |            ^
           38|

       … while evaluating the option `driverConfiguration.vlans':

       … while evaluating definitions from `/nix/store/caswzvky10pm1m7rhdizrai4mh7wa6z4-source/nixos/lib/testing/driver-configuration.nix':

       … while evaluating the option `nodes.caddy.networking.interfaces':

       … while evaluating definitions from `/nix/store/caswzvky10pm1m7rhdizrai4mh7wa6z4-source/nixos/modules/hardware/facter/networking':

       … while evaluating the option `nodes.caddy.hardware.facter.enable':

       … while evaluating the option `nodes.caddy.hardware.facter.report':

       … while evaluating the option `nodes.caddy.hardware.facter.reportPath':

       … while evaluating definitions from `/nix/store/pwmb9rwn0zk87bkxk2w1jmkahrsqlvzh-source/nixosModules/clanCore/nixos-facter.nix':

       (stack trace truncated; use '--show-trace' to show the full, detailed trace)

       error: build of '/nix/store/c32pzv31szhkqdd9nwbczdivmrjc0lil-merged-test-dir-pki.drv^out' failed: error: gave up after 9 reschedules
failed eval checks.x86_64-linux.syncthing-service —
error: … while evaluating the attribute 'drvPath' at «https://releases.nixos.org/nixos/26.05/nixos-26.05.11576.7c8764b7c7b0/nixexprs.tar.xz?narH …
error:
       … while evaluating the attribute 'drvPath'
         at «https://releases.nixos.org/nixos/26.05/nixos-26.05.11576.7c8764b7c7b0/nixexprs.tar.xz?narHash=sha256-/hsaG8yWXZjTs6WJS2xnerd9VKBgJ8jN8e5ELHLt%2Bbs%3D»/lib/customisation.nix:427:7:
          426|     // {
          427|       drvPath =
             |       ^
          428|         assert condition;

       … while calling the 'derivationStrict' builtin
         at «nix-internal»/derivation-internal.nix:37:12:
           36|
           37|   strict = derivationStrict drvAttrs;
             |            ^
           38|

       … while evaluating the option `nodes.machine1.networking.interfaces':

       … while evaluating definitions from `/nix/store/caswzvky10pm1m7rhdizrai4mh7wa6z4-source/nixos/modules/hardware/facter/networking':

       … while evaluating the option `nodes.machine1.hardware.facter.enable':

       … while evaluating the option `nodes.machine1.hardware.facter.report':

       … while evaluating the option `nodes.machine1.hardware.facter.reportPath':

       … while evaluating definitions from `/nix/store/pwmb9rwn0zk87bkxk2w1jmkahrsqlvzh-source/nixosModules/clanCore/nixos-facter.nix':

       (stack trace truncated; use '--show-trace' to show the full, detailed trace)

       error: build of '/nix/store/s0ffyljja91iyibg12pivpxdj7ipj3lh-merged-test-dir-syncthing-service.drv^out' failed: error: gave up after 9 reschedules
failed eval checks.x86_64-linux.users —
error: … while evaluating the attribute 'drvPath' at «https://releases.nixos.org/nixos/26.05/nixos-26.05.11576.7c8764b7c7b0/nixexprs.tar.xz?narH …
error:
       … while evaluating the attribute 'drvPath'
         at «https://releases.nixos.org/nixos/26.05/nixos-26.05.11576.7c8764b7c7b0/nixexprs.tar.xz?narHash=sha256-/hsaG8yWXZjTs6WJS2xnerd9VKBgJ8jN8e5ELHLt%2Bbs%3D»/lib/customisation.nix:427:7:
          426|     // {
          427|       drvPath =
             |       ^
          428|         assert condition;

       … while calling the 'derivationStrict' builtin
         at «nix-internal»/derivation-internal.nix:37:12:
           36|
           37|   strict = derivationStrict drvAttrs;
             |            ^
           38|

       … while evaluating the option `nodes.server.networking.interfaces':

       … while evaluating definitions from `/nix/store/caswzvky10pm1m7rhdizrai4mh7wa6z4-source/nixos/modules/hardware/facter/networking':

       … while evaluating the option `nodes.server.hardware.facter.enable':

       … while evaluating the option `nodes.server.hardware.facter.report':

       … while evaluating the option `nodes.server.hardware.facter.reportPath':

       … while evaluating definitions from `/nix/store/pwmb9rwn0zk87bkxk2w1jmkahrsqlvzh-source/nixosModules/clanCore/nixos-facter.nix':

       (stack trace truncated; use '--show-trace' to show the full, detailed trace)

       error: build of '/nix/store/wjj1csz796rsk9nfz1fb3ygmj54jqkb7-merged-test-dir-users.drv^out' failed: error: gave up after 9 reschedules
failed eval checks.x86_64-linux.wifi —
error: … while evaluating the attribute 'drvPath' at «https://releases.nixos.org/nixos/26.05/nixos-26.05.11576.7c8764b7c7b0/nixexprs.tar.xz?narH …
error:
       … while evaluating the attribute 'drvPath'
         at «https://releases.nixos.org/nixos/26.05/nixos-26.05.11576.7c8764b7c7b0/nixexprs.tar.xz?narHash=sha256-/hsaG8yWXZjTs6WJS2xnerd9VKBgJ8jN8e5ELHLt%2Bbs%3D»/lib/customisation.nix:427:7:
          426|     // {
          427|       drvPath =
             |       ^
          428|         assert condition;

       … while calling the 'derivationStrict' builtin
         at «nix-internal»/derivation-internal.nix:37:12:
           36|
           37|   strict = derivationStrict drvAttrs;
             |            ^
           38|

       … while evaluating the option `driverConfiguration.vlans':

       … while evaluating definitions from `/nix/store/caswzvky10pm1m7rhdizrai4mh7wa6z4-source/nixos/lib/testing/driver-configuration.nix':

       … while evaluating the option `nodes.second.networking.interfaces':

       … while evaluating definitions from `/nix/store/caswzvky10pm1m7rhdizrai4mh7wa6z4-source/nixos/modules/hardware/facter/networking':

       … while evaluating the option `nodes.second.hardware.facter.enable':

       … while evaluating the option `nodes.second.hardware.facter.report':

       … while evaluating the option `nodes.second.hardware.facter.reportPath':

       … while evaluating definitions from `/nix/store/pwmb9rwn0zk87bkxk2w1jmkahrsqlvzh-source/nixosModules/clanCore/nixos-facter.nix':

       (stack trace truncated; use '--show-trace' to show the full, detailed trace)

       error: build of '/nix/store/41vn8y52hxjggs8l3qfsclr3qpwr9w7x-merged-test-dir-wifi.drv^out' failed: error: gave up after 9 reschedules
failed eval checks.x86_64-linux.wireguard —
error: … while evaluating the attribute 'drvPath' at «https://releases.nixos.org/nixos/26.05/nixos-26.05.11576.7c8764b7c7b0/nixexprs.tar.xz?narH …
error:
       … while evaluating the attribute 'drvPath'
         at «https://releases.nixos.org/nixos/26.05/nixos-26.05.11576.7c8764b7c7b0/nixexprs.tar.xz?narHash=sha256-/hsaG8yWXZjTs6WJS2xnerd9VKBgJ8jN8e5ELHLt%2Bbs%3D»/lib/customisation.nix:427:7:
          426|     // {
          427|       drvPath =
             |       ^
          428|         assert condition;

       … while calling the 'derivationStrict' builtin
         at «nix-internal»/derivation-internal.nix:37:12:
           36|
           37|   strict = derivationStrict drvAttrs;
             |            ^
           38|

       … while evaluating the option `nodes.controller1.networking.interfaces':

       … while evaluating definitions from `/nix/store/caswzvky10pm1m7rhdizrai4mh7wa6z4-source/nixos/modules/hardware/facter/networking':

       … while evaluating the option `nodes.controller1.hardware.facter.enable':

       … while evaluating the option `nodes.controller1.hardware.facter.report':

       … while evaluating the option `nodes.controller1.hardware.facter.reportPath':

       … while evaluating definitions from `/nix/store/pwmb9rwn0zk87bkxk2w1jmkahrsqlvzh-source/nixosModules/clanCore/nixos-facter.nix':

       (stack trace truncated; use '--show-trace' to show the full, detailed trace)

       error: build of '/nix/store/bqv8zsy58v6f6jyz0lmdjxq33jvbjfwi-merged-test-dir-wireguard.drv^out' failed: error: gave up after 9 reschedules
failed checks.x86_64-linux.zerotier 1m 56s
setup: rvcw7dvrqhr7lgv3x73py5nnvgxvfhlf-hosts.drv: build-x86-01: build-x86-01: input not substitutable: error: path '/nix/store/qm7qhlacshf3w1g8nh7s8xl97wwh8h40 …
setup:
rvcw7dvrqhr7lgv3x73py5nnvgxvfhlf-hosts.drv: build-x86-01: build-x86-01: input not substitutable: error: path '/nix/store/qm7qhlacshf3w1g8nh7s8xl97wwh8h40-string-hosts' is required, but there is no substituter that can build it, asking the scheduler again
rvcw7dvrqhr7lgv3x73py5nnvgxvfhlf-hosts.drv: build-x86-01: build-x86-01: input not substitutable: error: path '/nix/store/qm7qhlacshf3w1g8nh7s8xl97wwh8h40-string-hosts' is required, but there is no substituter that can build it, asking the scheduler again
rvcw7dvrqhr7lgv3x73py5nnvgxvfhlf-hosts.drv: build-x86-01: build-x86-01: input not substitutable: error: path '/nix/store/qm7qhlacshf3w1g8nh7s8xl97wwh8h40-string-hosts' is required, but there is no substituter that can build it, asking the scheduler again
rvcw7dvrqhr7lgv3x73py5nnvgxvfhlf-hosts.drv: build-x86-01: build-x86-01: input not substitutable: error: path '/nix/store/qm7qhlacshf3w1g8nh7s8xl97wwh8h40-string-hosts' is required, but there is no substituter that can build it, asking the scheduler again
rvcw7dvrqhr7lgv3x73py5nnvgxvfhlf-hosts.drv: build-x86-01: build-x86-01: input not substitutable: error: path '/nix/store/qm7qhlacshf3w1g8nh7s8xl97wwh8h40-string-hosts' is required, but there is no substituter that can build it, asking the scheduler again
rvcw7dvrqhr7lgv3x73py5nnvgxvfhlf-hosts.drv: build-x86-01: build-x86-01: input not substitutable: error: path '/nix/store/qm7qhlacshf3w1g8nh7s8xl97wwh8h40-string-hosts' is required, but there is no substituter that can build it, asking the scheduler again
rvcw7dvrqhr7lgv3x73py5nnvgxvfhlf-hosts.drv: build-x86-01: build-x86-01: input not substitutable: error: path '/nix/store/qm7qhlacshf3w1g8nh7s8xl97wwh8h40-string-hosts' is required, but there is no substituter that can build it, asking the scheduler again
error: dependency 'xhm3qyj1f3lxv7m3g03jplpcz6zia2hd-nixos-test-driver-zerotier.drv' failed
66 succeeded
succeeded attributes
status attribute duration
loading…
12 already built
skipped attributes
status attribute duration
loading…