nixbot

builds

clan/clan-core build #918 failed

branch 26.05 · PR #8207 · commit c6ef8cd420 · · took 7m 29s · eval 3m 16s

eval warnings 50 kinds · 369 occurrences
  • error …-merged-test-dir-admin.drv: gi-build-x86-02: gi-build-x86-02: input not substitutable: error: path '/nix/store/…-test-vars-generated' is required, but there is no substituter that can build it, asking the scheduler again ×6
  • error …-merged-test-dir-borgbackup.drv: build-x86-01: build-x86-01: input not substitutable: error: path '/nix/store/…-test-vars-generated' is required, but there is no substituter that can build it, asking the scheduler again ×12
  • error …-merged-test-dir-certificates.drv: build-x86-01: build-x86-01: input not substitutable: error: path '/nix/store/…-test-vars-generated' is required, but there is no substituter that can build it, asking the scheduler again ×11
  • error …-merged-test-dir-borgbackup.drv: gi-build-x86-02: gi-build-x86-02: input not substitutable: error: path '/nix/store/…-test-vars-generated' is required, but there is no substituter that can build it, asking the scheduler again ×6
  • error …-merged-test-dir-admin.drv: build-x86-01: build-x86-01: input not substitutable: error: path '/nix/store/…-test-vars-generated' is required, but there is no substituter that can build it, asking the scheduler again ×3
  • error …-merged-test-dir-certificates.drv: gi-build-x86-02: gi-build-x86-02: input not substitutable: error: path '/nix/store/…-test-vars-generated' is required, but there is no substituter that can build it, asking the scheduler again ×7
  • error ×45
  • error build of '/nix/store/…-merged-test-dir-admin.drv^out' failed: error: gave up after 9 reschedules ×1
  • error build of '/nix/store/…-merged-test-dir-borgbackup.drv^out' failed: error: gave up after 9 reschedules ×2
  • error …-merged-test-dir-data-mesher.drv: gi-build-x86-02: gi-build-x86-02: input not substitutable: error: path '/nix/store/…-test-vars-generated' is required, but there is no substituter that can build it, asking the scheduler again ×12
  • error build of '/nix/store/…-merged-test-dir-certificates.drv^out' failed: error: gave up after 9 reschedules ×2
  • error …-merged-test-dir-data-mesher.drv: build-x86-01: build-x86-01: input not substitutable: error: path '/nix/store/…-test-vars-generated' is required, but there is no substituter that can build it, asking the scheduler again ×6
  • error …-merged-test-dir-monitoring.drv: gi-build-x86-02: gi-build-x86-02: input not substitutable: error: path '/nix/store/…-test-vars-generated' is required, but there is no substituter that can build it, asking the scheduler again ×11
  • error …-merged-test-dir-monitoring.drv: build-x86-01: build-x86-01: input not substitutable: error: path '/nix/store/…-test-vars-generated' is required, but there is no substituter that can build it, asking the scheduler again ×7
  • error build of '/nix/store/…-merged-test-dir-data-mesher.drv^out' failed: error: gave up after 9 reschedules ×2
  • error build of '/nix/store/…-merged-test-dir-monitoring.drv^out' failed: error: gave up after 9 reschedules ×2
  • error …-merged-test-dir-mycelium.drv: build-x86-01: build-x86-01: input not substitutable: error: path '/nix/store/…-test-vars-generated' is required, but there is no substituter that can build it, asking the scheduler again ×17
  • error …-merged-test-dir-ncps.drv: gi-build-x86-02: gi-build-x86-02: input not substitutable: error: path '/nix/store/…-test-vars-generated' is required, but there is no substituter that can build it, asking the scheduler again ×13
  • error …-merged-test-dir-mycelium.drv: gi-build-x86-02: gi-build-x86-02: input not substitutable: error: path '/nix/store/…-test-vars-generated' is required, but there is no substituter that can build it, asking the scheduler again ×1
  • error …-merged-test-dir-ncps.drv: build-x86-01: build-x86-01: input not substitutable: error: path '/nix/store/…-test-vars-generated' is required, but there is no substituter that can build it, asking the scheduler again ×5
  • error build of '/nix/store/…-merged-test-dir-mycelium.drv^out' failed: error: gave up after 9 reschedules ×2
  • error …-merged-test-dir-dm-dns.drv: gi-build-x86-02: gi-build-x86-02: input not substitutable: error: path '/nix/store/…-test-vars-generated' is required, but there is no substituter that can build it, asking the scheduler again ×9
  • error …-merged-test-dir-matrix-synapse.drv: build-x86-01: build-x86-01: input not substitutable: error: path '/nix/store/…-test-vars-generated' is required, but there is no substituter that can build it, asking the scheduler again ×16
  • error …-merged-test-dir-dm-dns.drv: build-x86-01: build-x86-01: input not substitutable: error: path '/nix/store/…-test-vars-generated' is required, but there is no substituter that can build it, asking the scheduler again ×9
  • error …-merged-test-dir-localbackup.drv: error: gRPC AddMultipleToStore on 'nix-store.geninf.io:50051' failed: error: path '/nix/store/…-test-vars-generated.drv' is required, but there is no substituter that can build it ×1
  • error build of '/nix/store/…-merged-test-dir-localbackup.drv^out' failed: error: error: gRPC AddMultipleToStore on 'nix-store.geninf.io:50051' failed: error: path '/nix/store/…-test-vars-generated.drv' is required, but there is no substituter that can build it ×1
  • error …-merged-test-dir-garage.drv: build-x86-01: build-x86-01: input not substitutable: error: path '/nix/store/…-test-vars-generated' is required, but there is no substituter that can build it, asking the scheduler again ×8
  • error …-merged-test-dir-garage.drv: gi-build-x86-02: gi-build-x86-02: input not substitutable: error: path '/nix/store/…-test-vars-generated' is required, but there is no substituter that can build it, asking the scheduler again ×10
  • error build of '/nix/store/…-merged-test-dir-ncps.drv^out' failed: error: gave up after 9 reschedules ×2
  • error …-merged-test-dir-matrix-synapse.drv: gi-build-x86-02: gi-build-x86-02: input not substitutable: error: path '/nix/store/…-test-vars-generated' is required, but there is no substituter that can build it, asking the scheduler again ×2
  • error …-merged-test-dir-nixos-test-password-store-mounts.drv: build-x86-01: build-x86-01: input not substitutable: error: path '/nix/store/…-test-vars-generated' is required, but there is no substituter that can build it, asking the scheduler again ×9
  • error …-merged-test-dir-clan-test-p2p-ssh-iroh.drv: gi-build-x86-02: gi-build-x86-02: input not substitutable: error: path '/nix/store/…-test-vars-generated' is required, but there is no substituter that can build it, asking the scheduler again ×9
  • error …-merged-test-dir-pki.drv: gi-build-x86-02: gi-build-x86-02: input not substitutable: error: path '/nix/store/…-test-vars-generated' is required, but there is no substituter that can build it, asking the scheduler again ×13
  • error build of '/nix/store/…-merged-test-dir-dm-dns.drv^out' failed: error: gave up after 9 reschedules ×2
  • error …-merged-test-dir-service-dummy-test-from-flake.drv: gi-build-x86-02: gi-build-x86-02: input not substitutable: error: path '/nix/store/…-test-vars-generated' is required, but there is no substituter that can build it, asking the scheduler again ×12
  • error build of '/nix/store/…-merged-test-dir-matrix-synapse.drv^out' failed: error: gave up after 9 reschedules ×2
  • error …-merged-test-dir-sshd.drv: build-x86-01: build-x86-01: input not substitutable: error: path '/nix/store/…-test-vars-generated' is required, but there is no substituter that can build it, asking the scheduler again ×2
  • error …-merged-test-dir-nixos-test-password-store-mounts.drv: gi-build-x86-02: gi-build-x86-02: input not substitutable: error: path '/nix/store/…-test-vars-generated' is required, but there is no substituter that can build it, asking the scheduler again ×9
  • error …-merged-test-dir-service-dummy-test-from-flake.drv: build-x86-01: build-x86-01: input not substitutable: error: path '/nix/store/…-test-vars-generated' is required, but there is no substituter that can build it, asking the scheduler again ×6
  • error build of '/nix/store/…-merged-test-dir-garage.drv^out' failed: error: gave up after 9 reschedules ×2
  • error …-merged-test-dir-service-dummy-test.drv: build-x86-01: build-x86-01: input not substitutable: error: path '/nix/store/…-test-vars-generated' is required, but there is no substituter that can build it, asking the scheduler again ×7
  • error …-merged-test-dir-pki.drv: build-x86-01: build-x86-01: input not substitutable: error: path '/nix/store/…-test-vars-generated' is required, but there is no substituter that can build it, asking the scheduler again ×5
  • error …-merged-test-dir-service-dummy-test.drv: gi-build-x86-02: gi-build-x86-02: input not substitutable: error: path '/nix/store/…-test-vars-generated' is required, but there is no substituter that can build it, asking the scheduler again ×11
  • error …-merged-test-dir-clan-test-p2p-ssh-iroh.drv: build-x86-01: build-x86-01: input not substitutable: error: path '/nix/store/…-test-vars-generated' is required, but there is no substituter that can build it, asking the scheduler again ×9
  • error …-merged-test-dir-syncthing-service.drv: gi-build-x86-02: gi-build-x86-02: input not substitutable: error: path '/nix/store/…-test-vars-generated' is required, but there is no substituter that can build it, asking the scheduler again ×11
  • error …-merged-test-dir-users.drv: gi-build-x86-02: gi-build-x86-02: input not substitutable: error: path '/nix/store/…-test-vars-generated' is required, but there is no substituter that can build it, asking the scheduler again ×6
  • error …-merged-test-dir-syncthing-service.drv: build-x86-01: build-x86-01: input not substitutable: error: path '/nix/store/…-test-vars-generated' is required, but there is no substituter that can build it, asking the scheduler again ×7
  • error …-merged-test-dir-users.drv: build-x86-01: build-x86-01: input not substitutable: error: path '/nix/store/…-test-vars-generated' is required, but there is no substituter that can build it, asking the scheduler again ×12
  • error build of '/nix/store/…-merged-test-dir-nixos-test-password-store-mounts.drv^out' failed: error: gave up after 9 reschedules ×2
  • error build of '/nix/store/…-merged-test-dir-pki.drv^out' failed: error: gave up after 9 reschedules ×2

68 failed
failed attributes
status attribute duration
failed checks.aarch64-darwin.all-packages 2m 4s
setup: warning: ignoring the client-specified setting 'store', because it is a restricted setting and you are not a trusted user warning: 2fzvwrfghxkw894qqbrnxd …
setup:
warning: ignoring the client-specified setting 'store', because it is a restricted setting and you are not a trusted user
warning: 2fzvwrfghxkw894qqbrnxdbcvlhks3kk-clan-cli-source.drv: no connected, non-draining worker for system 'aarch64-darwin' offers features {}, the workers offer {}, waiting up to 120s for a worker
warning: 8qgfqwf14x556avbjxzcj6q3j41lcgiw-clan-core-flake.drv: no connected, non-draining worker for system 'aarch64-darwin' offers features {}, the workers offer {}, waiting up to 120s for a worker
warning: h1bwyrzm9jcy2hbsqs4ph96nx9f38lpg-clan-cli-source.drv: no connected, non-draining worker for system 'aarch64-darwin' offers features {}, the workers offer {}, waiting up to 120s for a worker
2fzvwrfghxkw894qqbrnxdbcvlhks3kk-clan-cli-source.drv: no connected, non-draining worker for system 'aarch64-darwin' offers features {}, the workers offer {}
8qgfqwf14x556avbjxzcj6q3j41lcgiw-clan-core-flake.drv: no connected, non-draining worker for system 'aarch64-darwin' offers features {}, the workers offer {}
h1bwyrzm9jcy2hbsqs4ph96nx9f38lpg-clan-cli-source.drv: no connected, non-draining worker for system 'aarch64-darwin' offers features {}, the workers offer {}
error: dependency '8qgfqwf14x556avbjxzcj6q3j41lcgiw-clan-core-flake.drv' failed
failed checks.aarch64-darwin.clan-app-pytest 2m 1s
setup: don't know how to build these paths: /nix/store/nl5p5biwhphp7vvd26plaf6xspdx2g68-clan-app-pytest.drv warning: ignoring the client-specified setting 'st …
setup:
don't know how to build these paths:
  /nix/store/nl5p5biwhphp7vvd26plaf6xspdx2g68-clan-app-pytest.drv
warning: ignoring the client-specified setting 'store', because it is a restricted setting and you are not a trusted user
warning: 2fzvwrfghxkw894qqbrnxdbcvlhks3kk-clan-cli-source.drv: no connected, non-draining worker for system 'aarch64-darwin' offers features {}, the workers offer {}, waiting up to 120s for a worker
2fzvwrfghxkw894qqbrnxdbcvlhks3kk-clan-cli-source.drv: no connected, non-draining worker for system 'aarch64-darwin' offers features {}, the workers offer {}
error: dependency 'pwcla8d7a47mpf412c4i0zz0fw7s0kip-python3-3.13.15-env.drv' failed
failed checks.aarch64-darwin.clan-pytest-with-core 2m 4s
setup: /nix/store/5ds9fysxln35sqh4krqw9imr4m5lnr1q-zlib-ng-2.3.3 /nix/store/mxajghyzvi968fzv2vcwq368mxi92niw-zstd-1.5.7 warning: ignoring the client-specifi …
setup:
  /nix/store/5ds9fysxln35sqh4krqw9imr4m5lnr1q-zlib-ng-2.3.3
  /nix/store/mxajghyzvi968fzv2vcwq368mxi92niw-zstd-1.5.7
warning: ignoring the client-specified setting 'store', because it is a restricted setting and you are not a trusted user
warning: g8dk7lrrfmpzy7yrqwl3mzgg2vjr8qzi-clan-core-flake.drv: no connected, non-draining worker for system 'aarch64-darwin' offers features {}, the workers offer {}, waiting up to 120s for a worker
warning: kcibxafpabqff9l05kp29xykx966rskf-clan-cli-source.drv: no connected, non-draining worker for system 'aarch64-darwin' offers features {}, the workers offer {}, waiting up to 120s for a worker
g8dk7lrrfmpzy7yrqwl3mzgg2vjr8qzi-clan-core-flake.drv: no connected, non-draining worker for system 'aarch64-darwin' offers features {}, the workers offer {}
kcibxafpabqff9l05kp29xykx966rskf-clan-cli-source.drv: no connected, non-draining worker for system 'aarch64-darwin' offers features {}, the workers offer {}
error: dependency 'kcibxafpabqff9l05kp29xykx966rskf-clan-cli-source.drv' failed
failed checks.aarch64-darwin.clan-pytest-without-core 2m 2s
setup: don't know how to build these paths: /nix/store/k3673rghar2kll0zb1l2yjl5szdaa1gm-clan-pytest-without-core.drv warning: ignoring the client-specified se …
setup:
don't know how to build these paths:
  /nix/store/k3673rghar2kll0zb1l2yjl5szdaa1gm-clan-pytest-without-core.drv
warning: ignoring the client-specified setting 'store', because it is a restricted setting and you are not a trusted user
warning: kcibxafpabqff9l05kp29xykx966rskf-clan-cli-source.drv: no connected, non-draining worker for system 'aarch64-darwin' offers features {}, the workers offer {}, waiting up to 120s for a worker
kcibxafpabqff9l05kp29xykx966rskf-clan-cli-source.drv: no connected, non-draining worker for system 'aarch64-darwin' offers features {}, the workers offer {}
error: dependency 'kcibxafpabqff9l05kp29xykx966rskf-clan-cli-source.drv' failed
failed checks.aarch64-darwin.devshell 2m 5s
setup: don't know how to build these paths: /nix/store/kxw61a86wihyj35gnx02jx338f6ac9xg-check-devshell-not-depends-on-clan-cli.drv warning: ignoring the clien …
setup:
don't know how to build these paths:
  /nix/store/kxw61a86wihyj35gnx02jx338f6ac9xg-check-devshell-not-depends-on-clan-cli.drv
warning: ignoring the client-specified setting 'store', because it is a restricted setting and you are not a trusted user
warning: 2fzvwrfghxkw894qqbrnxdbcvlhks3kk-clan-cli-source.drv: no connected, non-draining worker for system 'aarch64-darwin' offers features {}, the workers offer {}, waiting up to 120s for a worker
2fzvwrfghxkw894qqbrnxdbcvlhks3kk-clan-cli-source.drv: no connected, non-draining worker for system 'aarch64-darwin' offers features {}, the workers offer {}
error: dependency 'pz86s4x0v3m0w4yi8i8prajz15jy39pc-clan-cli.drv' failed
failed checks.aarch64-darwin.devShell-clan-app 2m 10s
setup: don't know how to build these paths: /nix/store/6b66hs1wf95x3n355cslfmsnx4fj9frm-ui.drv warning: ignoring the client-specified setting 'store', because …
setup:
don't know how to build these paths:
  /nix/store/6b66hs1wf95x3n355cslfmsnx4fj9frm-ui.drv
warning: ignoring the client-specified setting 'store', because it is a restricted setting and you are not a trusted user
warning: 2fzvwrfghxkw894qqbrnxdbcvlhks3kk-clan-cli-source.drv: no connected, non-draining worker for system 'aarch64-darwin' offers features {}, the workers offer {}, waiting up to 120s for a worker
2fzvwrfghxkw894qqbrnxdbcvlhks3kk-clan-cli-source.drv: no connected, non-draining worker for system 'aarch64-darwin' offers features {}, the workers offer {}
error: dependency 'fghz4h4jb5g3afqbzdk1g3jdsghydiix-python3-3.13.15-env.drv' failed
failed checks.aarch64-darwin.devShell-clan-site 2m 7s
setup: /nix/store/5ds9fysxln35sqh4krqw9imr4m5lnr1q-zlib-ng-2.3.3 /nix/store/mxajghyzvi968fzv2vcwq368mxi92niw-zstd-1.5.7 /nix/store/sj5gmvy8rr4r60sdfic9w42 …
setup:
  /nix/store/5ds9fysxln35sqh4krqw9imr4m5lnr1q-zlib-ng-2.3.3
  /nix/store/mxajghyzvi968fzv2vcwq368mxi92niw-zstd-1.5.7
  /nix/store/sj5gmvy8rr4r60sdfic9w426addgjpq3-zstd-1.5.7-bin
  /nix/store/jjlwnz5xzkxgql1v0dbbj611j6b4m469-zstd-1.5.7-dev
warning: ignoring the client-specified setting 'store', because it is a restricted setting and you are not a trusted user
warning: 2fzvwrfghxkw894qqbrnxdbcvlhks3kk-clan-cli-source.drv: no connected, non-draining worker for system 'aarch64-darwin' offers features {}, the workers offer {}, waiting up to 120s for a worker
2fzvwrfghxkw894qqbrnxdbcvlhks3kk-clan-cli-source.drv: no connected, non-draining worker for system 'aarch64-darwin' offers features {}, the workers offer {}
error: dependency 'qvp7b35d6vbh5b2krji2qcw33ay79q0m-generated-docs.drv' failed
failed checks.aarch64-darwin.eval-tests 2m 4s
setup: fwwv5jk8nx1ynrkx50b7745hcm5vpjff-evalCheck-eval-tests-syncthing.drv: no connected, non-draining worker for system 'aarch64-darwin' offers features {}, th …
setup:
fwwv5jk8nx1ynrkx50b7745hcm5vpjff-evalCheck-eval-tests-syncthing.drv: no connected, non-draining worker for system 'aarch64-darwin' offers features {}, the workers offer {}
fxnkrnpz26q7mwab9hzwia22g76w5xjv-evalCheck-eval-tests-zerotier.drv: no connected, non-draining worker for system 'aarch64-darwin' offers features {}, the workers offer {}
j52ffad6j387wp1qd5diw01hly50ispc-evalCheck-eval-lib-exports.drv: no connected, non-draining worker for system 'aarch64-darwin' offers features {}, the workers offer {}
m21qg00mf25nxajhada5dz3x98v6gnyq-evalCheck-eval-lib-distributedServices.drv: no connected, non-draining worker for system 'aarch64-darwin' offers features {}, the workers offer {}
mm2bgfblcrfd65frwi99lk3hql7psg1l-evalCheck-eval-module-clan-vars.drv: no connected, non-draining worker for system 'aarch64-darwin' offers features {}, the workers offer {}
pa7hwbjllwzy34ap04vrjlqk64xlh5ga-evalCheck-lib-jsonschema-unit-tests.drv: no connected, non-draining worker for system 'aarch64-darwin' offers features {}, the workers offer {}
sqv581822595yydp6ihsapfyaydcph2x-evalCheck-eval-vars-backends.drv: no connected, non-draining worker for system 'aarch64-darwin' offers features {}, the workers offer {}
error: dependency '3scbh5hi9gpmm9f3s4a62macq9sj2hkr-evalCheck-eval-lib-resolve-module.drv' failed
failed checks.aarch64-darwin.treefmt 2m 4s
setup: don't know how to build these paths: /nix/store/shi4f6sdh3rfm793hbqi088lf4kvgi5l-treefmt-check.drv warning: ignoring the client-specified setting 'stor …
setup:
don't know how to build these paths:
  /nix/store/shi4f6sdh3rfm793hbqi088lf4kvgi5l-treefmt-check.drv
warning: ignoring the client-specified setting 'store', because it is a restricted setting and you are not a trusted user
warning: shi4f6sdh3rfm793hbqi088lf4kvgi5l-treefmt-check.drv: no connected, non-draining worker for system 'aarch64-darwin' offers features {}, the workers offer {}, waiting up to 120s for a worker
shi4f6sdh3rfm793hbqi088lf4kvgi5l-treefmt-check.drv: no connected, non-draining worker for system 'aarch64-darwin' offers features {}, the workers offer {}
error: no connected, non-draining worker for system 'aarch64-darwin' offers features {}, the workers offer {}
failed eval checks.aarch64-linux.admin —
error: … while evaluating the attribute 'drvPath' at «https://releases.nixos.org/nixos/26.05/nixos-26.05.11045.774debe7a0d1/nixexprs.tar.xz?narH …
error:
       … while evaluating the attribute 'drvPath'
         at «https://releases.nixos.org/nixos/26.05/nixos-26.05.11045.774debe7a0d1/nixexprs.tar.xz?narHash=sha256-S5MjznoY0gbQbcANPLz5RYjg%2B5/WQmFRgNbHcP%2Bydcg%3D»/lib/customisation.nix:427:7:
          426|     // {
          427|       drvPath =
             |       ^
          428|         assert condition;

       … while calling the 'derivationStrict' builtin
         at «nix-internal»/derivation-internal.nix:37:12:
           36|
           37|   strict = derivationStrict drvAttrs;
             |            ^
           38|

       … while evaluating the option `nodes.client.networking.interfaces':

       … while evaluating definitions from `/nix/store/csk881ggvmifg4qf1cal0r1ffflbmlhp-source/nixos/modules/hardware/facter/networking':

       … while evaluating the option `nodes.client.hardware.facter.enable':

       … while evaluating the option `nodes.client.hardware.facter.report':

       … while evaluating the option `nodes.client.hardware.facter.reportPath':

       … while evaluating definitions from `/nix/store/q2d97flnlrbg9yvr9n7mv6kwhdigv47w-source/nixosModules/clanCore/nixos-facter.nix':

       (stack trace truncated; use '--show-trace' to show the full, detailed trace)

       error: build of '/nix/store/7wym8a10hw80dy53n2lyb1jar4adja4k-merged-test-dir-admin.drv^out' failed: error: gave up after 9 reschedules
failed checks.aarch64-linux.all-packages 1m 26s
setup: 20q9blmfi9bwp2sb843ml86jh72dsxy8-clan-cli.drv: build01: build01: input not substitutable: error: path '/nix/store/qhy9dfxfqapakppa3yjja1zkzn8p31sa-python …
setup:
20q9blmfi9bwp2sb843ml86jh72dsxy8-clan-cli.drv: build01: build01: input not substitutable: error: path '/nix/store/qhy9dfxfqapakppa3yjja1zkzn8p31sa-python3-3.13.15-env' is required, but there is no substituter that can build it, asking the scheduler again
20q9blmfi9bwp2sb843ml86jh72dsxy8-clan-cli.drv: build01: build01: input not substitutable: error: path '/nix/store/qhy9dfxfqapakppa3yjja1zkzn8p31sa-python3-3.13.15-env' is required, but there is no substituter that can build it, asking the scheduler again
20q9blmfi9bwp2sb843ml86jh72dsxy8-clan-cli.drv: build01: build01: input not substitutable: error: path '/nix/store/qhy9dfxfqapakppa3yjja1zkzn8p31sa-python3-3.13.15-env' is required, but there is no substituter that can build it, asking the scheduler again
20q9blmfi9bwp2sb843ml86jh72dsxy8-clan-cli.drv: build01: the build this call attached to did not finish, retry, asking the scheduler again
20q9blmfi9bwp2sb843ml86jh72dsxy8-clan-cli.drv: build01: build01: input not substitutable: error: path '/nix/store/qhy9dfxfqapakppa3yjja1zkzn8p31sa-python3-3.13.15-env' is required, but there is no substituter that can build it, asking the scheduler again
20q9blmfi9bwp2sb843ml86jh72dsxy8-clan-cli.drv: build01: the build this call attached to did not finish, retry, asking the scheduler again
20q9blmfi9bwp2sb843ml86jh72dsxy8-clan-cli.drv: build01: the build this call attached to did not finish, retry, asking the scheduler again
error: dependency '4v3vass5anylwsfzs7i826crnvllwmcj-clan-cli.drv' failed
failed eval checks.aarch64-linux.borgbackup —
error: … while evaluating the attribute 'drvPath' at «https://releases.nixos.org/nixos/26.05/nixos-26.05.11045.774debe7a0d1/nixexprs.tar.xz?narH …
error:
       … while evaluating the attribute 'drvPath'
         at «https://releases.nixos.org/nixos/26.05/nixos-26.05.11045.774debe7a0d1/nixexprs.tar.xz?narHash=sha256-S5MjznoY0gbQbcANPLz5RYjg%2B5/WQmFRgNbHcP%2Bydcg%3D»/lib/customisation.nix:427:7:
          426|     // {
          427|       drvPath =
             |       ^
          428|         assert condition;

       … while calling the 'derivationStrict' builtin
         at «nix-internal»/derivation-internal.nix:37:12:
           36|
           37|   strict = derivationStrict drvAttrs;
             |            ^
           38|

       … while evaluating the option `nodes.clientone.networking.interfaces':

       … while evaluating definitions from `/nix/store/csk881ggvmifg4qf1cal0r1ffflbmlhp-source/nixos/modules/hardware/facter/networking':

       … while evaluating the option `nodes.clientone.hardware.facter.enable':

       … while evaluating the option `nodes.clientone.hardware.facter.report':

       … while evaluating the option `nodes.clientone.hardware.facter.reportPath':

       … while evaluating definitions from `/nix/store/q2d97flnlrbg9yvr9n7mv6kwhdigv47w-source/nixosModules/clanCore/nixos-facter.nix':

       (stack trace truncated; use '--show-trace' to show the full, detailed trace)

       error: build of '/nix/store/c20nf5ixxlkl98byh90mdyscphw2i96v-merged-test-dir-borgbackup.drv^out' failed: error: gave up after 9 reschedules
failed eval checks.aarch64-linux.certificates —
error: … while evaluating the attribute 'drvPath' at «https://releases.nixos.org/nixos/26.05/nixos-26.05.11045.774debe7a0d1/nixexprs.tar.xz?narH …
error:
       … while evaluating the attribute 'drvPath'
         at «https://releases.nixos.org/nixos/26.05/nixos-26.05.11045.774debe7a0d1/nixexprs.tar.xz?narHash=sha256-S5MjznoY0gbQbcANPLz5RYjg%2B5/WQmFRgNbHcP%2Bydcg%3D»/lib/customisation.nix:427:7:
          426|     // {
          427|       drvPath =
             |       ^
          428|         assert condition;

       … while calling the 'derivationStrict' builtin
         at «nix-internal»/derivation-internal.nix:37:12:
           36|
           37|   strict = derivationStrict drvAttrs;
             |            ^
           38|

       … while evaluating the option `nodes.ca.networking.interfaces':

       … while evaluating definitions from `/nix/store/csk881ggvmifg4qf1cal0r1ffflbmlhp-source/nixos/modules/hardware/facter/networking':

       … while evaluating the option `nodes.ca.hardware.facter.enable':

       … while evaluating the option `nodes.ca.hardware.facter.report':

       … while evaluating the option `nodes.ca.hardware.facter.reportPath':

       … while evaluating definitions from `/nix/store/q2d97flnlrbg9yvr9n7mv6kwhdigv47w-source/nixosModules/clanCore/nixos-facter.nix':

       (stack trace truncated; use '--show-trace' to show the full, detailed trace)

       error: build of '/nix/store/2sfs7lp26wpjls0kgvikwkqadn400rph-merged-test-dir-certificates.drv^out' failed: error: gave up after 9 reschedules
failed checks.aarch64-linux.clan-app-pytest 56s
setup: 4v3vass5anylwsfzs7i826crnvllwmcj-clan-cli.drv: build01: build01: input not substitutable: error: path '/nix/store/qhy9dfxfqapakppa3yjja1zkzn8p31sa-python …
setup:
4v3vass5anylwsfzs7i826crnvllwmcj-clan-cli.drv: build01: build01: input not substitutable: error: path '/nix/store/qhy9dfxfqapakppa3yjja1zkzn8p31sa-python3-3.13.15-env' is required, but there is no substituter that can build it, asking the scheduler again
4v3vass5anylwsfzs7i826crnvllwmcj-clan-cli.drv: build01: build01: input not substitutable: error: path '/nix/store/qhy9dfxfqapakppa3yjja1zkzn8p31sa-python3-3.13.15-env' is required, but there is no substituter that can build it, asking the scheduler again
4v3vass5anylwsfzs7i826crnvllwmcj-clan-cli.drv: build01: build01: input not substitutable: error: path '/nix/store/qhy9dfxfqapakppa3yjja1zkzn8p31sa-python3-3.13.15-env' is required, but there is no substituter that can build it, asking the scheduler again
4v3vass5anylwsfzs7i826crnvllwmcj-clan-cli.drv: build01: build01: input not substitutable: error: path '/nix/store/qhy9dfxfqapakppa3yjja1zkzn8p31sa-python3-3.13.15-env' is required, but there is no substituter that can build it, asking the scheduler again
4v3vass5anylwsfzs7i826crnvllwmcj-clan-cli.drv: build01: build01: input not substitutable: error: path '/nix/store/qhy9dfxfqapakppa3yjja1zkzn8p31sa-python3-3.13.15-env' is required, but there is no substituter that can build it, asking the scheduler again
4v3vass5anylwsfzs7i826crnvllwmcj-clan-cli.drv: build01: build01: input not substitutable: error: path '/nix/store/qhy9dfxfqapakppa3yjja1zkzn8p31sa-python3-3.13.15-env' is required, but there is no substituter that can build it, asking the scheduler again
4v3vass5anylwsfzs7i826crnvllwmcj-clan-cli.drv: build01: build01: input not substitutable: error: path '/nix/store/qhy9dfxfqapakppa3yjja1zkzn8p31sa-python3-3.13.15-env' is required, but there is no substituter that can build it, asking the scheduler again
error: dependency 'mf2a805ypk5a1gk3k127v0lq6xywjxk2-python3-3.13.15-env.drv' failed
failed checks.aarch64-linux.clan-pytest-with-core 1m 20s
setup: don't know how to build these paths: /nix/store/ij72jf1jr4m0bjxq37b8jvn70kph2y51-clan-pytest-with-core.drv warning: ignoring the client-specified setti …
setup:
don't know how to build these paths:
  /nix/store/ij72jf1jr4m0bjxq37b8jvn70kph2y51-clan-pytest-with-core.drv
warning: ignoring the client-specified setting 'store', because it is a restricted setting and you are not a trusted user
ij72jf1jr4m0bjxq37b8jvn70kph2y51-clan-pytest-with-core.drv: error: gRPC AddMultipleToStore on 'nix-store.geninf.io:50051' failed: error: path '/nix/store/6skwd76b3h16zdxxlzvmsb7jbw2hm6lj-closure-info.drv' is required, but there is no substituter that can build it
error: error: gRPC AddMultipleToStore on 'nix-store.geninf.io:50051' failed: error: path '/nix/store/6skwd76b3h16zdxxlzvmsb7jbw2hm6lj-closure-info.drv' is required, but there is no substituter that can build it
failed checks.aarch64-linux.clan-pytest-without-core 1m 18s
setup: don't know how to build these paths: /nix/store/5974walqnq32z95cca73xy8qc6yj1wn8-clan-pytest-without-core.drv warning: ignoring the client-specified se …
setup:
don't know how to build these paths:
  /nix/store/5974walqnq32z95cca73xy8qc6yj1wn8-clan-pytest-without-core.drv
warning: ignoring the client-specified setting 'store', because it is a restricted setting and you are not a trusted user
5974walqnq32z95cca73xy8qc6yj1wn8-clan-pytest-without-core.drv: error: gRPC AddMultipleToStore on 'nix-store.geninf.io:50051' failed: error: path '/nix/store/1ib56lqznbxil4awa7rfh3slkawciibm-python3-3.13.15-env.drv' is required, but there is no substituter that can build it
error: error: gRPC AddMultipleToStore on 'nix-store.geninf.io:50051' failed: error: path '/nix/store/1ib56lqznbxil4awa7rfh3slkawciibm-python3-3.13.15-env.drv' is required, but there is no substituter that can build it
failed checks.aarch64-linux.clan-site-lint 1m 1s
setup: 4v3vass5anylwsfzs7i826crnvllwmcj-clan-cli.drv: build01: build01: input not substitutable: error: path '/nix/store/qhy9dfxfqapakppa3yjja1zkzn8p31sa-python …
setup:
4v3vass5anylwsfzs7i826crnvllwmcj-clan-cli.drv: build01: build01: input not substitutable: error: path '/nix/store/qhy9dfxfqapakppa3yjja1zkzn8p31sa-python3-3.13.15-env' is required, but there is no substituter that can build it, asking the scheduler again
4v3vass5anylwsfzs7i826crnvllwmcj-clan-cli.drv: build01: build01: input not substitutable: error: path '/nix/store/qhy9dfxfqapakppa3yjja1zkzn8p31sa-python3-3.13.15-env' is required, but there is no substituter that can build it, asking the scheduler again
4v3vass5anylwsfzs7i826crnvllwmcj-clan-cli.drv: build01: the build this call attached to did not finish, retry, asking the scheduler again
4v3vass5anylwsfzs7i826crnvllwmcj-clan-cli.drv: build01: build01: input not substitutable: error: path '/nix/store/qhy9dfxfqapakppa3yjja1zkzn8p31sa-python3-3.13.15-env' is required, but there is no substituter that can build it, asking the scheduler again
4v3vass5anylwsfzs7i826crnvllwmcj-clan-cli.drv: build01: the build this call attached to did not finish, retry, asking the scheduler again
4v3vass5anylwsfzs7i826crnvllwmcj-clan-cli.drv: build01: the build this call attached to did not finish, retry, asking the scheduler again
4v3vass5anylwsfzs7i826crnvllwmcj-clan-cli.drv: build01: the build this call attached to did not finish, retry, asking the scheduler again
error: dependency 'kij34x1j2dyj1d8yr0zmm6b568awc7zq-generated-docs.drv' failed
failed checks.aarch64-linux.clan-test-iso 58s
setup: 20q9blmfi9bwp2sb843ml86jh72dsxy8-clan-cli.drv: build01: build01: input not substitutable: error: path '/nix/store/qhy9dfxfqapakppa3yjja1zkzn8p31sa-python …
setup:
20q9blmfi9bwp2sb843ml86jh72dsxy8-clan-cli.drv: build01: build01: input not substitutable: error: path '/nix/store/qhy9dfxfqapakppa3yjja1zkzn8p31sa-python3-3.13.15-env' is required, but there is no substituter that can build it, asking the scheduler again
20q9blmfi9bwp2sb843ml86jh72dsxy8-clan-cli.drv: build01: build01: input not substitutable: error: path '/nix/store/qhy9dfxfqapakppa3yjja1zkzn8p31sa-python3-3.13.15-env' is required, but there is no substituter that can build it, asking the scheduler again
20q9blmfi9bwp2sb843ml86jh72dsxy8-clan-cli.drv: build01: build01: input not substitutable: error: path '/nix/store/qhy9dfxfqapakppa3yjja1zkzn8p31sa-python3-3.13.15-env' is required, but there is no substituter that can build it, asking the scheduler again
20q9blmfi9bwp2sb843ml86jh72dsxy8-clan-cli.drv: build01: build01: input not substitutable: error: path '/nix/store/qhy9dfxfqapakppa3yjja1zkzn8p31sa-python3-3.13.15-env' is required, but there is no substituter that can build it, asking the scheduler again
20q9blmfi9bwp2sb843ml86jh72dsxy8-clan-cli.drv: build01: build01: input not substitutable: error: path '/nix/store/qhy9dfxfqapakppa3yjja1zkzn8p31sa-python3-3.13.15-env' is required, but there is no substituter that can build it, asking the scheduler again
20q9blmfi9bwp2sb843ml86jh72dsxy8-clan-cli.drv: build01: build01: input not substitutable: error: path '/nix/store/qhy9dfxfqapakppa3yjja1zkzn8p31sa-python3-3.13.15-env' is required, but there is no substituter that can build it, asking the scheduler again
67s38ran1vyq79b9lil9w8j4nxl5ywjc-closure-info.drv: error: gRPC AddMultipleToStore on 'nix-store.geninf.io:50051' failed: error: some references of path '/nix/store/n2p02gjiqfhl4sy08ay55klv7jbz845l-perl-5.42.0-env.drv' could not be realised
error: dependency 'kqhx7rhy1v9x62jzr4shsff7msmcd1pd-nixos-test-driver-clan-test-iso.drv' failed
failed eval checks.aarch64-linux.data-mesher —
error: … while evaluating the attribute 'drvPath' at «https://releases.nixos.org/nixos/26.05/nixos-26.05.11045.774debe7a0d1/nixexprs.tar.xz?narH …
error:
       … while evaluating the attribute 'drvPath'
         at «https://releases.nixos.org/nixos/26.05/nixos-26.05.11045.774debe7a0d1/nixexprs.tar.xz?narHash=sha256-S5MjznoY0gbQbcANPLz5RYjg%2B5/WQmFRgNbHcP%2Bydcg%3D»/lib/customisation.nix:427:7:
          426|     // {
          427|       drvPath =
             |       ^
          428|         assert condition;

       … while calling the 'derivationStrict' builtin
         at «nix-internal»/derivation-internal.nix:37:12:
           36|
           37|   strict = derivationStrict drvAttrs;
             |            ^
           38|

       … while evaluating the option `nodes.alpha.networking.interfaces':

       … while evaluating definitions from `/nix/store/csk881ggvmifg4qf1cal0r1ffflbmlhp-source/nixos/modules/hardware/facter/networking':

       … while evaluating the option `nodes.alpha.hardware.facter.enable':

       … while evaluating the option `nodes.alpha.hardware.facter.report':

       … while evaluating the option `nodes.alpha.hardware.facter.reportPath':

       … while evaluating definitions from `/nix/store/q2d97flnlrbg9yvr9n7mv6kwhdigv47w-source/nixosModules/clanCore/nixos-facter.nix':

       (stack trace truncated; use '--show-trace' to show the full, detailed trace)

       error: build of '/nix/store/bisdrchsk95mhvw467p4wq5b2f79msnx-merged-test-dir-data-mesher.drv^out' failed: error: gave up after 9 reschedules
failed checks.aarch64-linux.devshell 1m 9s
setup: 4v3vass5anylwsfzs7i826crnvllwmcj-clan-cli.drv: build01: the build this call attached to did not finish, retry, asking the scheduler again 4v3vass5anylwsf …
setup:
4v3vass5anylwsfzs7i826crnvllwmcj-clan-cli.drv: build01: the build this call attached to did not finish, retry, asking the scheduler again
4v3vass5anylwsfzs7i826crnvllwmcj-clan-cli.drv: build01: the build this call attached to did not finish, retry, asking the scheduler again
4v3vass5anylwsfzs7i826crnvllwmcj-clan-cli.drv: build01: the build this call attached to did not finish, retry, asking the scheduler again
4v3vass5anylwsfzs7i826crnvllwmcj-clan-cli.drv: build01: the build this call attached to did not finish, retry, asking the scheduler again
4v3vass5anylwsfzs7i826crnvllwmcj-clan-cli.drv: build01: the build this call attached to did not finish, retry, asking the scheduler again
4v3vass5anylwsfzs7i826crnvllwmcj-clan-cli.drv: build01: the build this call attached to did not finish, retry, asking the scheduler again
4v3vass5anylwsfzs7i826crnvllwmcj-clan-cli.drv: build01: the build this call attached to did not finish, retry, asking the scheduler again
error: dependency '4v3vass5anylwsfzs7i826crnvllwmcj-clan-cli.drv' failed
failed checks.aarch64-linux.devShell-clan-app 1m 0s
setup: 4v3vass5anylwsfzs7i826crnvllwmcj-clan-cli.drv: build01: build01: input not substitutable: error: path '/nix/store/qhy9dfxfqapakppa3yjja1zkzn8p31sa-python …
setup:
4v3vass5anylwsfzs7i826crnvllwmcj-clan-cli.drv: build01: build01: input not substitutable: error: path '/nix/store/qhy9dfxfqapakppa3yjja1zkzn8p31sa-python3-3.13.15-env' is required, but there is no substituter that can build it, asking the scheduler again
4v3vass5anylwsfzs7i826crnvllwmcj-clan-cli.drv: build01: build01: input not substitutable: error: path '/nix/store/qhy9dfxfqapakppa3yjja1zkzn8p31sa-python3-3.13.15-env' is required, but there is no substituter that can build it, asking the scheduler again
4v3vass5anylwsfzs7i826crnvllwmcj-clan-cli.drv: build01: build01: input not substitutable: error: path '/nix/store/qhy9dfxfqapakppa3yjja1zkzn8p31sa-python3-3.13.15-env' is required, but there is no substituter that can build it, asking the scheduler again
4v3vass5anylwsfzs7i826crnvllwmcj-clan-cli.drv: build01: build01: input not substitutable: error: path '/nix/store/qhy9dfxfqapakppa3yjja1zkzn8p31sa-python3-3.13.15-env' is required, but there is no substituter that can build it, asking the scheduler again
4v3vass5anylwsfzs7i826crnvllwmcj-clan-cli.drv: build01: build01: input not substitutable: error: path '/nix/store/qhy9dfxfqapakppa3yjja1zkzn8p31sa-python3-3.13.15-env' is required, but there is no substituter that can build it, asking the scheduler again
4v3vass5anylwsfzs7i826crnvllwmcj-clan-cli.drv: build01: build01: input not substitutable: error: path '/nix/store/qhy9dfxfqapakppa3yjja1zkzn8p31sa-python3-3.13.15-env' is required, but there is no substituter that can build it, asking the scheduler again
4v3vass5anylwsfzs7i826crnvllwmcj-clan-cli.drv: build01: build01: input not substitutable: error: path '/nix/store/qhy9dfxfqapakppa3yjja1zkzn8p31sa-python3-3.13.15-env' is required, but there is no substituter that can build it, asking the scheduler again
error: dependency '0w8vi1vyb2cvfc9jcypdp9hy2lnznfjq-python3-3.13.15-env.drv' failed
failed checks.aarch64-linux.devShell-clan-site 42s
setup: 4v3vass5anylwsfzs7i826crnvllwmcj-clan-cli.drv: build01: build01: input not substitutable: error: path '/nix/store/qhy9dfxfqapakppa3yjja1zkzn8p31sa-python …
setup:
4v3vass5anylwsfzs7i826crnvllwmcj-clan-cli.drv: build01: build01: input not substitutable: error: path '/nix/store/qhy9dfxfqapakppa3yjja1zkzn8p31sa-python3-3.13.15-env' is required, but there is no substituter that can build it, asking the scheduler again
4v3vass5anylwsfzs7i826crnvllwmcj-clan-cli.drv: build01: the build this call attached to did not finish, retry, asking the scheduler again
4v3vass5anylwsfzs7i826crnvllwmcj-clan-cli.drv: build01: build01: input not substitutable: error: path '/nix/store/qhy9dfxfqapakppa3yjja1zkzn8p31sa-python3-3.13.15-env' is required, but there is no substituter that can build it, asking the scheduler again
4v3vass5anylwsfzs7i826crnvllwmcj-clan-cli.drv: build01: build01: input not substitutable: error: path '/nix/store/qhy9dfxfqapakppa3yjja1zkzn8p31sa-python3-3.13.15-env' is required, but there is no substituter that can build it, asking the scheduler again
4v3vass5anylwsfzs7i826crnvllwmcj-clan-cli.drv: build01: the build this call attached to did not finish, retry, asking the scheduler again
4v3vass5anylwsfzs7i826crnvllwmcj-clan-cli.drv: build01: build01: input not substitutable: error: path '/nix/store/qhy9dfxfqapakppa3yjja1zkzn8p31sa-python3-3.13.15-env' is required, but there is no substituter that can build it, asking the scheduler again
4v3vass5anylwsfzs7i826crnvllwmcj-clan-cli.drv: build01: the build this call attached to did not finish, retry, asking the scheduler again
error: dependency 'kij34x1j2dyj1d8yr0zmm6b568awc7zq-generated-docs.drv' failed
failed checks.aarch64-linux.devShell-docs 44s
setup: 4v3vass5anylwsfzs7i826crnvllwmcj-clan-cli.drv: build01: build01: input not substitutable: error: path '/nix/store/qhy9dfxfqapakppa3yjja1zkzn8p31sa-python …
setup:
4v3vass5anylwsfzs7i826crnvllwmcj-clan-cli.drv: build01: build01: input not substitutable: error: path '/nix/store/qhy9dfxfqapakppa3yjja1zkzn8p31sa-python3-3.13.15-env' is required, but there is no substituter that can build it, asking the scheduler again
4v3vass5anylwsfzs7i826crnvllwmcj-clan-cli.drv: build01: the build this call attached to did not finish, retry, asking the scheduler again
4v3vass5anylwsfzs7i826crnvllwmcj-clan-cli.drv: build01: the build this call attached to did not finish, retry, asking the scheduler again
4v3vass5anylwsfzs7i826crnvllwmcj-clan-cli.drv: build01: build01: input not substitutable: error: path '/nix/store/qhy9dfxfqapakppa3yjja1zkzn8p31sa-python3-3.13.15-env' is required, but there is no substituter that can build it, asking the scheduler again
4v3vass5anylwsfzs7i826crnvllwmcj-clan-cli.drv: build01: the build this call attached to did not finish, retry, asking the scheduler again
4v3vass5anylwsfzs7i826crnvllwmcj-clan-cli.drv: build01: build01: input not substitutable: error: path '/nix/store/qhy9dfxfqapakppa3yjja1zkzn8p31sa-python3-3.13.15-env' is required, but there is no substituter that can build it, asking the scheduler again
4v3vass5anylwsfzs7i826crnvllwmcj-clan-cli.drv: build01: build01: input not substitutable: error: path '/nix/store/qhy9dfxfqapakppa3yjja1zkzn8p31sa-python3-3.13.15-env' is required, but there is no substituter that can build it, asking the scheduler again
error: dependency 'kij34x1j2dyj1d8yr0zmm6b568awc7zq-generated-docs.drv' failed
failed eval checks.aarch64-linux.dm-dns —
error: … while evaluating the attribute 'drvPath' at «https://releases.nixos.org/nixos/26.05/nixos-26.05.11045.774debe7a0d1/nixexprs.tar.xz?narH …
error:
       … while evaluating the attribute 'drvPath'
         at «https://releases.nixos.org/nixos/26.05/nixos-26.05.11045.774debe7a0d1/nixexprs.tar.xz?narHash=sha256-S5MjznoY0gbQbcANPLz5RYjg%2B5/WQmFRgNbHcP%2Bydcg%3D»/lib/customisation.nix:427:7:
          426|     // {
          427|       drvPath =
             |       ^
          428|         assert condition;

       … while calling the 'derivationStrict' builtin
         at «nix-internal»/derivation-internal.nix:37:12:
           36|
           37|   strict = derivationStrict drvAttrs;
             |            ^
           38|

       … while evaluating the option `nodes.client.networking.interfaces':

       … while evaluating definitions from `/nix/store/csk881ggvmifg4qf1cal0r1ffflbmlhp-source/nixos/modules/hardware/facter/networking':

       … while evaluating the option `nodes.client.hardware.facter.enable':

       … while evaluating the option `nodes.client.hardware.facter.report':

       … while evaluating the option `nodes.client.hardware.facter.reportPath':

       … while evaluating definitions from `/nix/store/q2d97flnlrbg9yvr9n7mv6kwhdigv47w-source/nixosModules/clanCore/nixos-facter.nix':

       (stack trace truncated; use '--show-trace' to show the full, detailed trace)

       error: build of '/nix/store/yln3f9jkdz1nwbsd4mb869zl8hfcnvyl-merged-test-dir-dm-dns.drv^out' failed: error: gave up after 9 reschedules
failed checks.aarch64-linux.eval-tests 23s
setup: crjdc7vcdy3b66n24rf4i7j9n6c276vr-evalCheck-eval-tests-types.drv: error: gRPC AddMultipleToStore on 'nix-store.geninf.io:50051' failed: error: some refere …
setup:
crjdc7vcdy3b66n24rf4i7j9n6c276vr-evalCheck-eval-tests-types.drv: error: gRPC AddMultipleToStore on 'nix-store.geninf.io:50051' failed: error: some references of path '/nix/store/m1zliyrmawgmkdvw46626rlgv64vqfd9-nix-unit-2.34.2.drv' could not be realised
rr567dyj77div5npfbrjjs12vsbcn1f0-evalCheck-eval-module-clan-vars.drv: error: gRPC AddMultipleToStore on 'nix-store.geninf.io:50051' failed: error: some references of path '/nix/store/m1zliyrmawgmkdvw46626rlgv64vqfd9-nix-unit-2.34.2.drv' could not be realised
1wljficzipj523sz6h7pliysicrvsgbw-evalCheck-eval-tests-installer.drv: error: gRPC AddMultipleToStore on 'nix-store.geninf.io:50051' failed: error: some references of path '/nix/store/m1zliyrmawgmkdvw46626rlgv64vqfd9-nix-unit-2.34.2.drv' could not be realised
7zx6ipmh7sa9j3v9z6ps5mm3ifknmw47-evalCheck-eval-lib-distributedServices.drv: error: gRPC AddMultipleToStore on 'nix-store.geninf.io:50051' failed: error: some references of path '/nix/store/m1zliyrmawgmkdvw46626rlgv64vqfd9-nix-unit-2.34.2.drv' could not be realised
1jhc5d74j6dskrg4yzvp4zr3045x1m19-evalCheck-eval-lib-relativeDir.drv: error: gRPC AddMultipleToStore on 'nix-store.geninf.io:50051' failed: error: some references of path '/nix/store/m1zliyrmawgmkdvw46626rlgv64vqfd9-nix-unit-2.34.2.drv' could not be realised
vkgpzyp40srv8fhns3vlm2050wr2bjcc-evalCheck-eval-lib-exports.drv: error: gRPC AddMultipleToStore on 'nix-store.geninf.io:50051' failed: error: some references of path '/nix/store/m1zliyrmawgmkdvw46626rlgv64vqfd9-nix-unit-2.34.2.drv' could not be realised
7xarl3n5v1147ra1qd0hpxcb30830nzn-evalCheck-eval-lib-values.drv: error: gRPC AddMultipleToStore on 'nix-store.geninf.io:50051' failed: error: some references of path '/nix/store/m1zliyrmawgmkdvw46626rlgv64vqfd9-nix-unit-2.34.2.drv' could not be realised
error: dependency '213k64n1bfvc59v6mlh3bwpjyazv1klk-evalCheck-lib-jsonschema-unit-tests.drv' failed
failed eval checks.aarch64-linux.garage —
error: … while evaluating the attribute 'drvPath' at «https://releases.nixos.org/nixos/26.05/nixos-26.05.11045.774debe7a0d1/nixexprs.tar.xz?narH …
error:
       … while evaluating the attribute 'drvPath'
         at «https://releases.nixos.org/nixos/26.05/nixos-26.05.11045.774debe7a0d1/nixexprs.tar.xz?narHash=sha256-S5MjznoY0gbQbcANPLz5RYjg%2B5/WQmFRgNbHcP%2Bydcg%3D»/lib/customisation.nix:427:7:
          426|     // {
          427|       drvPath =
             |       ^
          428|         assert condition;

       … while calling the 'derivationStrict' builtin
         at «nix-internal»/derivation-internal.nix:37:12:
           36|
           37|   strict = derivationStrict drvAttrs;
             |            ^
           38|

       … while evaluating the option `nodes.server.networking.interfaces':

       … while evaluating definitions from `/nix/store/csk881ggvmifg4qf1cal0r1ffflbmlhp-source/nixos/modules/hardware/facter/networking':

       … while evaluating the option `nodes.server.hardware.facter.enable':

       … while evaluating the option `nodes.server.hardware.facter.report':

       … while evaluating the option `nodes.server.hardware.facter.reportPath':

       … while evaluating definitions from `/nix/store/q2d97flnlrbg9yvr9n7mv6kwhdigv47w-source/nixosModules/clanCore/nixos-facter.nix':

       (stack trace truncated; use '--show-trace' to show the full, detailed trace)

       error: build of '/nix/store/m5bznfa9ljfbjad6mr813wqn4ncj0h1c-merged-test-dir-garage.drv^out' failed: error: gave up after 9 reschedules
failed eval checks.aarch64-linux.localbackup —
error: … while evaluating the attribute 'drvPath' at «https://releases.nixos.org/nixos/26.05/nixos-26.05.11045.774debe7a0d1/nixexprs.tar.xz?narH …
error:
       … while evaluating the attribute 'drvPath'
         at «https://releases.nixos.org/nixos/26.05/nixos-26.05.11045.774debe7a0d1/nixexprs.tar.xz?narHash=sha256-S5MjznoY0gbQbcANPLz5RYjg%2B5/WQmFRgNbHcP%2Bydcg%3D»/lib/customisation.nix:427:7:
          426|     // {
          427|       drvPath =
             |       ^
          428|         assert condition;

       … while calling the 'derivationStrict' builtin
         at «nix-internal»/derivation-internal.nix:37:12:
           36|
           37|   strict = derivationStrict drvAttrs;
             |            ^
           38|

       … while evaluating the option `nodes.machine.networking.interfaces':

       … while evaluating definitions from `/nix/store/csk881ggvmifg4qf1cal0r1ffflbmlhp-source/nixos/modules/hardware/facter/networking':

       … while evaluating the option `nodes.machine.hardware.facter.enable':

       … while evaluating the option `nodes.machine.hardware.facter.report':

       … while evaluating the option `nodes.machine.hardware.facter.reportPath':

       … while evaluating definitions from `/nix/store/q2d97flnlrbg9yvr9n7mv6kwhdigv47w-source/nixosModules/clanCore/nixos-facter.nix':

       (stack trace truncated; use '--show-trace' to show the full, detailed trace)

       error: build of '/nix/store/lw22npzpmswrrrsjl73vfdczqvyr4gkf-merged-test-dir-localbackup.drv^out' failed: error: error: gRPC AddMultipleToStore on 'nix-store.geninf.io:50051' failed: error: path '/nix/store/7m5dgkfsxcifh1cwwhhw2ykvzzy72hh5-test-vars-generated.drv' is required, but there is no substituter that can build it
failed eval checks.aarch64-linux.machine-id —
error: … while evaluating the attribute 'drvPath' at «https://releases.nixos.org/nixos/26.05/nixos-26.05.11045.774debe7a0d1/nixexprs.tar.xz?narH …
error:
       … while evaluating the attribute 'drvPath'
         at «https://releases.nixos.org/nixos/26.05/nixos-26.05.11045.774debe7a0d1/nixexprs.tar.xz?narHash=sha256-S5MjznoY0gbQbcANPLz5RYjg%2B5/WQmFRgNbHcP%2Bydcg%3D»/lib/customisation.nix:427:7:
          426|     // {
          427|       drvPath =
             |       ^
          428|         assert condition;

       … while calling the 'derivationStrict' builtin
         at «nix-internal»/derivation-internal.nix:37:12:
           36|
           37|   strict = derivationStrict drvAttrs;
             |            ^
           38|

       … while evaluating the option `nodes.server.networking.interfaces':

       … while evaluating definitions from `/nix/store/csk881ggvmifg4qf1cal0r1ffflbmlhp-source/nixos/modules/hardware/facter/networking':

       … while evaluating the option `nodes.server.hardware.facter.enable':

       … while evaluating the option `nodes.server.hardware.facter.report':

       … while evaluating the option `nodes.server.hardware.facter.reportPath':

       … while evaluating definitions from `/nix/store/q2d97flnlrbg9yvr9n7mv6kwhdigv47w-source/nixosModules/clanCore/nixos-facter.nix':

       (stack trace truncated; use '--show-trace' to show the full, detailed trace)

       error: build of '/nix/store/1aw9g733adh7hh3dcxcs1bmkzhb8izr1-merged-test-dir-service-machine-id.drv^out' failed: error: gave up after 9 reschedules
failed eval checks.aarch64-linux.matrix-synapse —
error: … while evaluating the attribute 'drvPath' at «https://releases.nixos.org/nixos/26.05/nixos-26.05.11045.774debe7a0d1/nixexprs.tar.xz?narH …
error:
       … while evaluating the attribute 'drvPath'
         at «https://releases.nixos.org/nixos/26.05/nixos-26.05.11045.774debe7a0d1/nixexprs.tar.xz?narHash=sha256-S5MjznoY0gbQbcANPLz5RYjg%2B5/WQmFRgNbHcP%2Bydcg%3D»/lib/customisation.nix:427:7:
          426|     // {
          427|       drvPath =
             |       ^
          428|         assert condition;

       … while calling the 'derivationStrict' builtin
         at «nix-internal»/derivation-internal.nix:37:12:
           36|
           37|   strict = derivationStrict drvAttrs;
             |            ^
           38|

       … while evaluating the option `nodes.machine.networking.interfaces':

       … while evaluating definitions from `/nix/store/csk881ggvmifg4qf1cal0r1ffflbmlhp-source/nixos/modules/hardware/facter/networking':

       … while evaluating the option `nodes.machine.hardware.facter.enable':

       … while evaluating the option `nodes.machine.hardware.facter.report':

       … while evaluating the option `nodes.machine.hardware.facter.reportPath':

       … while evaluating definitions from `/nix/store/q2d97flnlrbg9yvr9n7mv6kwhdigv47w-source/nixosModules/clanCore/nixos-facter.nix':

       (stack trace truncated; use '--show-trace' to show the full, detailed trace)

       error: build of '/nix/store/1k4q4h7b0264nnw73rgmiyag11gv3b9k-merged-test-dir-matrix-synapse.drv^out' failed: error: gave up after 9 reschedules
failed eval checks.aarch64-linux.monitoring —
error: … while evaluating the attribute 'drvPath' at «https://releases.nixos.org/nixos/26.05/nixos-26.05.11045.774debe7a0d1/nixexprs.tar.xz?narH …
error:
       … while evaluating the attribute 'drvPath'
         at «https://releases.nixos.org/nixos/26.05/nixos-26.05.11045.774debe7a0d1/nixexprs.tar.xz?narHash=sha256-S5MjznoY0gbQbcANPLz5RYjg%2B5/WQmFRgNbHcP%2Bydcg%3D»/lib/customisation.nix:427:7:
          426|     // {
          427|       drvPath =
             |       ^
          428|         assert condition;

       … while calling the 'derivationStrict' builtin
         at «nix-internal»/derivation-internal.nix:37:12:
           36|
           37|   strict = derivationStrict drvAttrs;
             |            ^
           38|

       … while evaluating the option `nodes.machine1.networking.interfaces':

       … while evaluating definitions from `/nix/store/csk881ggvmifg4qf1cal0r1ffflbmlhp-source/nixos/modules/hardware/facter/networking':

       … while evaluating the option `nodes.machine1.hardware.facter.enable':

       … while evaluating the option `nodes.machine1.hardware.facter.report':

       … while evaluating the option `nodes.machine1.hardware.facter.reportPath':

       … while evaluating definitions from `/nix/store/q2d97flnlrbg9yvr9n7mv6kwhdigv47w-source/nixosModules/clanCore/nixos-facter.nix':

       (stack trace truncated; use '--show-trace' to show the full, detailed trace)

       error: build of '/nix/store/w7lsmv9zb3ng21k9akkmgq342l47ylf2-merged-test-dir-monitoring.drv^out' failed: error: gave up after 9 reschedules
failed eval checks.aarch64-linux.mycelium —
error: … while evaluating the attribute 'drvPath' at «https://releases.nixos.org/nixos/26.05/nixos-26.05.11045.774debe7a0d1/nixexprs.tar.xz?narH …
error:
       … while evaluating the attribute 'drvPath'
         at «https://releases.nixos.org/nixos/26.05/nixos-26.05.11045.774debe7a0d1/nixexprs.tar.xz?narHash=sha256-S5MjznoY0gbQbcANPLz5RYjg%2B5/WQmFRgNbHcP%2Bydcg%3D»/lib/customisation.nix:427:7:
          426|     // {
          427|       drvPath =
             |       ^
          428|         assert condition;

       … while calling the 'derivationStrict' builtin
         at «nix-internal»/derivation-internal.nix:37:12:
           36|
           37|   strict = derivationStrict drvAttrs;
             |            ^
           38|

       … while evaluating the option `driverConfiguration.vlans':

       … while evaluating definitions from `/nix/store/csk881ggvmifg4qf1cal0r1ffflbmlhp-source/nixos/lib/testing/driver-configuration.nix':

       … while evaluating the option `nodes.server.networking.interfaces':

       … while evaluating definitions from `/nix/store/csk881ggvmifg4qf1cal0r1ffflbmlhp-source/nixos/modules/hardware/facter/networking':

       … while evaluating the option `nodes.server.hardware.facter.enable':

       … while evaluating the option `nodes.server.hardware.facter.report':

       … while evaluating the option `nodes.server.hardware.facter.reportPath':

       … while evaluating definitions from `/nix/store/q2d97flnlrbg9yvr9n7mv6kwhdigv47w-source/nixosModules/clanCore/nixos-facter.nix':

       (stack trace truncated; use '--show-trace' to show the full, detailed trace)

       error: build of '/nix/store/wrfb0i91rk06qpfq4p27lyskcqjlvfl6-merged-test-dir-mycelium.drv^out' failed: error: gave up after 9 reschedules
failed eval checks.aarch64-linux.ncps —
error: … while evaluating the attribute 'drvPath' at «https://releases.nixos.org/nixos/26.05/nixos-26.05.11045.774debe7a0d1/nixexprs.tar.xz?narH …
error:
       … while evaluating the attribute 'drvPath'
         at «https://releases.nixos.org/nixos/26.05/nixos-26.05.11045.774debe7a0d1/nixexprs.tar.xz?narHash=sha256-S5MjznoY0gbQbcANPLz5RYjg%2B5/WQmFRgNbHcP%2Bydcg%3D»/lib/customisation.nix:427:7:
          426|     // {
          427|       drvPath =
             |       ^
          428|         assert condition;

       … while calling the 'derivationStrict' builtin
         at «nix-internal»/derivation-internal.nix:37:12:
           36|
           37|   strict = derivationStrict drvAttrs;
             |            ^
           38|

       … while evaluating the option `nodes.alice.networking.interfaces':

       … while evaluating definitions from `/nix/store/csk881ggvmifg4qf1cal0r1ffflbmlhp-source/nixos/modules/hardware/facter/networking':

       … while evaluating the option `nodes.alice.hardware.facter.enable':

       … while evaluating the option `nodes.alice.hardware.facter.report':

       … while evaluating the option `nodes.alice.hardware.facter.reportPath':

       … while evaluating definitions from `/nix/store/q2d97flnlrbg9yvr9n7mv6kwhdigv47w-source/nixosModules/clanCore/nixos-facter.nix':

       (stack trace truncated; use '--show-trace' to show the full, detailed trace)

       error: build of '/nix/store/0b9va4azqjj9ka1fylgah8qwbq7xx0l5-merged-test-dir-ncps.drv^out' failed: error: gave up after 9 reschedules
failed checks.aarch64-linux.nixos-systemd-abstraction 1m 5s
setup: 20q9blmfi9bwp2sb843ml86jh72dsxy8-clan-cli.drv: build01: the build this call attached to did not finish, retry, asking the scheduler again 20q9blmfi9bwp2s …
setup:
20q9blmfi9bwp2sb843ml86jh72dsxy8-clan-cli.drv: build01: the build this call attached to did not finish, retry, asking the scheduler again
20q9blmfi9bwp2sb843ml86jh72dsxy8-clan-cli.drv: build01: the build this call attached to did not finish, retry, asking the scheduler again
20q9blmfi9bwp2sb843ml86jh72dsxy8-clan-cli.drv: build01: the build this call attached to did not finish, retry, asking the scheduler again
20q9blmfi9bwp2sb843ml86jh72dsxy8-clan-cli.drv: build01: build01: input not substitutable: error: path '/nix/store/qhy9dfxfqapakppa3yjja1zkzn8p31sa-python3-3.13.15-env' is required, but there is no substituter that can build it, asking the scheduler again
20q9blmfi9bwp2sb843ml86jh72dsxy8-clan-cli.drv: build01: the build this call attached to did not finish, retry, asking the scheduler again
20q9blmfi9bwp2sb843ml86jh72dsxy8-clan-cli.drv: build01: build01: input not substitutable: error: path '/nix/store/qhy9dfxfqapakppa3yjja1zkzn8p31sa-python3-3.13.15-env' is required, but there is no substituter that can build it, asking the scheduler again
20q9blmfi9bwp2sb843ml86jh72dsxy8-clan-cli.drv: build01: build01: input not substitutable: error: path '/nix/store/qhy9dfxfqapakppa3yjja1zkzn8p31sa-python3-3.13.15-env' is required, but there is no substituter that can build it, asking the scheduler again
error: dependency 'nq0m6n8p8fsgkq5b0s7jil4ayd667m4w-nixos-test-driver-systemd-abstraction.drv' failed
failed eval checks.aarch64-linux.nixos-test-password-store-mounts —
error: … while evaluating the attribute 'drvPath' at «https://releases.nixos.org/nixos/26.05/nixos-26.05.11045.774debe7a0d1/nixexprs.tar.xz?narH …
error:
       … while evaluating the attribute 'drvPath'
         at «https://releases.nixos.org/nixos/26.05/nixos-26.05.11045.774debe7a0d1/nixexprs.tar.xz?narHash=sha256-S5MjznoY0gbQbcANPLz5RYjg%2B5/WQmFRgNbHcP%2Bydcg%3D»/lib/customisation.nix:427:7:
          426|     // {
          427|       drvPath =
             |       ^
          428|         assert condition;

       … while calling the 'derivationStrict' builtin
         at «nix-internal»/derivation-internal.nix:37:12:
           36|
           37|   strict = derivationStrict drvAttrs;
             |            ^
           38|

       … while evaluating the option `driverConfiguration.vlans':

       … while evaluating definitions from `/nix/store/csk881ggvmifg4qf1cal0r1ffflbmlhp-source/nixos/lib/testing/driver-configuration.nix':

       … while evaluating the option `nodes.machine.networking.interfaces':

       … while evaluating definitions from `/nix/store/csk881ggvmifg4qf1cal0r1ffflbmlhp-source/nixos/modules/hardware/facter/networking':

       … while evaluating the option `nodes.machine.hardware.facter.enable':

       … while evaluating the option `nodes.machine.hardware.facter.report':

       … while evaluating the option `nodes.machine.hardware.facter.reportPath':

       … while evaluating definitions from `/nix/store/q2d97flnlrbg9yvr9n7mv6kwhdigv47w-source/nixosModules/clanCore/nixos-facter.nix':

       (stack trace truncated; use '--show-trace' to show the full, detailed trace)

       error: build of '/nix/store/f3zzvddf2jfahb56201p48pfrxvn9qkr-merged-test-dir-nixos-test-password-store-mounts.drv^out' failed: error: gave up after 9 reschedules
failed eval checks.aarch64-linux.p2p-ssh-iroh —
error: … while evaluating the attribute 'drvPath' at «https://releases.nixos.org/nixos/26.05/nixos-26.05.11045.774debe7a0d1/nixexprs.tar.xz?narH …
error:
       … while evaluating the attribute 'drvPath'
         at «https://releases.nixos.org/nixos/26.05/nixos-26.05.11045.774debe7a0d1/nixexprs.tar.xz?narHash=sha256-S5MjznoY0gbQbcANPLz5RYjg%2B5/WQmFRgNbHcP%2Bydcg%3D»/lib/customisation.nix:427:7:
          426|     // {
          427|       drvPath =
             |       ^
          428|         assert condition;

       … while calling the 'derivationStrict' builtin
         at «nix-internal»/derivation-internal.nix:37:12:
           36|
           37|   strict = derivationStrict drvAttrs;
             |            ^
           38|

       … while evaluating the option `nodes.client.networking.interfaces':

       … while evaluating definitions from `/nix/store/csk881ggvmifg4qf1cal0r1ffflbmlhp-source/nixos/modules/hardware/facter/networking':

       … while evaluating the option `nodes.client.hardware.facter.enable':

       … while evaluating the option `nodes.client.hardware.facter.report':

       … while evaluating the option `nodes.client.hardware.facter.reportPath':

       … while evaluating definitions from `/nix/store/q2d97flnlrbg9yvr9n7mv6kwhdigv47w-source/nixosModules/clanCore/nixos-facter.nix':

       (stack trace truncated; use '--show-trace' to show the full, detailed trace)

       error: build of '/nix/store/66ndbbglvmibsd07r7ajj48sdckr2kcz-merged-test-dir-clan-test-p2p-ssh-iroh.drv^out' failed: error: gave up after 9 reschedules
failed eval checks.aarch64-linux.packages —
error: … while evaluating the attribute 'drvPath' at «https://releases.nixos.org/nixos/26.05/nixos-26.05.11045.774debe7a0d1/nixexprs.tar.xz?narH …
error:
       … while evaluating the attribute 'drvPath'
         at «https://releases.nixos.org/nixos/26.05/nixos-26.05.11045.774debe7a0d1/nixexprs.tar.xz?narHash=sha256-S5MjznoY0gbQbcANPLz5RYjg%2B5/WQmFRgNbHcP%2Bydcg%3D»/lib/customisation.nix:427:7:
          426|     // {
          427|       drvPath =
             |       ^
          428|         assert condition;

       … while calling the 'derivationStrict' builtin
         at «nix-internal»/derivation-internal.nix:37:12:
           36|
           37|   strict = derivationStrict drvAttrs;
             |            ^
           38|

       … while evaluating the option `nodes.server.networking.interfaces':

       … while evaluating definitions from `/nix/store/csk881ggvmifg4qf1cal0r1ffflbmlhp-source/nixos/modules/hardware/facter/networking':

       … while evaluating the option `nodes.server.hardware.facter.enable':

       … while evaluating the option `nodes.server.hardware.facter.report':

       … while evaluating the option `nodes.server.hardware.facter.reportPath':

       … while evaluating definitions from `/nix/store/q2d97flnlrbg9yvr9n7mv6kwhdigv47w-source/nixosModules/clanCore/nixos-facter.nix':

       (stack trace truncated; use '--show-trace' to show the full, detailed trace)

       error: build of '/nix/store/na14dkk4vq4fwaah7jzaxi25xqd3a3g7-merged-test-dir-packages.drv^out' failed: error: error: gRPC AddMultipleToStore on 'nix-store.geninf.io:50051' failed: error: path '/nix/store/4qxqdf020rgf157mcd5iqbm9s3dxpl7n-test-vars-generated.drv' is required, but there is no substituter that can build it
failed eval checks.aarch64-linux.pki —
error: … while evaluating the attribute 'drvPath' at «https://releases.nixos.org/nixos/26.05/nixos-26.05.11045.774debe7a0d1/nixexprs.tar.xz?narH …
error:
       … while evaluating the attribute 'drvPath'
         at «https://releases.nixos.org/nixos/26.05/nixos-26.05.11045.774debe7a0d1/nixexprs.tar.xz?narHash=sha256-S5MjznoY0gbQbcANPLz5RYjg%2B5/WQmFRgNbHcP%2Bydcg%3D»/lib/customisation.nix:427:7:
          426|     // {
          427|       drvPath =
             |       ^
          428|         assert condition;

       … while calling the 'derivationStrict' builtin
         at «nix-internal»/derivation-internal.nix:37:12:
           36|
           37|   strict = derivationStrict drvAttrs;
             |            ^
           38|

       … while evaluating the option `driverConfiguration.vlans':

       … while evaluating definitions from `/nix/store/csk881ggvmifg4qf1cal0r1ffflbmlhp-source/nixos/lib/testing/driver-configuration.nix':

       … while evaluating the option `nodes.caddy.networking.interfaces':

       … while evaluating definitions from `/nix/store/csk881ggvmifg4qf1cal0r1ffflbmlhp-source/nixos/modules/hardware/facter/networking':

       … while evaluating the option `nodes.caddy.hardware.facter.enable':

       … while evaluating the option `nodes.caddy.hardware.facter.report':

       … while evaluating the option `nodes.caddy.hardware.facter.reportPath':

       … while evaluating definitions from `/nix/store/q2d97flnlrbg9yvr9n7mv6kwhdigv47w-source/nixosModules/clanCore/nixos-facter.nix':

       (stack trace truncated; use '--show-trace' to show the full, detailed trace)

       error: build of '/nix/store/jifhxdzffi03r9ax3ri3nqdg8rcg62ax-merged-test-dir-pki.drv^out' failed: error: gave up after 9 reschedules
failed eval checks.aarch64-linux.service-dummy-test —
error: … while evaluating the attribute 'drvPath' at «https://releases.nixos.org/nixos/26.05/nixos-26.05.11045.774debe7a0d1/nixexprs.tar.xz?narH …
error:
       … while evaluating the attribute 'drvPath'
         at «https://releases.nixos.org/nixos/26.05/nixos-26.05.11045.774debe7a0d1/nixexprs.tar.xz?narHash=sha256-S5MjznoY0gbQbcANPLz5RYjg%2B5/WQmFRgNbHcP%2Bydcg%3D»/lib/customisation.nix:427:7:
          426|     // {
          427|       drvPath =
             |       ^
          428|         assert condition;

       … while calling the 'derivationStrict' builtin
         at «nix-internal»/derivation-internal.nix:37:12:
           36|
           37|   strict = derivationStrict drvAttrs;
             |            ^
           38|

       … while evaluating the option `nodes.admin1.networking.interfaces':

       … while evaluating definitions from `/nix/store/csk881ggvmifg4qf1cal0r1ffflbmlhp-source/nixos/modules/hardware/facter/networking':

       … while evaluating the option `nodes.admin1.hardware.facter.enable':

       … while evaluating the option `nodes.admin1.hardware.facter.report':

       … while evaluating the option `nodes.admin1.hardware.facter.reportPath':

       … while evaluating definitions from `/nix/store/q2d97flnlrbg9yvr9n7mv6kwhdigv47w-source/nixosModules/clanCore/nixos-facter.nix':

       (stack trace truncated; use '--show-trace' to show the full, detailed trace)

       error: build of '/nix/store/93r99wqlyhxzhj15ga3hbs1inkv5rq1w-merged-test-dir-service-dummy-test.drv^out' failed: error: gave up after 9 reschedules
failed eval checks.aarch64-linux.service-dummy-test-from-flake —
error: … while evaluating the attribute 'drvPath' at «https://releases.nixos.org/nixos/26.05/nixos-26.05.11045.774debe7a0d1/nixexprs.tar.xz?narH …
error:
       … while evaluating the attribute 'drvPath'
         at «https://releases.nixos.org/nixos/26.05/nixos-26.05.11045.774debe7a0d1/nixexprs.tar.xz?narHash=sha256-S5MjznoY0gbQbcANPLz5RYjg%2B5/WQmFRgNbHcP%2Bydcg%3D»/lib/customisation.nix:427:7:
          426|     // {
          427|       drvPath =
             |       ^
          428|         assert condition;

       … while calling the 'derivationStrict' builtin
         at «nix-internal»/derivation-internal.nix:37:12:
           36|
           37|   strict = derivationStrict drvAttrs;
             |            ^
           38|

       … while evaluating the option `nodes.admin1.networking.interfaces':

       … while evaluating definitions from `/nix/store/csk881ggvmifg4qf1cal0r1ffflbmlhp-source/nixos/modules/hardware/facter/networking':

       … while evaluating the option `nodes.admin1.hardware.facter.enable':

       … while evaluating the option `nodes.admin1.hardware.facter.report':

       … while evaluating the option `nodes.admin1.hardware.facter.reportPath':

       … while evaluating definitions from `/nix/store/q2d97flnlrbg9yvr9n7mv6kwhdigv47w-source/nixosModules/clanCore/nixos-facter.nix':

       (stack trace truncated; use '--show-trace' to show the full, detailed trace)

       error: build of '/nix/store/qsfzrf8p2qb5lhr0nf2j11s5gyi38qbl-merged-test-dir-service-dummy-test-from-flake.drv^out' failed: error: gave up after 9 reschedules
failed checks.aarch64-linux.state-version 20s
setup: this path will be fetched (0.0 KiB download, 0.1 KiB unpacked): /nix/store/078shs3i1phwbck7npc84zkvd7has8vr-container-test-run-service-state-version wa …
setup:
this path will be fetched (0.0 KiB download, 0.1 KiB unpacked):
  /nix/store/078shs3i1phwbck7npc84zkvd7has8vr-container-test-run-service-state-version
warning: ignoring the client-specified setting 'store', because it is a restricted setting and you are not a trusted user
lzw262pfh663qkad1hcngycgiffa59v9-etc.drv: error: gRPC AddMultipleToStore on 'nix-store.geninf.io:50051' failed: error: some references of path '/nix/store/n2p02gjiqfhl4sy08ay55klv7jbz845l-perl-5.42.0-env.drv' could not be realised
error: dependency 'f1f4jx3q2s88aamykibv3awjkhx8gdw9-nixos-test-driver-service-state-version.drv' failed
failed eval checks.aarch64-linux.syncthing-service —
error: … while evaluating the attribute 'drvPath' at «https://releases.nixos.org/nixos/26.05/nixos-26.05.11045.774debe7a0d1/nixexprs.tar.xz?narH …
error:
       … while evaluating the attribute 'drvPath'
         at «https://releases.nixos.org/nixos/26.05/nixos-26.05.11045.774debe7a0d1/nixexprs.tar.xz?narHash=sha256-S5MjznoY0gbQbcANPLz5RYjg%2B5/WQmFRgNbHcP%2Bydcg%3D»/lib/customisation.nix:427:7:
          426|     // {
          427|       drvPath =
             |       ^
          428|         assert condition;

       … while calling the 'derivationStrict' builtin
         at «nix-internal»/derivation-internal.nix:37:12:
           36|
           37|   strict = derivationStrict drvAttrs;
             |            ^
           38|

       … while evaluating the option `nodes.machine1.networking.interfaces':

       … while evaluating definitions from `/nix/store/csk881ggvmifg4qf1cal0r1ffflbmlhp-source/nixos/modules/hardware/facter/networking':

       … while evaluating the option `nodes.machine1.hardware.facter.enable':

       … while evaluating the option `nodes.machine1.hardware.facter.report':

       … while evaluating the option `nodes.machine1.hardware.facter.reportPath':

       … while evaluating definitions from `/nix/store/q2d97flnlrbg9yvr9n7mv6kwhdigv47w-source/nixosModules/clanCore/nixos-facter.nix':

       (stack trace truncated; use '--show-trace' to show the full, detailed trace)

       error: build of '/nix/store/8ixbnwzwsadhimss7kqf9qm86dgjzchh-merged-test-dir-syncthing-service.drv^out' failed: error: gave up after 9 reschedules
failed checks.aarch64-linux.treefmt 32s
setup: g3cp08i0l33b8h9n50ck4y435xnnd8bq-treefmt-check.drv: build01: build01: input not substitutable: error: some references of path '/nix/store/nq7qhm9f18ilkx5 …
setup:
g3cp08i0l33b8h9n50ck4y435xnnd8bq-treefmt-check.drv: build01: build01: input not substitutable: error: some references of path '/nix/store/nq7qhm9f18ilkx5ffi48gs0sfyxzcgs2-treefmt' could not be realised, asking the scheduler again
g3cp08i0l33b8h9n50ck4y435xnnd8bq-treefmt-check.drv: build01: build01: input not substitutable: error: some references of path '/nix/store/nq7qhm9f18ilkx5ffi48gs0sfyxzcgs2-treefmt' could not be realised, asking the scheduler again
g3cp08i0l33b8h9n50ck4y435xnnd8bq-treefmt-check.drv: build01: build01: input not substitutable: error: some references of path '/nix/store/nq7qhm9f18ilkx5ffi48gs0sfyxzcgs2-treefmt' could not be realised, asking the scheduler again
g3cp08i0l33b8h9n50ck4y435xnnd8bq-treefmt-check.drv: build01: build01: input not substitutable: error: some references of path '/nix/store/nq7qhm9f18ilkx5ffi48gs0sfyxzcgs2-treefmt' could not be realised, asking the scheduler again
g3cp08i0l33b8h9n50ck4y435xnnd8bq-treefmt-check.drv: build01: build01: input not substitutable: error: some references of path '/nix/store/nq7qhm9f18ilkx5ffi48gs0sfyxzcgs2-treefmt' could not be realised, asking the scheduler again
g3cp08i0l33b8h9n50ck4y435xnnd8bq-treefmt-check.drv: build01: build01: input not substitutable: error: some references of path '/nix/store/nq7qhm9f18ilkx5ffi48gs0sfyxzcgs2-treefmt' could not be realised, asking the scheduler again
g3cp08i0l33b8h9n50ck4y435xnnd8bq-treefmt-check.drv: build01: build01: input not substitutable: error: some references of path '/nix/store/nq7qhm9f18ilkx5ffi48gs0sfyxzcgs2-treefmt' could not be realised, asking the scheduler again
error: gave up after 9 reschedules
failed eval checks.aarch64-linux.users —
error: … while evaluating the attribute 'drvPath' at «https://releases.nixos.org/nixos/26.05/nixos-26.05.11045.774debe7a0d1/nixexprs.tar.xz?narH …
error:
       … while evaluating the attribute 'drvPath'
         at «https://releases.nixos.org/nixos/26.05/nixos-26.05.11045.774debe7a0d1/nixexprs.tar.xz?narHash=sha256-S5MjznoY0gbQbcANPLz5RYjg%2B5/WQmFRgNbHcP%2Bydcg%3D»/lib/customisation.nix:427:7:
          426|     // {
          427|       drvPath =
             |       ^
          428|         assert condition;

       … while calling the 'derivationStrict' builtin
         at «nix-internal»/derivation-internal.nix:37:12:
           36|
           37|   strict = derivationStrict drvAttrs;
             |            ^
           38|

       … while evaluating the option `nodes.server.networking.interfaces':

       … while evaluating definitions from `/nix/store/csk881ggvmifg4qf1cal0r1ffflbmlhp-source/nixos/modules/hardware/facter/networking':

       … while evaluating the option `nodes.server.hardware.facter.enable':

       … while evaluating the option `nodes.server.hardware.facter.report':

       … while evaluating the option `nodes.server.hardware.facter.reportPath':

       … while evaluating definitions from `/nix/store/q2d97flnlrbg9yvr9n7mv6kwhdigv47w-source/nixosModules/clanCore/nixos-facter.nix':

       (stack trace truncated; use '--show-trace' to show the full, detailed trace)

       error: build of '/nix/store/rx39mmxfmdxw2hp0hy63igdj7q0j0mqw-merged-test-dir-users.drv^out' failed: error: gave up after 9 reschedules
failed eval checks.aarch64-linux.wireguard —
error: … while evaluating the attribute 'drvPath' at «https://releases.nixos.org/nixos/26.05/nixos-26.05.11045.774debe7a0d1/nixexprs.tar.xz?narH …
error:
       … while evaluating the attribute 'drvPath'
         at «https://releases.nixos.org/nixos/26.05/nixos-26.05.11045.774debe7a0d1/nixexprs.tar.xz?narHash=sha256-S5MjznoY0gbQbcANPLz5RYjg%2B5/WQmFRgNbHcP%2Bydcg%3D»/lib/customisation.nix:427:7:
          426|     // {
          427|       drvPath =
             |       ^
          428|         assert condition;

       … while calling the 'derivationStrict' builtin
         at «nix-internal»/derivation-internal.nix:37:12:
           36|
           37|   strict = derivationStrict drvAttrs;
             |            ^
           38|

       … while evaluating the option `nodes.controller1.networking.interfaces':

       … while evaluating definitions from `/nix/store/csk881ggvmifg4qf1cal0r1ffflbmlhp-source/nixos/modules/hardware/facter/networking':

       … while evaluating the option `nodes.controller1.hardware.facter.enable':

       … while evaluating the option `nodes.controller1.hardware.facter.report':

       … while evaluating the option `nodes.controller1.hardware.facter.reportPath':

       … while evaluating definitions from `/nix/store/q2d97flnlrbg9yvr9n7mv6kwhdigv47w-source/nixosModules/clanCore/nixos-facter.nix':

       (stack trace truncated; use '--show-trace' to show the full, detailed trace)

       error: build of '/nix/store/k99w3l2gf1wlzjh8lihbaw1rh078jaka-merged-test-dir-wireguard.drv^out' failed: error: gave up after 9 reschedules
failed eval checks.aarch64-linux.zerotier —
error: … while evaluating the attribute 'drvPath' at «https://releases.nixos.org/nixos/26.05/nixos-26.05.11045.774debe7a0d1/nixexprs.tar.xz?narH …
error:
       … while evaluating the attribute 'drvPath'
         at «https://releases.nixos.org/nixos/26.05/nixos-26.05.11045.774debe7a0d1/nixexprs.tar.xz?narHash=sha256-S5MjznoY0gbQbcANPLz5RYjg%2B5/WQmFRgNbHcP%2Bydcg%3D»/lib/customisation.nix:427:7:
          426|     // {
          427|       drvPath =
             |       ^
          428|         assert condition;

       … while calling the 'derivationStrict' builtin
         at «nix-internal»/derivation-internal.nix:37:12:
           36|
           37|   strict = derivationStrict drvAttrs;
             |            ^
           38|

       … while evaluating the option `driverConfiguration.vlans':

       … while evaluating definitions from `/nix/store/csk881ggvmifg4qf1cal0r1ffflbmlhp-source/nixos/lib/testing/driver-configuration.nix':

       … while evaluating the option `nodes.controller.networking.interfaces':

       … while evaluating definitions from `/nix/store/csk881ggvmifg4qf1cal0r1ffflbmlhp-source/nixos/modules/hardware/facter/networking':

       … while evaluating the option `nodes.controller.hardware.facter.enable':

       … while evaluating the option `nodes.controller.hardware.facter.report':

       … while evaluating the option `nodes.controller.hardware.facter.reportPath':

       … while evaluating definitions from `/nix/store/q2d97flnlrbg9yvr9n7mv6kwhdigv47w-source/nixosModules/clanCore/nixos-facter.nix':

       (stack trace truncated; use '--show-trace' to show the full, detailed trace)

       error: build of '/nix/store/plrafijfzclzss9dl00yfdm906l5p3xx-merged-test-dir-zerotier.drv^out' failed: error: gave up after 9 reschedules
failed eval checks.aarch64-linux.zerotier-multi-instance —
error: … while evaluating the attribute 'drvPath' at «https://releases.nixos.org/nixos/26.05/nixos-26.05.11045.774debe7a0d1/nixexprs.tar.xz?narH …
error:
       … while evaluating the attribute 'drvPath'
         at «https://releases.nixos.org/nixos/26.05/nixos-26.05.11045.774debe7a0d1/nixexprs.tar.xz?narHash=sha256-S5MjznoY0gbQbcANPLz5RYjg%2B5/WQmFRgNbHcP%2Bydcg%3D»/lib/customisation.nix:427:7:
          426|     // {
          427|       drvPath =
             |       ^
          428|         assert condition;

       … while calling the 'derivationStrict' builtin
         at «nix-internal»/derivation-internal.nix:37:12:
           36|
           37|   strict = derivationStrict drvAttrs;
             |            ^
           38|

       … while evaluating the option `driverConfiguration.vlans':

       … while evaluating definitions from `/nix/store/csk881ggvmifg4qf1cal0r1ffflbmlhp-source/nixos/lib/testing/driver-configuration.nix':

       … while evaluating the option `nodes.alpha.networking.interfaces':

       … while evaluating definitions from `/nix/store/csk881ggvmifg4qf1cal0r1ffflbmlhp-source/nixos/modules/hardware/facter/networking':

       … while evaluating the option `nodes.alpha.hardware.facter.enable':

       … while evaluating the option `nodes.alpha.hardware.facter.report':

       … while evaluating the option `nodes.alpha.hardware.facter.reportPath':

       … while evaluating definitions from `/nix/store/q2d97flnlrbg9yvr9n7mv6kwhdigv47w-source/nixosModules/clanCore/nixos-facter.nix':

       (stack trace truncated; use '--show-trace' to show the full, detailed trace)

       error: build of '/nix/store/gb0pvdh3p89c6fjyqzfav5y3w7dlns4m-merged-test-dir-zerotier-multi-instance.drv^out' failed: error: gave up after 9 reschedules
failed eval checks.x86_64-linux.borgbackup —
error: … while evaluating the attribute 'drvPath' at «https://releases.nixos.org/nixos/26.05/nixos-26.05.11045.774debe7a0d1/nixexprs.tar.xz?narH …
error:
       … while evaluating the attribute 'drvPath'
         at «https://releases.nixos.org/nixos/26.05/nixos-26.05.11045.774debe7a0d1/nixexprs.tar.xz?narHash=sha256-S5MjznoY0gbQbcANPLz5RYjg%2B5/WQmFRgNbHcP%2Bydcg%3D»/lib/customisation.nix:427:7:
          426|     // {
          427|       drvPath =
             |       ^
          428|         assert condition;

       … while calling the 'derivationStrict' builtin
         at «nix-internal»/derivation-internal.nix:37:12:
           36|
           37|   strict = derivationStrict drvAttrs;
             |            ^
           38|

       … while evaluating the option `nodes.clientone.networking.interfaces':

       … while evaluating definitions from `/nix/store/csk881ggvmifg4qf1cal0r1ffflbmlhp-source/nixos/modules/hardware/facter/networking':

       … while evaluating the option `nodes.clientone.hardware.facter.enable':

       … while evaluating the option `nodes.clientone.hardware.facter.report':

       … while evaluating the option `nodes.clientone.hardware.facter.reportPath':

       … while evaluating definitions from `/nix/store/q2d97flnlrbg9yvr9n7mv6kwhdigv47w-source/nixosModules/clanCore/nixos-facter.nix':

       (stack trace truncated; use '--show-trace' to show the full, detailed trace)

       error: build of '/nix/store/c20nf5ixxlkl98byh90mdyscphw2i96v-merged-test-dir-borgbackup.drv^out' failed: error: gave up after 9 reschedules
failed eval checks.x86_64-linux.certificates —
error: … while evaluating the attribute 'drvPath' at «https://releases.nixos.org/nixos/26.05/nixos-26.05.11045.774debe7a0d1/nixexprs.tar.xz?narH …
error:
       … while evaluating the attribute 'drvPath'
         at «https://releases.nixos.org/nixos/26.05/nixos-26.05.11045.774debe7a0d1/nixexprs.tar.xz?narHash=sha256-S5MjznoY0gbQbcANPLz5RYjg%2B5/WQmFRgNbHcP%2Bydcg%3D»/lib/customisation.nix:427:7:
          426|     // {
          427|       drvPath =
             |       ^
          428|         assert condition;

       … while calling the 'derivationStrict' builtin
         at «nix-internal»/derivation-internal.nix:37:12:
           36|
           37|   strict = derivationStrict drvAttrs;
             |            ^
           38|

       … while evaluating the option `nodes.ca.networking.interfaces':

       … while evaluating definitions from `/nix/store/csk881ggvmifg4qf1cal0r1ffflbmlhp-source/nixos/modules/hardware/facter/networking':

       … while evaluating the option `nodes.ca.hardware.facter.enable':

       … while evaluating the option `nodes.ca.hardware.facter.report':

       … while evaluating the option `nodes.ca.hardware.facter.reportPath':

       … while evaluating definitions from `/nix/store/q2d97flnlrbg9yvr9n7mv6kwhdigv47w-source/nixosModules/clanCore/nixos-facter.nix':

       (stack trace truncated; use '--show-trace' to show the full, detailed trace)

       error: build of '/nix/store/2sfs7lp26wpjls0kgvikwkqadn400rph-merged-test-dir-certificates.drv^out' failed: error: gave up after 9 reschedules
failed eval checks.x86_64-linux.clan-test-update —
error: … while evaluating the attribute 'drvPath' at «https://releases.nixos.org/nixos/26.05/nixos-26.05.11045.774debe7a0d1/nixexprs.tar.xz?narH …
error:
       … while evaluating the attribute 'drvPath'
         at «https://releases.nixos.org/nixos/26.05/nixos-26.05.11045.774debe7a0d1/nixexprs.tar.xz?narHash=sha256-S5MjznoY0gbQbcANPLz5RYjg%2B5/WQmFRgNbHcP%2Bydcg%3D»/lib/customisation.nix:427:7:
          426|     // {
          427|       drvPath =
             |       ^
          428|         assert condition;

       … while calling the 'derivationStrict' builtin
         at «nix-internal»/derivation-internal.nix:37:12:
           36|
           37|   strict = derivationStrict drvAttrs;
             |            ^
           38|

       … while evaluating the option `nodes.test-update-machine.networking.interfaces':

       … while evaluating definitions from `/nix/store/csk881ggvmifg4qf1cal0r1ffflbmlhp-source/nixos/modules/hardware/facter/networking':

       … while evaluating the option `nodes.test-update-machine.hardware.facter.enable':

       … while evaluating the option `nodes.test-update-machine.hardware.facter.report':

       … while evaluating the option `nodes.test-update-machine.hardware.facter.reportPath':

       … while evaluating definitions from `/nix/store/q2d97flnlrbg9yvr9n7mv6kwhdigv47w-source/nixosModules/clanCore/nixos-facter.nix':

       (stack trace truncated; use '--show-trace' to show the full, detailed trace)

       error: build of '/nix/store/3ny5bysiwfn40mfsp9682fq77wi4dvpl-merged-test-dir-clan-test-update.drv^out' failed: error: gave up after 9 reschedules
failed eval checks.x86_64-linux.data-mesher —
error: … while evaluating the attribute 'drvPath' at «https://releases.nixos.org/nixos/26.05/nixos-26.05.11045.774debe7a0d1/nixexprs.tar.xz?narH …
error:
       … while evaluating the attribute 'drvPath'
         at «https://releases.nixos.org/nixos/26.05/nixos-26.05.11045.774debe7a0d1/nixexprs.tar.xz?narHash=sha256-S5MjznoY0gbQbcANPLz5RYjg%2B5/WQmFRgNbHcP%2Bydcg%3D»/lib/customisation.nix:427:7:
          426|     // {
          427|       drvPath =
             |       ^
          428|         assert condition;

       … while calling the 'derivationStrict' builtin
         at «nix-internal»/derivation-internal.nix:37:12:
           36|
           37|   strict = derivationStrict drvAttrs;
             |            ^
           38|

       … while evaluating the option `nodes.alpha.networking.interfaces':

       … while evaluating definitions from `/nix/store/csk881ggvmifg4qf1cal0r1ffflbmlhp-source/nixos/modules/hardware/facter/networking':

       … while evaluating the option `nodes.alpha.hardware.facter.enable':

       … while evaluating the option `nodes.alpha.hardware.facter.report':

       … while evaluating the option `nodes.alpha.hardware.facter.reportPath':

       … while evaluating definitions from `/nix/store/q2d97flnlrbg9yvr9n7mv6kwhdigv47w-source/nixosModules/clanCore/nixos-facter.nix':

       (stack trace truncated; use '--show-trace' to show the full, detailed trace)

       error: build of '/nix/store/bisdrchsk95mhvw467p4wq5b2f79msnx-merged-test-dir-data-mesher.drv^out' failed: error: gave up after 9 reschedules
failed eval checks.x86_64-linux.dm-dns —
error: … while evaluating the attribute 'drvPath' at «https://releases.nixos.org/nixos/26.05/nixos-26.05.11045.774debe7a0d1/nixexprs.tar.xz?narH …
error:
       … while evaluating the attribute 'drvPath'
         at «https://releases.nixos.org/nixos/26.05/nixos-26.05.11045.774debe7a0d1/nixexprs.tar.xz?narHash=sha256-S5MjznoY0gbQbcANPLz5RYjg%2B5/WQmFRgNbHcP%2Bydcg%3D»/lib/customisation.nix:427:7:
          426|     // {
          427|       drvPath =
             |       ^
          428|         assert condition;

       … while calling the 'derivationStrict' builtin
         at «nix-internal»/derivation-internal.nix:37:12:
           36|
           37|   strict = derivationStrict drvAttrs;
             |            ^
           38|

       … while evaluating the option `nodes.client.networking.interfaces':

       … while evaluating definitions from `/nix/store/csk881ggvmifg4qf1cal0r1ffflbmlhp-source/nixos/modules/hardware/facter/networking':

       … while evaluating the option `nodes.client.hardware.facter.enable':

       … while evaluating the option `nodes.client.hardware.facter.report':

       … while evaluating the option `nodes.client.hardware.facter.reportPath':

       … while evaluating definitions from `/nix/store/q2d97flnlrbg9yvr9n7mv6kwhdigv47w-source/nixosModules/clanCore/nixos-facter.nix':

       (stack trace truncated; use '--show-trace' to show the full, detailed trace)

       error: build of '/nix/store/yln3f9jkdz1nwbsd4mb869zl8hfcnvyl-merged-test-dir-dm-dns.drv^out' failed: error: gave up after 9 reschedules
failed eval checks.x86_64-linux.garage —
error: … while evaluating the attribute 'drvPath' at «https://releases.nixos.org/nixos/26.05/nixos-26.05.11045.774debe7a0d1/nixexprs.tar.xz?narH …
error:
       … while evaluating the attribute 'drvPath'
         at «https://releases.nixos.org/nixos/26.05/nixos-26.05.11045.774debe7a0d1/nixexprs.tar.xz?narHash=sha256-S5MjznoY0gbQbcANPLz5RYjg%2B5/WQmFRgNbHcP%2Bydcg%3D»/lib/customisation.nix:427:7:
          426|     // {
          427|       drvPath =
             |       ^
          428|         assert condition;

       … while calling the 'derivationStrict' builtin
         at «nix-internal»/derivation-internal.nix:37:12:
           36|
           37|   strict = derivationStrict drvAttrs;
             |            ^
           38|

       … while evaluating the option `nodes.server.networking.interfaces':

       … while evaluating definitions from `/nix/store/csk881ggvmifg4qf1cal0r1ffflbmlhp-source/nixos/modules/hardware/facter/networking':

       … while evaluating the option `nodes.server.hardware.facter.enable':

       … while evaluating the option `nodes.server.hardware.facter.report':

       … while evaluating the option `nodes.server.hardware.facter.reportPath':

       … while evaluating definitions from `/nix/store/q2d97flnlrbg9yvr9n7mv6kwhdigv47w-source/nixosModules/clanCore/nixos-facter.nix':

       (stack trace truncated; use '--show-trace' to show the full, detailed trace)

       error: build of '/nix/store/m5bznfa9ljfbjad6mr813wqn4ncj0h1c-merged-test-dir-garage.drv^out' failed: error: gave up after 9 reschedules
failed eval checks.x86_64-linux.machine-id —
error: … while evaluating the attribute 'drvPath' at «https://releases.nixos.org/nixos/26.05/nixos-26.05.11045.774debe7a0d1/nixexprs.tar.xz?narH …
error:
       … while evaluating the attribute 'drvPath'
         at «https://releases.nixos.org/nixos/26.05/nixos-26.05.11045.774debe7a0d1/nixexprs.tar.xz?narHash=sha256-S5MjznoY0gbQbcANPLz5RYjg%2B5/WQmFRgNbHcP%2Bydcg%3D»/lib/customisation.nix:427:7:
          426|     // {
          427|       drvPath =
             |       ^
          428|         assert condition;

       … while calling the 'derivationStrict' builtin
         at «nix-internal»/derivation-internal.nix:37:12:
           36|
           37|   strict = derivationStrict drvAttrs;
             |            ^
           38|

       … while evaluating the option `nodes.server.networking.interfaces':

       … while evaluating definitions from `/nix/store/csk881ggvmifg4qf1cal0r1ffflbmlhp-source/nixos/modules/hardware/facter/networking':

       … while evaluating the option `nodes.server.hardware.facter.enable':

       … while evaluating the option `nodes.server.hardware.facter.report':

       … while evaluating the option `nodes.server.hardware.facter.reportPath':

       … while evaluating definitions from `/nix/store/q2d97flnlrbg9yvr9n7mv6kwhdigv47w-source/nixosModules/clanCore/nixos-facter.nix':

       (stack trace truncated; use '--show-trace' to show the full, detailed trace)

       error: build of '/nix/store/1aw9g733adh7hh3dcxcs1bmkzhb8izr1-merged-test-dir-service-machine-id.drv^out' failed: error: gave up after 9 reschedules
failed eval checks.x86_64-linux.matrix-synapse —
error: … while evaluating the attribute 'drvPath' at «https://releases.nixos.org/nixos/26.05/nixos-26.05.11045.774debe7a0d1/nixexprs.tar.xz?narH …
error:
       … while evaluating the attribute 'drvPath'
         at «https://releases.nixos.org/nixos/26.05/nixos-26.05.11045.774debe7a0d1/nixexprs.tar.xz?narHash=sha256-S5MjznoY0gbQbcANPLz5RYjg%2B5/WQmFRgNbHcP%2Bydcg%3D»/lib/customisation.nix:427:7:
          426|     // {
          427|       drvPath =
             |       ^
          428|         assert condition;

       … while calling the 'derivationStrict' builtin
         at «nix-internal»/derivation-internal.nix:37:12:
           36|
           37|   strict = derivationStrict drvAttrs;
             |            ^
           38|

       … while evaluating the option `nodes.machine.networking.interfaces':

       … while evaluating definitions from `/nix/store/csk881ggvmifg4qf1cal0r1ffflbmlhp-source/nixos/modules/hardware/facter/networking':

       … while evaluating the option `nodes.machine.hardware.facter.enable':

       … while evaluating the option `nodes.machine.hardware.facter.report':

       … while evaluating the option `nodes.machine.hardware.facter.reportPath':

       … while evaluating definitions from `/nix/store/q2d97flnlrbg9yvr9n7mv6kwhdigv47w-source/nixosModules/clanCore/nixos-facter.nix':

       (stack trace truncated; use '--show-trace' to show the full, detailed trace)

       error: build of '/nix/store/1k4q4h7b0264nnw73rgmiyag11gv3b9k-merged-test-dir-matrix-synapse.drv^out' failed: error: gave up after 9 reschedules
failed eval checks.x86_64-linux.monitoring —
error: … while evaluating the attribute 'drvPath' at «https://releases.nixos.org/nixos/26.05/nixos-26.05.11045.774debe7a0d1/nixexprs.tar.xz?narH …
error:
       … while evaluating the attribute 'drvPath'
         at «https://releases.nixos.org/nixos/26.05/nixos-26.05.11045.774debe7a0d1/nixexprs.tar.xz?narHash=sha256-S5MjznoY0gbQbcANPLz5RYjg%2B5/WQmFRgNbHcP%2Bydcg%3D»/lib/customisation.nix:427:7:
          426|     // {
          427|       drvPath =
             |       ^
          428|         assert condition;

       … while calling the 'derivationStrict' builtin
         at «nix-internal»/derivation-internal.nix:37:12:
           36|
           37|   strict = derivationStrict drvAttrs;
             |            ^
           38|

       … while evaluating the option `nodes.machine1.networking.interfaces':

       … while evaluating definitions from `/nix/store/csk881ggvmifg4qf1cal0r1ffflbmlhp-source/nixos/modules/hardware/facter/networking':

       … while evaluating the option `nodes.machine1.hardware.facter.enable':

       … while evaluating the option `nodes.machine1.hardware.facter.report':

       … while evaluating the option `nodes.machine1.hardware.facter.reportPath':

       … while evaluating definitions from `/nix/store/q2d97flnlrbg9yvr9n7mv6kwhdigv47w-source/nixosModules/clanCore/nixos-facter.nix':

       (stack trace truncated; use '--show-trace' to show the full, detailed trace)

       error: build of '/nix/store/w7lsmv9zb3ng21k9akkmgq342l47ylf2-merged-test-dir-monitoring.drv^out' failed: error: gave up after 9 reschedules
failed eval checks.x86_64-linux.mycelium —
error: … while evaluating the attribute 'drvPath' at «https://releases.nixos.org/nixos/26.05/nixos-26.05.11045.774debe7a0d1/nixexprs.tar.xz?narH …
error:
       … while evaluating the attribute 'drvPath'
         at «https://releases.nixos.org/nixos/26.05/nixos-26.05.11045.774debe7a0d1/nixexprs.tar.xz?narHash=sha256-S5MjznoY0gbQbcANPLz5RYjg%2B5/WQmFRgNbHcP%2Bydcg%3D»/lib/customisation.nix:427:7:
          426|     // {
          427|       drvPath =
             |       ^
          428|         assert condition;

       … while calling the 'derivationStrict' builtin
         at «nix-internal»/derivation-internal.nix:37:12:
           36|
           37|   strict = derivationStrict drvAttrs;
             |            ^
           38|

       … while evaluating the option `driverConfiguration.vlans':

       … while evaluating definitions from `/nix/store/csk881ggvmifg4qf1cal0r1ffflbmlhp-source/nixos/lib/testing/driver-configuration.nix':

       … while evaluating the option `nodes.server.networking.interfaces':

       … while evaluating definitions from `/nix/store/csk881ggvmifg4qf1cal0r1ffflbmlhp-source/nixos/modules/hardware/facter/networking':

       … while evaluating the option `nodes.server.hardware.facter.enable':

       … while evaluating the option `nodes.server.hardware.facter.report':

       … while evaluating the option `nodes.server.hardware.facter.reportPath':

       … while evaluating definitions from `/nix/store/q2d97flnlrbg9yvr9n7mv6kwhdigv47w-source/nixosModules/clanCore/nixos-facter.nix':

       (stack trace truncated; use '--show-trace' to show the full, detailed trace)

       error: build of '/nix/store/wrfb0i91rk06qpfq4p27lyskcqjlvfl6-merged-test-dir-mycelium.drv^out' failed: error: gave up after 9 reschedules
failed eval checks.x86_64-linux.ncps —
error: … while evaluating the attribute 'drvPath' at «https://releases.nixos.org/nixos/26.05/nixos-26.05.11045.774debe7a0d1/nixexprs.tar.xz?narH …
error:
       … while evaluating the attribute 'drvPath'
         at «https://releases.nixos.org/nixos/26.05/nixos-26.05.11045.774debe7a0d1/nixexprs.tar.xz?narHash=sha256-S5MjznoY0gbQbcANPLz5RYjg%2B5/WQmFRgNbHcP%2Bydcg%3D»/lib/customisation.nix:427:7:
          426|     // {
          427|       drvPath =
             |       ^
          428|         assert condition;

       … while calling the 'derivationStrict' builtin
         at «nix-internal»/derivation-internal.nix:37:12:
           36|
           37|   strict = derivationStrict drvAttrs;
             |            ^
           38|

       … while evaluating the option `nodes.alice.networking.interfaces':

       … while evaluating definitions from `/nix/store/csk881ggvmifg4qf1cal0r1ffflbmlhp-source/nixos/modules/hardware/facter/networking':

       … while evaluating the option `nodes.alice.hardware.facter.enable':

       … while evaluating the option `nodes.alice.hardware.facter.report':

       … while evaluating the option `nodes.alice.hardware.facter.reportPath':

       … while evaluating definitions from `/nix/store/q2d97flnlrbg9yvr9n7mv6kwhdigv47w-source/nixosModules/clanCore/nixos-facter.nix':

       (stack trace truncated; use '--show-trace' to show the full, detailed trace)

       error: build of '/nix/store/0b9va4azqjj9ka1fylgah8qwbq7xx0l5-merged-test-dir-ncps.drv^out' failed: error: gave up after 9 reschedules
failed eval checks.x86_64-linux.nixos-test-password-store-mounts —
error: … while evaluating the attribute 'drvPath' at «https://releases.nixos.org/nixos/26.05/nixos-26.05.11045.774debe7a0d1/nixexprs.tar.xz?narH …
error:
       … while evaluating the attribute 'drvPath'
         at «https://releases.nixos.org/nixos/26.05/nixos-26.05.11045.774debe7a0d1/nixexprs.tar.xz?narHash=sha256-S5MjznoY0gbQbcANPLz5RYjg%2B5/WQmFRgNbHcP%2Bydcg%3D»/lib/customisation.nix:427:7:
          426|     // {
          427|       drvPath =
             |       ^
          428|         assert condition;

       … while calling the 'derivationStrict' builtin
         at «nix-internal»/derivation-internal.nix:37:12:
           36|
           37|   strict = derivationStrict drvAttrs;
             |            ^
           38|

       … while evaluating the option `driverConfiguration.vlans':

       … while evaluating definitions from `/nix/store/csk881ggvmifg4qf1cal0r1ffflbmlhp-source/nixos/lib/testing/driver-configuration.nix':

       … while evaluating the option `nodes.machine.networking.interfaces':

       … while evaluating definitions from `/nix/store/csk881ggvmifg4qf1cal0r1ffflbmlhp-source/nixos/modules/hardware/facter/networking':

       … while evaluating the option `nodes.machine.hardware.facter.enable':

       … while evaluating the option `nodes.machine.hardware.facter.report':

       … while evaluating the option `nodes.machine.hardware.facter.reportPath':

       … while evaluating definitions from `/nix/store/q2d97flnlrbg9yvr9n7mv6kwhdigv47w-source/nixosModules/clanCore/nixos-facter.nix':

       (stack trace truncated; use '--show-trace' to show the full, detailed trace)

       error: build of '/nix/store/f3zzvddf2jfahb56201p48pfrxvn9qkr-merged-test-dir-nixos-test-password-store-mounts.drv^out' failed: error: gave up after 9 reschedules
failed eval checks.x86_64-linux.p2p-ssh-iroh —
error: … while evaluating the attribute 'drvPath' at «https://releases.nixos.org/nixos/26.05/nixos-26.05.11045.774debe7a0d1/nixexprs.tar.xz?narH …
error:
       … while evaluating the attribute 'drvPath'
         at «https://releases.nixos.org/nixos/26.05/nixos-26.05.11045.774debe7a0d1/nixexprs.tar.xz?narHash=sha256-S5MjznoY0gbQbcANPLz5RYjg%2B5/WQmFRgNbHcP%2Bydcg%3D»/lib/customisation.nix:427:7:
          426|     // {
          427|       drvPath =
             |       ^
          428|         assert condition;

       … while calling the 'derivationStrict' builtin
         at «nix-internal»/derivation-internal.nix:37:12:
           36|
           37|   strict = derivationStrict drvAttrs;
             |            ^
           38|

       … while evaluating the option `nodes.client.networking.interfaces':

       … while evaluating definitions from `/nix/store/csk881ggvmifg4qf1cal0r1ffflbmlhp-source/nixos/modules/hardware/facter/networking':

       … while evaluating the option `nodes.client.hardware.facter.enable':

       … while evaluating the option `nodes.client.hardware.facter.report':

       … while evaluating the option `nodes.client.hardware.facter.reportPath':

       … while evaluating definitions from `/nix/store/q2d97flnlrbg9yvr9n7mv6kwhdigv47w-source/nixosModules/clanCore/nixos-facter.nix':

       (stack trace truncated; use '--show-trace' to show the full, detailed trace)

       error: build of '/nix/store/66ndbbglvmibsd07r7ajj48sdckr2kcz-merged-test-dir-clan-test-p2p-ssh-iroh.drv^out' failed: error: gave up after 9 reschedules
failed eval checks.x86_64-linux.packages —
error: … while evaluating the attribute 'drvPath' at «https://releases.nixos.org/nixos/26.05/nixos-26.05.11045.774debe7a0d1/nixexprs.tar.xz?narH …
error:
       … while evaluating the attribute 'drvPath'
         at «https://releases.nixos.org/nixos/26.05/nixos-26.05.11045.774debe7a0d1/nixexprs.tar.xz?narHash=sha256-S5MjznoY0gbQbcANPLz5RYjg%2B5/WQmFRgNbHcP%2Bydcg%3D»/lib/customisation.nix:427:7:
          426|     // {
          427|       drvPath =
             |       ^
          428|         assert condition;

       … while calling the 'derivationStrict' builtin
         at «nix-internal»/derivation-internal.nix:37:12:
           36|
           37|   strict = derivationStrict drvAttrs;
             |            ^
           38|

       … while evaluating the option `nodes.server.networking.interfaces':

       … while evaluating definitions from `/nix/store/csk881ggvmifg4qf1cal0r1ffflbmlhp-source/nixos/modules/hardware/facter/networking':

       … while evaluating the option `nodes.server.hardware.facter.enable':

       … while evaluating the option `nodes.server.hardware.facter.report':

       … while evaluating the option `nodes.server.hardware.facter.reportPath':

       … while evaluating definitions from `/nix/store/q2d97flnlrbg9yvr9n7mv6kwhdigv47w-source/nixosModules/clanCore/nixos-facter.nix':

       (stack trace truncated; use '--show-trace' to show the full, detailed trace)

       error: build of '/nix/store/na14dkk4vq4fwaah7jzaxi25xqd3a3g7-merged-test-dir-packages.drv^out' failed: error: error: gRPC AddMultipleToStore on 'nix-store.geninf.io:50051' failed: error: path '/nix/store/4qxqdf020rgf157mcd5iqbm9s3dxpl7n-test-vars-generated.drv' is required, but there is no substituter that can build it
failed eval checks.x86_64-linux.pki —
error: … while evaluating the attribute 'drvPath' at «https://releases.nixos.org/nixos/26.05/nixos-26.05.11045.774debe7a0d1/nixexprs.tar.xz?narH …
error:
       … while evaluating the attribute 'drvPath'
         at «https://releases.nixos.org/nixos/26.05/nixos-26.05.11045.774debe7a0d1/nixexprs.tar.xz?narHash=sha256-S5MjznoY0gbQbcANPLz5RYjg%2B5/WQmFRgNbHcP%2Bydcg%3D»/lib/customisation.nix:427:7:
          426|     // {
          427|       drvPath =
             |       ^
          428|         assert condition;

       … while calling the 'derivationStrict' builtin
         at «nix-internal»/derivation-internal.nix:37:12:
           36|
           37|   strict = derivationStrict drvAttrs;
             |            ^
           38|

       … while evaluating the option `driverConfiguration.vlans':

       … while evaluating definitions from `/nix/store/csk881ggvmifg4qf1cal0r1ffflbmlhp-source/nixos/lib/testing/driver-configuration.nix':

       … while evaluating the option `nodes.caddy.networking.interfaces':

       … while evaluating definitions from `/nix/store/csk881ggvmifg4qf1cal0r1ffflbmlhp-source/nixos/modules/hardware/facter/networking':

       … while evaluating the option `nodes.caddy.hardware.facter.enable':

       … while evaluating the option `nodes.caddy.hardware.facter.report':

       … while evaluating the option `nodes.caddy.hardware.facter.reportPath':

       … while evaluating definitions from `/nix/store/q2d97flnlrbg9yvr9n7mv6kwhdigv47w-source/nixosModules/clanCore/nixos-facter.nix':

       (stack trace truncated; use '--show-trace' to show the full, detailed trace)

       error: build of '/nix/store/jifhxdzffi03r9ax3ri3nqdg8rcg62ax-merged-test-dir-pki.drv^out' failed: error: gave up after 9 reschedules
failed eval checks.x86_64-linux.service-dummy-test —
error: … while evaluating the attribute 'drvPath' at «https://releases.nixos.org/nixos/26.05/nixos-26.05.11045.774debe7a0d1/nixexprs.tar.xz?narH …
error:
       … while evaluating the attribute 'drvPath'
         at «https://releases.nixos.org/nixos/26.05/nixos-26.05.11045.774debe7a0d1/nixexprs.tar.xz?narHash=sha256-S5MjznoY0gbQbcANPLz5RYjg%2B5/WQmFRgNbHcP%2Bydcg%3D»/lib/customisation.nix:427:7:
          426|     // {
          427|       drvPath =
             |       ^
          428|         assert condition;

       … while calling the 'derivationStrict' builtin
         at «nix-internal»/derivation-internal.nix:37:12:
           36|
           37|   strict = derivationStrict drvAttrs;
             |            ^
           38|

       … while evaluating the option `nodes.admin1.networking.interfaces':

       … while evaluating definitions from `/nix/store/csk881ggvmifg4qf1cal0r1ffflbmlhp-source/nixos/modules/hardware/facter/networking':

       … while evaluating the option `nodes.admin1.hardware.facter.enable':

       … while evaluating the option `nodes.admin1.hardware.facter.report':

       … while evaluating the option `nodes.admin1.hardware.facter.reportPath':

       … while evaluating definitions from `/nix/store/q2d97flnlrbg9yvr9n7mv6kwhdigv47w-source/nixosModules/clanCore/nixos-facter.nix':

       (stack trace truncated; use '--show-trace' to show the full, detailed trace)

       error: build of '/nix/store/93r99wqlyhxzhj15ga3hbs1inkv5rq1w-merged-test-dir-service-dummy-test.drv^out' failed: error: gave up after 9 reschedules
failed eval checks.x86_64-linux.service-dummy-test-from-flake —
error: … while evaluating the attribute 'drvPath' at «https://releases.nixos.org/nixos/26.05/nixos-26.05.11045.774debe7a0d1/nixexprs.tar.xz?narH …
error:
       … while evaluating the attribute 'drvPath'
         at «https://releases.nixos.org/nixos/26.05/nixos-26.05.11045.774debe7a0d1/nixexprs.tar.xz?narHash=sha256-S5MjznoY0gbQbcANPLz5RYjg%2B5/WQmFRgNbHcP%2Bydcg%3D»/lib/customisation.nix:427:7:
          426|     // {
          427|       drvPath =
             |       ^
          428|         assert condition;

       … while calling the 'derivationStrict' builtin
         at «nix-internal»/derivation-internal.nix:37:12:
           36|
           37|   strict = derivationStrict drvAttrs;
             |            ^
           38|

       … while evaluating the option `nodes.admin1.networking.interfaces':

       … while evaluating definitions from `/nix/store/csk881ggvmifg4qf1cal0r1ffflbmlhp-source/nixos/modules/hardware/facter/networking':

       … while evaluating the option `nodes.admin1.hardware.facter.enable':

       … while evaluating the option `nodes.admin1.hardware.facter.report':

       … while evaluating the option `nodes.admin1.hardware.facter.reportPath':

       … while evaluating definitions from `/nix/store/q2d97flnlrbg9yvr9n7mv6kwhdigv47w-source/nixosModules/clanCore/nixos-facter.nix':

       (stack trace truncated; use '--show-trace' to show the full, detailed trace)

       error: build of '/nix/store/qsfzrf8p2qb5lhr0nf2j11s5gyi38qbl-merged-test-dir-service-dummy-test-from-flake.drv^out' failed: error: gave up after 9 reschedules
failed eval checks.x86_64-linux.syncthing-service —
error: … while evaluating the attribute 'drvPath' at «https://releases.nixos.org/nixos/26.05/nixos-26.05.11045.774debe7a0d1/nixexprs.tar.xz?narH …
error:
       … while evaluating the attribute 'drvPath'
         at «https://releases.nixos.org/nixos/26.05/nixos-26.05.11045.774debe7a0d1/nixexprs.tar.xz?narHash=sha256-S5MjznoY0gbQbcANPLz5RYjg%2B5/WQmFRgNbHcP%2Bydcg%3D»/lib/customisation.nix:427:7:
          426|     // {
          427|       drvPath =
             |       ^
          428|         assert condition;

       … while calling the 'derivationStrict' builtin
         at «nix-internal»/derivation-internal.nix:37:12:
           36|
           37|   strict = derivationStrict drvAttrs;
             |            ^
           38|

       … while evaluating the option `nodes.machine1.networking.interfaces':

       … while evaluating definitions from `/nix/store/csk881ggvmifg4qf1cal0r1ffflbmlhp-source/nixos/modules/hardware/facter/networking':

       … while evaluating the option `nodes.machine1.hardware.facter.enable':

       … while evaluating the option `nodes.machine1.hardware.facter.report':

       … while evaluating the option `nodes.machine1.hardware.facter.reportPath':

       … while evaluating definitions from `/nix/store/q2d97flnlrbg9yvr9n7mv6kwhdigv47w-source/nixosModules/clanCore/nixos-facter.nix':

       (stack trace truncated; use '--show-trace' to show the full, detailed trace)

       error: build of '/nix/store/8ixbnwzwsadhimss7kqf9qm86dgjzchh-merged-test-dir-syncthing-service.drv^out' failed: error: gave up after 9 reschedules
failed eval checks.x86_64-linux.users —
error: … while evaluating the attribute 'drvPath' at «https://releases.nixos.org/nixos/26.05/nixos-26.05.11045.774debe7a0d1/nixexprs.tar.xz?narH …
error:
       … while evaluating the attribute 'drvPath'
         at «https://releases.nixos.org/nixos/26.05/nixos-26.05.11045.774debe7a0d1/nixexprs.tar.xz?narHash=sha256-S5MjznoY0gbQbcANPLz5RYjg%2B5/WQmFRgNbHcP%2Bydcg%3D»/lib/customisation.nix:427:7:
          426|     // {
          427|       drvPath =
             |       ^
          428|         assert condition;

       … while calling the 'derivationStrict' builtin
         at «nix-internal»/derivation-internal.nix:37:12:
           36|
           37|   strict = derivationStrict drvAttrs;
             |            ^
           38|

       … while evaluating the option `nodes.server.networking.interfaces':

       … while evaluating definitions from `/nix/store/csk881ggvmifg4qf1cal0r1ffflbmlhp-source/nixos/modules/hardware/facter/networking':

       … while evaluating the option `nodes.server.hardware.facter.enable':

       … while evaluating the option `nodes.server.hardware.facter.report':

       … while evaluating the option `nodes.server.hardware.facter.reportPath':

       … while evaluating definitions from `/nix/store/q2d97flnlrbg9yvr9n7mv6kwhdigv47w-source/nixosModules/clanCore/nixos-facter.nix':

       (stack trace truncated; use '--show-trace' to show the full, detailed trace)

       error: build of '/nix/store/rx39mmxfmdxw2hp0hy63igdj7q0j0mqw-merged-test-dir-users.drv^out' failed: error: gave up after 9 reschedules
failed eval checks.x86_64-linux.wireguard —
error: … while evaluating the attribute 'drvPath' at «https://releases.nixos.org/nixos/26.05/nixos-26.05.11045.774debe7a0d1/nixexprs.tar.xz?narH …
error:
       … while evaluating the attribute 'drvPath'
         at «https://releases.nixos.org/nixos/26.05/nixos-26.05.11045.774debe7a0d1/nixexprs.tar.xz?narHash=sha256-S5MjznoY0gbQbcANPLz5RYjg%2B5/WQmFRgNbHcP%2Bydcg%3D»/lib/customisation.nix:427:7:
          426|     // {
          427|       drvPath =
             |       ^
          428|         assert condition;

       … while calling the 'derivationStrict' builtin
         at «nix-internal»/derivation-internal.nix:37:12:
           36|
           37|   strict = derivationStrict drvAttrs;
             |            ^
           38|

       … while evaluating the option `nodes.controller1.networking.interfaces':

       … while evaluating definitions from `/nix/store/csk881ggvmifg4qf1cal0r1ffflbmlhp-source/nixos/modules/hardware/facter/networking':

       … while evaluating the option `nodes.controller1.hardware.facter.enable':

       … while evaluating the option `nodes.controller1.hardware.facter.report':

       … while evaluating the option `nodes.controller1.hardware.facter.reportPath':

       … while evaluating definitions from `/nix/store/q2d97flnlrbg9yvr9n7mv6kwhdigv47w-source/nixosModules/clanCore/nixos-facter.nix':

       (stack trace truncated; use '--show-trace' to show the full, detailed trace)

       error: build of '/nix/store/k99w3l2gf1wlzjh8lihbaw1rh078jaka-merged-test-dir-wireguard.drv^out' failed: error: gave up after 9 reschedules
failed eval checks.x86_64-linux.zerotier —
error: … while evaluating the attribute 'drvPath' at «https://releases.nixos.org/nixos/26.05/nixos-26.05.11045.774debe7a0d1/nixexprs.tar.xz?narH …
error:
       … while evaluating the attribute 'drvPath'
         at «https://releases.nixos.org/nixos/26.05/nixos-26.05.11045.774debe7a0d1/nixexprs.tar.xz?narHash=sha256-S5MjznoY0gbQbcANPLz5RYjg%2B5/WQmFRgNbHcP%2Bydcg%3D»/lib/customisation.nix:427:7:
          426|     // {
          427|       drvPath =
             |       ^
          428|         assert condition;

       … while calling the 'derivationStrict' builtin
         at «nix-internal»/derivation-internal.nix:37:12:
           36|
           37|   strict = derivationStrict drvAttrs;
             |            ^
           38|

       … while evaluating the option `driverConfiguration.vlans':

       … while evaluating definitions from `/nix/store/csk881ggvmifg4qf1cal0r1ffflbmlhp-source/nixos/lib/testing/driver-configuration.nix':

       … while evaluating the option `nodes.controller.networking.interfaces':

       … while evaluating definitions from `/nix/store/csk881ggvmifg4qf1cal0r1ffflbmlhp-source/nixos/modules/hardware/facter/networking':

       … while evaluating the option `nodes.controller.hardware.facter.enable':

       … while evaluating the option `nodes.controller.hardware.facter.report':

       … while evaluating the option `nodes.controller.hardware.facter.reportPath':

       … while evaluating definitions from `/nix/store/q2d97flnlrbg9yvr9n7mv6kwhdigv47w-source/nixosModules/clanCore/nixos-facter.nix':

       (stack trace truncated; use '--show-trace' to show the full, detailed trace)

       error: build of '/nix/store/plrafijfzclzss9dl00yfdm906l5p3xx-merged-test-dir-zerotier.drv^out' failed: error: gave up after 9 reschedules
failed eval checks.x86_64-linux.zerotier-multi-instance —
error: … while evaluating the attribute 'drvPath' at «https://releases.nixos.org/nixos/26.05/nixos-26.05.11045.774debe7a0d1/nixexprs.tar.xz?narH …
error:
       … while evaluating the attribute 'drvPath'
         at «https://releases.nixos.org/nixos/26.05/nixos-26.05.11045.774debe7a0d1/nixexprs.tar.xz?narHash=sha256-S5MjznoY0gbQbcANPLz5RYjg%2B5/WQmFRgNbHcP%2Bydcg%3D»/lib/customisation.nix:427:7:
          426|     // {
          427|       drvPath =
             |       ^
          428|         assert condition;

       … while calling the 'derivationStrict' builtin
         at «nix-internal»/derivation-internal.nix:37:12:
           36|
           37|   strict = derivationStrict drvAttrs;
             |            ^
           38|

       … while evaluating the option `driverConfiguration.vlans':

       … while evaluating definitions from `/nix/store/csk881ggvmifg4qf1cal0r1ffflbmlhp-source/nixos/lib/testing/driver-configuration.nix':

       … while evaluating the option `nodes.alpha.networking.interfaces':

       … while evaluating definitions from `/nix/store/csk881ggvmifg4qf1cal0r1ffflbmlhp-source/nixos/modules/hardware/facter/networking':

       … while evaluating the option `nodes.alpha.hardware.facter.enable':

       … while evaluating the option `nodes.alpha.hardware.facter.report':

       … while evaluating the option `nodes.alpha.hardware.facter.reportPath':

       … while evaluating definitions from `/nix/store/q2d97flnlrbg9yvr9n7mv6kwhdigv47w-source/nixosModules/clanCore/nixos-facter.nix':

       (stack trace truncated; use '--show-trace' to show the full, detailed trace)

       error: build of '/nix/store/gb0pvdh3p89c6fjyqzfav5y3w7dlns4m-merged-test-dir-zerotier-multi-instance.drv^out' failed: error: gave up after 9 reschedules
21 succeeded
succeeded attributes
status attribute duration
loading…
76 already built
skipped attributes
status attribute duration
loading…