nixbot

builds

clan/clan-core build #940 failed

branch main · PR #8211 · commit 2396a33541 · · took 12m 56s · eval 2m 55s

eval warnings 50 kinds · 275 occurrences
  • error …-merged-test-dir-admin.drv: error: gRPC AddMultipleToStore on 'nix-store.geninf.io:50051' failed: error: path '/nix/store/…-vm' is required, but there is no substituter that can build it ×1
  • error ×45
  • error build of '/nix/store/…-merged-test-dir-admin.drv^out' failed: error: error: gRPC AddMultipleToStore on 'nix-store.geninf.io:50051' failed: error: path '/nix/store/…-vm' is required, but there is no substituter that can build it ×1
  • error …-merged-test-dir-certificates.drv: error: gRPC AddMultipleToStore on 'nix-store.geninf.io:50051' failed: error: path '/nix/store/…-vm' is required, but there is no substituter that can build it ×1
  • error build of '/nix/store/…-merged-test-dir-certificates.drv^out' failed: error: error: gRPC AddMultipleToStore on 'nix-store.geninf.io:50051' failed: error: path '/nix/store/…-vm' is required, but there is no substituter that can build it ×1
  • error …-merged-test-dir-borgbackup.drv: error: gRPC AddMultipleToStore on 'nix-store.geninf.io:50051' failed: error: path '/nix/store/…-vm' is required, but there is no substituter that can build it ×1
  • error build of '/nix/store/…-merged-test-dir-borgbackup.drv^out' failed: error: error: gRPC AddMultipleToStore on 'nix-store.geninf.io:50051' failed: error: path '/nix/store/…-vm' is required, but there is no substituter that can build it ×1
  • error …-merged-test-dir-garage.drv: build01: build01: input not substitutable: error: path '/nix/store/…-test-vars-generated' is required, but there is no substituter that can build it, asking the scheduler again ×9
  • error …-merged-test-dir-dyndns.drv: error: gRPC AddMultipleToStore on 'nix-store.geninf.io:50051' failed: error: path '/nix/store/…-vm' is required, but there is no substituter that can build it ×2
  • error build of '/nix/store/…-merged-test-dir-dyndns.drv^out' failed: error: error: gRPC AddMultipleToStore on 'nix-store.geninf.io:50051' failed: error: path '/nix/store/…-vm' is required, but there is no substituter that can build it ×2
  • error …-merged-test-dir-hello-service.drv: build01: build01: input not substitutable: error: path '/nix/store/…-test-vars-generated' is required, but there is no substituter that can build it, asking the scheduler again ×9
  • error …-merged-test-dir-kde.drv: build01: build01: input not substitutable: error: path '/nix/store/…-test-vars-generated' is required, but there is no substituter that can build it, asking the scheduler again ×9
  • error …-merged-test-dir-mycelium.drv: build01: build01: input not substitutable: error: path '/nix/store/…-test-vars-generated' is required, but there is no substituter that can build it, asking the scheduler again ×9
  • error …-merged-test-dir-service-machine-id.drv: build01: build01: input not substitutable: error: path '/nix/store/…-test-vars-generated' is required, but there is no substituter that can build it, asking the scheduler again ×9
  • error …-merged-test-dir-matrix-synapse.drv: error: gRPC AddMultipleToStore on 'nix-store.geninf.io:50051' failed: error: path '/nix/store/…-vm' is required, but there is no substituter that can build it ×1
  • error build of '/nix/store/…-merged-test-dir-matrix-synapse.drv^out' failed: error: error: gRPC AddMultipleToStore on 'nix-store.geninf.io:50051' failed: error: path '/nix/store/…-vm' is required, but there is no substituter that can build it ×1
  • error …-merged-test-dir-localbackup.drv: build01: build01: input not substitutable: error: path '/nix/store/…-test-vars-generated' is required, but there is no substituter that can build it, asking the scheduler again ×9
  • error …-merged-test-dir-data-mesher.drv: build01: build01: input not substitutable: error: path '/nix/store/…-test-vars-generated' is required, but there is no substituter that can build it, asking the scheduler again ×9
  • error …-merged-test-dir-ncps.drv: build01: build01: input not substitutable: error: path '/nix/store/…-test-vars-generated' is required, but there is no substituter that can build it, asking the scheduler again ×9
  • error …-merged-test-dir-nixos-test-password-store-mounts.drv: error: gRPC AddMultipleToStore on 'nix-store.geninf.io:50051' failed: error: path '/nix/store/…-tests' is required, but there is no substituter that can build it ×1
  • error build of '/nix/store/…-merged-test-dir-nixos-test-password-store-mounts.drv^out' failed: error: error: gRPC AddMultipleToStore on 'nix-store.geninf.io:50051' failed: error: path '/nix/store/…-tests' is required, but there is no substituter that can build it ×1
  • error …-merged-test-dir-monitoring.drv: build01: build01: input not substitutable: error: path '/nix/store/…-test-vars-generated' is required, but there is no substituter that can build it, asking the scheduler again ×9
  • error …-merged-test-dir-dm-dns.drv: build01: build01: input not substitutable: error: path '/nix/store/…-test-vars-generated' is required, but there is no substituter that can build it, asking the scheduler again ×9
  • error …-merged-test-dir-clan-test-p2p-ssh-iroh.drv: error: gRPC AddMultipleToStore on 'nix-store.geninf.io:50051' failed: error: path '/nix/store/…-vm' is required, but there is no substituter that can build it ×1
  • error build of '/nix/store/…-merged-test-dir-clan-test-p2p-ssh-iroh.drv^out' failed: error: error: gRPC AddMultipleToStore on 'nix-store.geninf.io:50051' failed: error: path '/nix/store/…-vm' is required, but there is no substituter that can build it ×1
  • error …-merged-test-dir-packages.drv: error: gRPC AddMultipleToStore on 'nix-store.geninf.io:50051' failed: error: path '/nix/store/…-vm' is required, but there is no substituter that can build it ×1
  • error build of '/nix/store/…-merged-test-dir-packages.drv^out' failed: error: error: gRPC AddMultipleToStore on 'nix-store.geninf.io:50051' failed: error: path '/nix/store/…-vm' is required, but there is no substituter that can build it ×1
  • error …-merged-test-dir-pki.drv: build01: build01: input not substitutable: error: path '/nix/store/…-test-vars-generated' is required, but there is no substituter that can build it, asking the scheduler again ×9
  • error …-merged-test-dir-service-postgresql.drv: build01: build01: input not substitutable: error: path '/nix/store/…-test-vars-generated' is required, but there is no substituter that can build it, asking the scheduler again ×9
  • error …-merged-test-dir-service-state-version.drv: build01: build01: input not substitutable: error: path '/nix/store/…-test-vars-generated' is required, but there is no substituter that can build it, asking the scheduler again ×9
  • error …-merged-test-dir-service-dummy-test-from-flake.drv: build01: build01: input not substitutable: error: path '/nix/store/…-test-vars-generated' is required, but there is no substituter that can build it, asking the scheduler again ×9
  • error build of '/nix/store/…-merged-test-dir-garage.drv^out' failed: error: gave up after 9 reschedules ×2
  • error …-merged-test-dir-service-dummy-test.drv: build01: build01: input not substitutable: error: path '/nix/store/…-test-vars-generated' is required, but there is no substituter that can build it, asking the scheduler again ×9
  • error …-merged-test-dir-syncthing-service.drv: build01: build01: input not substitutable: error: path '/nix/store/…-test-vars-generated' is required, but there is no substituter that can build it, asking the scheduler again ×9
  • error …-merged-test-dir-trusted-nix-caches.drv: error: gRPC AddMultipleToStore on 'nix-store.geninf.io:50051' failed: error: path '/nix/store/…-vm' is required, but there is no substituter that can build it ×1
  • error build of '/nix/store/…-merged-test-dir-trusted-nix-caches.drv^out' failed: error: error: gRPC AddMultipleToStore on 'nix-store.geninf.io:50051' failed: error: path '/nix/store/…-vm' is required, but there is no substituter that can build it ×1
  • error …-merged-test-dir-sshd.drv: build01: build01: input not substitutable: error: path '/nix/store/…-test-vars-generated' is required, but there is no substituter that can build it, asking the scheduler again ×18
  • error …-merged-test-dir-users.drv: build01: build01: input not substitutable: error: path '/nix/store/…-test-vars-generated' is required, but there is no substituter that can build it, asking the scheduler again ×9
  • error build of '/nix/store/…-merged-test-dir-kde.drv^out' failed: error: gave up after 9 reschedules ×1
  • error …-merged-test-dir-wifi.drv: build01: build01: input not substitutable: error: path '/nix/store/…-test-vars-generated' is required, but there is no substituter that can build it, asking the scheduler again ×9
  • error build of '/nix/store/…-merged-test-dir-mycelium.drv^out' failed: error: gave up after 9 reschedules ×1
  • error build of '/nix/store/…-merged-test-dir-hello-service.drv^out' failed: error: gave up after 9 reschedules ×1
  • error build of '/nix/store/…-merged-test-dir-service-machine-id.drv^out' failed: error: gave up after 9 reschedules ×1
  • error …-merged-test-dir-admin.drv: gi-build-x86-02: gi-build-x86-02: input not substitutable: error: path '/nix/store/…-test-vars-generated' is required, but there is no substituter that can build it, asking the scheduler again ×9
  • error build of '/nix/store/…-merged-test-dir-admin.drv^out' failed: error: gave up after 9 reschedules ×1
  • error …-merged-test-dir-yggdrasil.drv: error: gRPC AddMultipleToStore on 'nix-store.geninf.io:50051' failed: error: path '/nix/store/…-vm' is required, but there is no substituter that can build it ×1
  • error build of '/nix/store/…-merged-test-dir-yggdrasil.drv^out' failed: error: error: gRPC AddMultipleToStore on 'nix-store.geninf.io:50051' failed: error: path '/nix/store/…-vm' is required, but there is no substituter that can build it ×1
  • error build of '/nix/store/…-merged-test-dir-data-mesher.drv^out' failed: error: gave up after 9 reschedules ×1
  • error …-merged-test-dir-borgbackup.drv: gi-build-x86-02: gi-build-x86-02: input not substitutable: error: path '/nix/store/…-test-vars-generated' is required, but there is no substituter that can build it, asking the scheduler again ×9
  • warn stdenv.isDarwin is deprecated, use stdenv.hostPlatform.isDarwin instead ×2

60 failed ⚠ 1
failed attributes
status attribute duration
failed checks.aarch64-linux.all-packages
  • stdenv.isDarwin is deprecated, use stdenv.hostPlatform.isDarwin instead
1m 3s
setup: 88fkisqhznlaz01pp5mpy7gds5a9pqb6-rendered.drv: build01: build01: input not substitutable: error: path '/nix/store/27nnni81a1gq0196hfp7iww5rkdlwgbf-option …
setup:
88fkisqhznlaz01pp5mpy7gds5a9pqb6-rendered.drv: build01: build01: input not substitutable: error: path '/nix/store/27nnni81a1gq0196hfp7iww5rkdlwgbf-options.json' is required, but there is no substituter that can build it, asking the scheduler again
88fkisqhznlaz01pp5mpy7gds5a9pqb6-rendered.drv: build01: build01: input not substitutable: error: path '/nix/store/27nnni81a1gq0196hfp7iww5rkdlwgbf-options.json' is required, but there is no substituter that can build it, asking the scheduler again
88fkisqhznlaz01pp5mpy7gds5a9pqb6-rendered.drv: build01: build01: input not substitutable: error: path '/nix/store/27nnni81a1gq0196hfp7iww5rkdlwgbf-options.json' is required, but there is no substituter that can build it, asking the scheduler again
88fkisqhznlaz01pp5mpy7gds5a9pqb6-rendered.drv: build01: build01: input not substitutable: error: path '/nix/store/27nnni81a1gq0196hfp7iww5rkdlwgbf-options.json' is required, but there is no substituter that can build it, asking the scheduler again
88fkisqhznlaz01pp5mpy7gds5a9pqb6-rendered.drv: build01: build01: input not substitutable: error: path '/nix/store/27nnni81a1gq0196hfp7iww5rkdlwgbf-options.json' is required, but there is no substituter that can build it, asking the scheduler again
88fkisqhznlaz01pp5mpy7gds5a9pqb6-rendered.drv: build01: build01: input not substitutable: error: path '/nix/store/27nnni81a1gq0196hfp7iww5rkdlwgbf-options.json' is required, but there is no substituter that can build it, asking the scheduler again
88fkisqhznlaz01pp5mpy7gds5a9pqb6-rendered.drv: build01: build01: input not substitutable: error: path '/nix/store/27nnni81a1gq0196hfp7iww5rkdlwgbf-options.json' is required, but there is no substituter that can build it, asking the scheduler again
error: dependency '88fkisqhznlaz01pp5mpy7gds5a9pqb6-rendered.drv' failed
failed checks.aarch64-darwin.all-packages 2m 1s
setup: warning: ignoring the client-specified setting 'store', because it is a restricted setting and you are not a trusted user warning: 43gdbyqnjacqlja1lz194m …
setup:
warning: ignoring the client-specified setting 'store', because it is a restricted setting and you are not a trusted user
warning: 43gdbyqnjacqlja1lz194mb8qzfsm8r5-clan-core-flake.drv: no connected, non-draining worker for system 'aarch64-darwin' offers features {}, the workers offer {}, waiting up to 120s for a worker
warning: aqvlzq2fhkgvxn6hjxvdav43yf4af9fm-clan-cli-source.drv: no connected, non-draining worker for system 'aarch64-darwin' offers features {}, the workers offer {}, waiting up to 120s for a worker
warning: mbdfrrsfdg7f847bc6pz0zl6793k2rv0-clan-cli-source.drv: no connected, non-draining worker for system 'aarch64-darwin' offers features {}, the workers offer {}, waiting up to 120s for a worker
43gdbyqnjacqlja1lz194mb8qzfsm8r5-clan-core-flake.drv: no connected, non-draining worker for system 'aarch64-darwin' offers features {}, the workers offer {}
aqvlzq2fhkgvxn6hjxvdav43yf4af9fm-clan-cli-source.drv: no connected, non-draining worker for system 'aarch64-darwin' offers features {}, the workers offer {}
mbdfrrsfdg7f847bc6pz0zl6793k2rv0-clan-cli-source.drv: no connected, non-draining worker for system 'aarch64-darwin' offers features {}, the workers offer {}
error: dependency '43gdbyqnjacqlja1lz194mb8qzfsm8r5-clan-core-flake.drv' failed
failed checks.aarch64-darwin.clan-pytest-with-core 2m 1s
setup: don't know how to build these paths: /nix/store/yw2k640am5pydzv8x48aafv97h68wrx4-clan-pytest-with-core.drv warning: ignoring the client-specified setti …
setup:
don't know how to build these paths:
  /nix/store/yw2k640am5pydzv8x48aafv97h68wrx4-clan-pytest-with-core.drv
warning: ignoring the client-specified setting 'store', because it is a restricted setting and you are not a trusted user
warning: k8p6w697qmmv9jh65vv1l8cg050d7460-clan-core-flake.drv: no connected, non-draining worker for system 'aarch64-darwin' offers features {}, the workers offer {}, waiting up to 120s for a worker
warning: yx4whyizihyngc86hlcmvlkipzfi40pz-clan-cli-source.drv: no connected, non-draining worker for system 'aarch64-darwin' offers features {}, the workers offer {}, waiting up to 120s for a worker
k8p6w697qmmv9jh65vv1l8cg050d7460-clan-core-flake.drv: no connected, non-draining worker for system 'aarch64-darwin' offers features {}, the workers offer {}
yx4whyizihyngc86hlcmvlkipzfi40pz-clan-cli-source.drv: no connected, non-draining worker for system 'aarch64-darwin' offers features {}, the workers offer {}
error: dependency 'k8p6w697qmmv9jh65vv1l8cg050d7460-clan-core-flake.drv' failed
failed checks.aarch64-darwin.clan-pytest-without-core 2m 1s
setup: don't know how to build these paths: /nix/store/rd1pnzk7n7xclh37ykasnw32b6i1pgna-clan-pytest-without-core.drv warning: ignoring the client-specified se …
setup:
don't know how to build these paths:
  /nix/store/rd1pnzk7n7xclh37ykasnw32b6i1pgna-clan-pytest-without-core.drv
warning: ignoring the client-specified setting 'store', because it is a restricted setting and you are not a trusted user
warning: yx4whyizihyngc86hlcmvlkipzfi40pz-clan-cli-source.drv: no connected, non-draining worker for system 'aarch64-darwin' offers features {}, the workers offer {}, waiting up to 120s for a worker
yx4whyizihyngc86hlcmvlkipzfi40pz-clan-cli-source.drv: no connected, non-draining worker for system 'aarch64-darwin' offers features {}, the workers offer {}
error: dependency 'yx4whyizihyngc86hlcmvlkipzfi40pz-clan-cli-source.drv' failed
failed checks.aarch64-darwin.devshell 2m 4s
setup: don't know how to build these paths: /nix/store/lci6nsgbsinhg0cv3qiysn9wczy7hb0y-check-devshell-not-depends-on-clan-cli.drv warning: ignoring the clien …
setup:
don't know how to build these paths:
  /nix/store/lci6nsgbsinhg0cv3qiysn9wczy7hb0y-check-devshell-not-depends-on-clan-cli.drv
warning: ignoring the client-specified setting 'store', because it is a restricted setting and you are not a trusted user
warning: aqvlzq2fhkgvxn6hjxvdav43yf4af9fm-clan-cli-source.drv: no connected, non-draining worker for system 'aarch64-darwin' offers features {}, the workers offer {}, waiting up to 120s for a worker
aqvlzq2fhkgvxn6hjxvdav43yf4af9fm-clan-cli-source.drv: no connected, non-draining worker for system 'aarch64-darwin' offers features {}, the workers offer {}
error: dependency 'z3333kwwhw5vin3hrhnv9myiaqbjxcp1-clan-cli.drv' failed
failed checks.aarch64-darwin.devShell-clan-site 2m 2s
setup: don't know how to build these paths: /nix/store/skgjkb46kr2qn1s824vfnspx378dv34x-nix-shell.drv warning: ignoring the client-specified setting 'store', …
setup:
don't know how to build these paths:
  /nix/store/skgjkb46kr2qn1s824vfnspx378dv34x-nix-shell.drv
warning: ignoring the client-specified setting 'store', because it is a restricted setting and you are not a trusted user
warning: aqvlzq2fhkgvxn6hjxvdav43yf4af9fm-clan-cli-source.drv: no connected, non-draining worker for system 'aarch64-darwin' offers features {}, the workers offer {}, waiting up to 120s for a worker
aqvlzq2fhkgvxn6hjxvdav43yf4af9fm-clan-cli-source.drv: no connected, non-draining worker for system 'aarch64-darwin' offers features {}, the workers offer {}
error: dependency '99s3kch7k7k419wdihck056kxqzlpbpp-generated-docs.drv' failed
failed checks.aarch64-darwin.eval-tests 2m 0s
setup: md6g9sn3p73hm9cjczn2zzn95swkn6a8-evalCheck-eval-tests-syncthing.drv: no connected, non-draining worker for system 'aarch64-darwin' offers features {}, th …
setup:
md6g9sn3p73hm9cjczn2zzn95swkn6a8-evalCheck-eval-tests-syncthing.drv: no connected, non-draining worker for system 'aarch64-darwin' offers features {}, the workers offer {}
p8jql4biv8mfzd7vflnq9i7lq4c4fgdr-evalCheck-eval-module-clan-vars.drv: no connected, non-draining worker for system 'aarch64-darwin' offers features {}, the workers offer {}
riipf3i98jzvwxipr9276p9yhaf0ng4k-evalCheck-eval-tests-zerotier.drv: no connected, non-draining worker for system 'aarch64-darwin' offers features {}, the workers offer {}
s056dvib3znfwd38l4izpfxb4fp542jl-evalCheck-eval-tests-installer.drv: no connected, non-draining worker for system 'aarch64-darwin' offers features {}, the workers offer {}
w7av8xmpmzk7v8cqb45g44w5798yb3y6-evalCheck-eval-lib-resolve-module.drv: no connected, non-draining worker for system 'aarch64-darwin' offers features {}, the workers offer {}
y3ngasrn832a6s00w5cg6kkm1jmxcm60-evalCheck-eval-lib-exports.drv: no connected, non-draining worker for system 'aarch64-darwin' offers features {}, the workers offer {}
ysfpasjig7ni6ag030f4zwdrglb2frcz-evalCheck-lib-jsonschema-unit-tests.drv: no connected, non-draining worker for system 'aarch64-darwin' offers features {}, the workers offer {}
error: dependency '2nhk4ml14m6dxij4l7rag5qpkc5463gs-evalCheck-eval-tests-types.drv' failed
failed checks.aarch64-darwin.treefmt 2m 1s
setup: don't know how to build these paths: /nix/store/xzamcyrcq1bc8myn1ziivc4fssb9cbv6-treefmt-check.drv warning: ignoring the client-specified setting 'stor …
setup:
don't know how to build these paths:
  /nix/store/xzamcyrcq1bc8myn1ziivc4fssb9cbv6-treefmt-check.drv
warning: ignoring the client-specified setting 'store', because it is a restricted setting and you are not a trusted user
warning: xzamcyrcq1bc8myn1ziivc4fssb9cbv6-treefmt-check.drv: no connected, non-draining worker for system 'aarch64-darwin' offers features {}, the workers offer {}, waiting up to 120s for a worker
xzamcyrcq1bc8myn1ziivc4fssb9cbv6-treefmt-check.drv: no connected, non-draining worker for system 'aarch64-darwin' offers features {}, the workers offer {}
error: no connected, non-draining worker for system 'aarch64-darwin' offers features {}, the workers offer {}
failed eval checks.aarch64-linux.admin —
error: … while evaluating the attribute 'drvPath' at «https://releases.nixos.org/nixpkgs/nixpkgs-26.11pre1085827.aa48d3470809/nixexprs.tar.xz?na …
error:
       … while evaluating the attribute 'drvPath'
         at «https://releases.nixos.org/nixpkgs/nixpkgs-26.11pre1085827.aa48d3470809/nixexprs.tar.xz?narHash=sha256-R4B%2BRRYmze9htmPZ8xeF19mchTSH99GdaqanKCW8CF8%3D»/lib/customisation.nix:416:11:
          415|         // {
          416|           drvPath =
             |           ^
          417|             assert condition;

       … while calling the 'derivationStrict' builtin
         at «nix-internal»/derivation-internal.nix:37:12:
           36|
           37|   strict = derivationStrict drvAttrs;
             |            ^
           38|

       … while evaluating the option `driverConfiguration.vlans':

       … while evaluating definitions from `/nix/store/vlhb7haagkjabf20g1vg9kxi53fcpi17-source/nixos/lib/testing/driver-configuration.nix':

       … while evaluating the option `containers.client.networking.interfaces':

       … while evaluating definitions from `/nix/store/vlhb7haagkjabf20g1vg9kxi53fcpi17-source/nixos/modules/hardware/facter/networking':

       … while evaluating the option `containers.client.hardware.facter.enable':

       … while evaluating the option `containers.client.hardware.facter.report':

       … while evaluating the option `containers.client.hardware.facter.reportPath':

       … while evaluating definitions from `/nix/store/prsp9i0g7kp2acraws2bg3yk57ad0nxm-source/nixosModules/clanCore/nixos-facter.nix':

       (stack trace truncated; use '--show-trace' to show the full, detailed trace)

       error: build of '/nix/store/nzljmbmyjqam1ricrqlv38l0a7w6vr4z-merged-test-dir-admin.drv^out' failed: error: error: gRPC AddMultipleToStore on 'nix-store.geninf.io:50051' failed: error: path '/nix/store/s9qqxx58i9jh6ra183v64sw77p38mxi2-vm' is required, but there is no substituter that can build it
failed eval checks.aarch64-linux.borgbackup —
error: … while evaluating the attribute 'drvPath' at «https://releases.nixos.org/nixpkgs/nixpkgs-26.11pre1085827.aa48d3470809/nixexprs.tar.xz?na …
error:
       … while evaluating the attribute 'drvPath'
         at «https://releases.nixos.org/nixpkgs/nixpkgs-26.11pre1085827.aa48d3470809/nixexprs.tar.xz?narHash=sha256-R4B%2BRRYmze9htmPZ8xeF19mchTSH99GdaqanKCW8CF8%3D»/lib/customisation.nix:416:11:
          415|         // {
          416|           drvPath =
             |           ^
          417|             assert condition;

       … while calling the 'derivationStrict' builtin
         at «nix-internal»/derivation-internal.nix:37:12:
           36|
           37|   strict = derivationStrict drvAttrs;
             |            ^
           38|

       … while evaluating the option `driverConfiguration.vlans':

       … while evaluating definitions from `/nix/store/vlhb7haagkjabf20g1vg9kxi53fcpi17-source/nixos/lib/testing/driver-configuration.nix':

       … while evaluating the option `containers.clientone.networking.interfaces':

       … while evaluating definitions from `/nix/store/vlhb7haagkjabf20g1vg9kxi53fcpi17-source/nixos/modules/hardware/facter/networking':

       … while evaluating the option `containers.clientone.hardware.facter.enable':

       … while evaluating the option `containers.clientone.hardware.facter.report':

       … while evaluating the option `containers.clientone.hardware.facter.reportPath':

       … while evaluating definitions from `/nix/store/prsp9i0g7kp2acraws2bg3yk57ad0nxm-source/nixosModules/clanCore/nixos-facter.nix':

       (stack trace truncated; use '--show-trace' to show the full, detailed trace)

       error: build of '/nix/store/yzllyxpx7yx5charhhknhx1h80dgzrks-merged-test-dir-borgbackup.drv^out' failed: error: error: gRPC AddMultipleToStore on 'nix-store.geninf.io:50051' failed: error: path '/nix/store/27bgq7s02xlmgsgxr79xbgx9wdxw7f91-vm' is required, but there is no substituter that can build it
failed eval checks.aarch64-linux.certificates —
error: … while evaluating the attribute 'drvPath' at «https://releases.nixos.org/nixpkgs/nixpkgs-26.11pre1085827.aa48d3470809/nixexprs.tar.xz?na …
error:
       … while evaluating the attribute 'drvPath'
         at «https://releases.nixos.org/nixpkgs/nixpkgs-26.11pre1085827.aa48d3470809/nixexprs.tar.xz?narHash=sha256-R4B%2BRRYmze9htmPZ8xeF19mchTSH99GdaqanKCW8CF8%3D»/lib/customisation.nix:416:11:
          415|         // {
          416|           drvPath =
             |           ^
          417|             assert condition;

       … while calling the 'derivationStrict' builtin
         at «nix-internal»/derivation-internal.nix:37:12:
           36|
           37|   strict = derivationStrict drvAttrs;
             |            ^
           38|

       … while evaluating the option `driverConfiguration.vlans':

       … while evaluating definitions from `/nix/store/vlhb7haagkjabf20g1vg9kxi53fcpi17-source/nixos/lib/testing/driver-configuration.nix':

       … while evaluating the option `containers.ca.networking.interfaces':

       … while evaluating definitions from `/nix/store/vlhb7haagkjabf20g1vg9kxi53fcpi17-source/nixos/modules/hardware/facter/networking':

       … while evaluating the option `containers.ca.hardware.facter.enable':

       … while evaluating the option `containers.ca.hardware.facter.report':

       … while evaluating the option `containers.ca.hardware.facter.reportPath':

       … while evaluating definitions from `/nix/store/prsp9i0g7kp2acraws2bg3yk57ad0nxm-source/nixosModules/clanCore/nixos-facter.nix':

       (stack trace truncated; use '--show-trace' to show the full, detailed trace)

       error: build of '/nix/store/4cjqx89wv5gl1n537rqbfylvxh7brw05-merged-test-dir-certificates.drv^out' failed: error: error: gRPC AddMultipleToStore on 'nix-store.geninf.io:50051' failed: error: path '/nix/store/q16hqpqkcvd6dc41pysvnaawxnabwr62-vm' is required, but there is no substituter that can build it
failed checks.aarch64-linux.clan-pytest-with-core 58s
setup: dxijd080q87w4fn0433hd9m0hnpd0hgq-clan-pytest-with-core.drv: build01: build01: input not substitutable: error: path '/nix/store/n454j5iffrixcgwk5fq5rgg31k …
setup:
dxijd080q87w4fn0433hd9m0hnpd0hgq-clan-pytest-with-core.drv: build01: build01: input not substitutable: error: path '/nix/store/n454j5iffrixcgwk5fq5rgg31k57qd1y-closure-info' is required, but there is no substituter that can build it, asking the scheduler again
dxijd080q87w4fn0433hd9m0hnpd0hgq-clan-pytest-with-core.drv: build01: build01: input not substitutable: error: path '/nix/store/n454j5iffrixcgwk5fq5rgg31k57qd1y-closure-info' is required, but there is no substituter that can build it, asking the scheduler again
dxijd080q87w4fn0433hd9m0hnpd0hgq-clan-pytest-with-core.drv: build01: build01: input not substitutable: error: path '/nix/store/n454j5iffrixcgwk5fq5rgg31k57qd1y-closure-info' is required, but there is no substituter that can build it, asking the scheduler again
dxijd080q87w4fn0433hd9m0hnpd0hgq-clan-pytest-with-core.drv: build01: build01: input not substitutable: error: path '/nix/store/n454j5iffrixcgwk5fq5rgg31k57qd1y-closure-info' is required, but there is no substituter that can build it, asking the scheduler again
dxijd080q87w4fn0433hd9m0hnpd0hgq-clan-pytest-with-core.drv: build01: build01: input not substitutable: error: path '/nix/store/n454j5iffrixcgwk5fq5rgg31k57qd1y-closure-info' is required, but there is no substituter that can build it, asking the scheduler again
dxijd080q87w4fn0433hd9m0hnpd0hgq-clan-pytest-with-core.drv: build01: build01: input not substitutable: error: path '/nix/store/n454j5iffrixcgwk5fq5rgg31k57qd1y-closure-info' is required, but there is no substituter that can build it, asking the scheduler again
dxijd080q87w4fn0433hd9m0hnpd0hgq-clan-pytest-with-core.drv: build01: build01: input not substitutable: error: path '/nix/store/n454j5iffrixcgwk5fq5rgg31k57qd1y-closure-info' is required, but there is no substituter that can build it, asking the scheduler again
error: gave up after 9 reschedules
failed checks.aarch64-linux.clan-pytest-without-core 56s
setup: ria6a1irj6z9klysbq1asc4ywi11vnj0-clan-pytest-without-core.drv: build01: build01: input not substitutable: error: path '/nix/store/0grq6h9d959ixzccxafhsdw …
setup:
ria6a1irj6z9klysbq1asc4ywi11vnj0-clan-pytest-without-core.drv: build01: build01: input not substitutable: error: path '/nix/store/0grq6h9d959ixzccxafhsdwzkpw4327j-closure-info' is required, but there is no substituter that can build it, asking the scheduler again
ria6a1irj6z9klysbq1asc4ywi11vnj0-clan-pytest-without-core.drv: build01: build01: input not substitutable: error: path '/nix/store/0grq6h9d959ixzccxafhsdwzkpw4327j-closure-info' is required, but there is no substituter that can build it, asking the scheduler again
ria6a1irj6z9klysbq1asc4ywi11vnj0-clan-pytest-without-core.drv: build01: build01: input not substitutable: error: path '/nix/store/0grq6h9d959ixzccxafhsdwzkpw4327j-closure-info' is required, but there is no substituter that can build it, asking the scheduler again
ria6a1irj6z9klysbq1asc4ywi11vnj0-clan-pytest-without-core.drv: build01: build01: input not substitutable: error: path '/nix/store/0grq6h9d959ixzccxafhsdwzkpw4327j-closure-info' is required, but there is no substituter that can build it, asking the scheduler again
ria6a1irj6z9klysbq1asc4ywi11vnj0-clan-pytest-without-core.drv: build01: build01: input not substitutable: error: path '/nix/store/0grq6h9d959ixzccxafhsdwzkpw4327j-closure-info' is required, but there is no substituter that can build it, asking the scheduler again
ria6a1irj6z9klysbq1asc4ywi11vnj0-clan-pytest-without-core.drv: build01: build01: input not substitutable: error: path '/nix/store/0grq6h9d959ixzccxafhsdwzkpw4327j-closure-info' is required, but there is no substituter that can build it, asking the scheduler again
ria6a1irj6z9klysbq1asc4ywi11vnj0-clan-pytest-without-core.drv: build01: build01: input not substitutable: error: path '/nix/store/0grq6h9d959ixzccxafhsdwzkpw4327j-closure-info' is required, but there is no substituter that can build it, asking the scheduler again
error: gave up after 9 reschedules
failed checks.aarch64-linux.clan-site-lint 1m 1s
setup: 88fkisqhznlaz01pp5mpy7gds5a9pqb6-rendered.drv: build01: the build this call attached to did not finish, retry, asking the scheduler again 88fkisqhznlaz01 …
setup:
88fkisqhznlaz01pp5mpy7gds5a9pqb6-rendered.drv: build01: the build this call attached to did not finish, retry, asking the scheduler again
88fkisqhznlaz01pp5mpy7gds5a9pqb6-rendered.drv: build01: the build this call attached to did not finish, retry, asking the scheduler again
88fkisqhznlaz01pp5mpy7gds5a9pqb6-rendered.drv: build01: build01: input not substitutable: error: path '/nix/store/27nnni81a1gq0196hfp7iww5rkdlwgbf-options.json' is required, but there is no substituter that can build it, asking the scheduler again
88fkisqhznlaz01pp5mpy7gds5a9pqb6-rendered.drv: build01: the build this call attached to did not finish, retry, asking the scheduler again
88fkisqhznlaz01pp5mpy7gds5a9pqb6-rendered.drv: build01: the build this call attached to did not finish, retry, asking the scheduler again
88fkisqhznlaz01pp5mpy7gds5a9pqb6-rendered.drv: build01: the build this call attached to did not finish, retry, asking the scheduler again
88fkisqhznlaz01pp5mpy7gds5a9pqb6-rendered.drv: build01: build01: input not substitutable: error: path '/nix/store/27nnni81a1gq0196hfp7iww5rkdlwgbf-options.json' is required, but there is no substituter that can build it, asking the scheduler again
error: dependency 'y2f7y74zvrkwqnwxm26ikdhrlzpyknqq-generated-docs.drv' failed
failed checks.aarch64-linux.clan-test-iso 1m 9s
setup: 10a4ngrhvnrik9jk1p5jm8bli8f0qyh9-closure-info.drv: build01: build01: input not substitutable: error: path '/nix/store/0gg721x93sid7nlrgkp2ji8z5hvzxljs-un …
setup:
10a4ngrhvnrik9jk1p5jm8bli8f0qyh9-closure-info.drv: build01: build01: input not substitutable: error: path '/nix/store/0gg721x93sid7nlrgkp2ji8z5hvzxljs-unit-generate-shutdown-ramfs.service' is required, but there is no substituter that can build it, asking the scheduler again
10a4ngrhvnrik9jk1p5jm8bli8f0qyh9-closure-info.drv: build01: build01: input not substitutable: error: path '/nix/store/0gg721x93sid7nlrgkp2ji8z5hvzxljs-unit-generate-shutdown-ramfs.service' is required, but there is no substituter that can build it, asking the scheduler again
10a4ngrhvnrik9jk1p5jm8bli8f0qyh9-closure-info.drv: build01: build01: input not substitutable: error: path '/nix/store/0gg721x93sid7nlrgkp2ji8z5hvzxljs-unit-generate-shutdown-ramfs.service' is required, but there is no substituter that can build it, asking the scheduler again
10a4ngrhvnrik9jk1p5jm8bli8f0qyh9-closure-info.drv: build01: build01: input not substitutable: error: path '/nix/store/0gg721x93sid7nlrgkp2ji8z5hvzxljs-unit-generate-shutdown-ramfs.service' is required, but there is no substituter that can build it, asking the scheduler again
10a4ngrhvnrik9jk1p5jm8bli8f0qyh9-closure-info.drv: build01: build01: input not substitutable: error: path '/nix/store/0gg721x93sid7nlrgkp2ji8z5hvzxljs-unit-generate-shutdown-ramfs.service' is required, but there is no substituter that can build it, asking the scheduler again
10a4ngrhvnrik9jk1p5jm8bli8f0qyh9-closure-info.drv: build01: build01: input not substitutable: error: path '/nix/store/0gg721x93sid7nlrgkp2ji8z5hvzxljs-unit-generate-shutdown-ramfs.service' is required, but there is no substituter that can build it, asking the scheduler again
10a4ngrhvnrik9jk1p5jm8bli8f0qyh9-closure-info.drv: build01: build01: input not substitutable: error: path '/nix/store/0gg721x93sid7nlrgkp2ji8z5hvzxljs-unit-generate-shutdown-ramfs.service' is required, but there is no substituter that can build it, asking the scheduler again
error: dependency 'wmkssardbrpvn953lzar2rl7jcadyjv9-nixos-test-driver-clan-test-iso.drv' failed
failed eval checks.aarch64-linux.data-mesher —
error: … while evaluating the attribute 'drvPath' at «https://releases.nixos.org/nixpkgs/nixpkgs-26.11pre1085827.aa48d3470809/nixexprs.tar.xz?na …
error:
       … while evaluating the attribute 'drvPath'
         at «https://releases.nixos.org/nixpkgs/nixpkgs-26.11pre1085827.aa48d3470809/nixexprs.tar.xz?narHash=sha256-R4B%2BRRYmze9htmPZ8xeF19mchTSH99GdaqanKCW8CF8%3D»/lib/customisation.nix:416:11:
          415|         // {
          416|           drvPath =
             |           ^
          417|             assert condition;

       … while calling the 'derivationStrict' builtin
         at «nix-internal»/derivation-internal.nix:37:12:
           36|
           37|   strict = derivationStrict drvAttrs;
             |            ^
           38|

       … while evaluating the option `driverConfiguration.vlans':

       … while evaluating definitions from `/nix/store/vlhb7haagkjabf20g1vg9kxi53fcpi17-source/nixos/lib/testing/driver-configuration.nix':

       … while evaluating the option `containers.alpha.networking.interfaces':

       … while evaluating definitions from `/nix/store/vlhb7haagkjabf20g1vg9kxi53fcpi17-source/nixos/modules/hardware/facter/networking':

       … while evaluating the option `containers.alpha.hardware.facter.enable':

       … while evaluating the option `containers.alpha.hardware.facter.report':

       … while evaluating the option `containers.alpha.hardware.facter.reportPath':

       … while evaluating definitions from `/nix/store/prsp9i0g7kp2acraws2bg3yk57ad0nxm-source/nixosModules/clanCore/nixos-facter.nix':

       (stack trace truncated; use '--show-trace' to show the full, detailed trace)

       error: build of '/nix/store/vix2rxv6qbhxbzhdcraiaik9j9fk50bj-merged-test-dir-data-mesher.drv^out' failed: error: gave up after 9 reschedules
failed checks.aarch64-linux.devShell-clan-site 1m 1s
setup: 88fkisqhznlaz01pp5mpy7gds5a9pqb6-rendered.drv: build01: the build this call attached to did not finish, retry, asking the scheduler again 88fkisqhznlaz01 …
setup:
88fkisqhznlaz01pp5mpy7gds5a9pqb6-rendered.drv: build01: the build this call attached to did not finish, retry, asking the scheduler again
88fkisqhznlaz01pp5mpy7gds5a9pqb6-rendered.drv: build01: the build this call attached to did not finish, retry, asking the scheduler again
88fkisqhznlaz01pp5mpy7gds5a9pqb6-rendered.drv: build01: build01: input not substitutable: error: path '/nix/store/27nnni81a1gq0196hfp7iww5rkdlwgbf-options.json' is required, but there is no substituter that can build it, asking the scheduler again
88fkisqhznlaz01pp5mpy7gds5a9pqb6-rendered.drv: build01: the build this call attached to did not finish, retry, asking the scheduler again
88fkisqhznlaz01pp5mpy7gds5a9pqb6-rendered.drv: build01: the build this call attached to did not finish, retry, asking the scheduler again
88fkisqhznlaz01pp5mpy7gds5a9pqb6-rendered.drv: build01: build01: input not substitutable: error: path '/nix/store/27nnni81a1gq0196hfp7iww5rkdlwgbf-options.json' is required, but there is no substituter that can build it, asking the scheduler again
88fkisqhznlaz01pp5mpy7gds5a9pqb6-rendered.drv: build01: the build this call attached to did not finish, retry, asking the scheduler again
error: dependency 'y2f7y74zvrkwqnwxm26ikdhrlzpyknqq-generated-docs.drv' failed
failed checks.aarch64-linux.devShell-docs 1m 1s
setup: 88fkisqhznlaz01pp5mpy7gds5a9pqb6-rendered.drv: build01: the build this call attached to did not finish, retry, asking the scheduler again 88fkisqhznlaz01 …
setup:
88fkisqhznlaz01pp5mpy7gds5a9pqb6-rendered.drv: build01: the build this call attached to did not finish, retry, asking the scheduler again
88fkisqhznlaz01pp5mpy7gds5a9pqb6-rendered.drv: build01: the build this call attached to did not finish, retry, asking the scheduler again
88fkisqhznlaz01pp5mpy7gds5a9pqb6-rendered.drv: build01: build01: input not substitutable: error: path '/nix/store/27nnni81a1gq0196hfp7iww5rkdlwgbf-options.json' is required, but there is no substituter that can build it, asking the scheduler again
88fkisqhznlaz01pp5mpy7gds5a9pqb6-rendered.drv: build01: the build this call attached to did not finish, retry, asking the scheduler again
88fkisqhznlaz01pp5mpy7gds5a9pqb6-rendered.drv: build01: the build this call attached to did not finish, retry, asking the scheduler again
88fkisqhznlaz01pp5mpy7gds5a9pqb6-rendered.drv: build01: build01: input not substitutable: error: path '/nix/store/27nnni81a1gq0196hfp7iww5rkdlwgbf-options.json' is required, but there is no substituter that can build it, asking the scheduler again
88fkisqhznlaz01pp5mpy7gds5a9pqb6-rendered.drv: build01: build01: input not substitutable: error: path '/nix/store/27nnni81a1gq0196hfp7iww5rkdlwgbf-options.json' is required, but there is no substituter that can build it, asking the scheduler again
error: dependency 'y2f7y74zvrkwqnwxm26ikdhrlzpyknqq-generated-docs.drv' failed
failed eval checks.aarch64-linux.dm-dns —
error: … while evaluating the attribute 'drvPath' at «https://releases.nixos.org/nixpkgs/nixpkgs-26.11pre1085827.aa48d3470809/nixexprs.tar.xz?na …
error:
       … while evaluating the attribute 'drvPath'
         at «https://releases.nixos.org/nixpkgs/nixpkgs-26.11pre1085827.aa48d3470809/nixexprs.tar.xz?narHash=sha256-R4B%2BRRYmze9htmPZ8xeF19mchTSH99GdaqanKCW8CF8%3D»/lib/customisation.nix:416:11:
          415|         // {
          416|           drvPath =
             |           ^
          417|             assert condition;

       … while calling the 'derivationStrict' builtin
         at «nix-internal»/derivation-internal.nix:37:12:
           36|
           37|   strict = derivationStrict drvAttrs;
             |            ^
           38|

       … while evaluating the option `driverConfiguration.vlans':

       … while evaluating definitions from `/nix/store/vlhb7haagkjabf20g1vg9kxi53fcpi17-source/nixos/lib/testing/driver-configuration.nix':

       … while evaluating the option `containers.client.networking.interfaces':

       … while evaluating definitions from `/nix/store/vlhb7haagkjabf20g1vg9kxi53fcpi17-source/nixos/modules/hardware/facter/networking':

       … while evaluating the option `containers.client.hardware.facter.enable':

       … while evaluating the option `containers.client.hardware.facter.report':

       … while evaluating the option `containers.client.hardware.facter.reportPath':

       … while evaluating definitions from `/nix/store/prsp9i0g7kp2acraws2bg3yk57ad0nxm-source/nixosModules/clanCore/nixos-facter.nix':

       (stack trace truncated; use '--show-trace' to show the full, detailed trace)

       error: build of '/nix/store/d5almx1kbj048lc954ydsais4g48mjcj-merged-test-dir-dm-dns.drv^out' failed: error: gave up after 9 reschedules
failed eval checks.aarch64-linux.dyndns —
error: … while evaluating the attribute 'drvPath' at «https://releases.nixos.org/nixpkgs/nixpkgs-26.11pre1085827.aa48d3470809/nixexprs.tar.xz?na …
error:
       … while evaluating the attribute 'drvPath'
         at «https://releases.nixos.org/nixpkgs/nixpkgs-26.11pre1085827.aa48d3470809/nixexprs.tar.xz?narHash=sha256-R4B%2BRRYmze9htmPZ8xeF19mchTSH99GdaqanKCW8CF8%3D»/lib/customisation.nix:416:11:
          415|         // {
          416|           drvPath =
             |           ^
          417|             assert condition;

       … while calling the 'derivationStrict' builtin
         at «nix-internal»/derivation-internal.nix:37:12:
           36|
           37|   strict = derivationStrict drvAttrs;
             |            ^
           38|

       … while evaluating the option `driverConfiguration.vlans':

       … while evaluating definitions from `/nix/store/vlhb7haagkjabf20g1vg9kxi53fcpi17-source/nixos/lib/testing/driver-configuration.nix':

       … while evaluating the option `containers.server.networking.interfaces':

       … while evaluating definitions from `/nix/store/vlhb7haagkjabf20g1vg9kxi53fcpi17-source/nixos/modules/hardware/facter/networking':

       … while evaluating the option `containers.server.hardware.facter.enable':

       … while evaluating the option `containers.server.hardware.facter.report':

       … while evaluating the option `containers.server.hardware.facter.reportPath':

       … while evaluating definitions from `/nix/store/prsp9i0g7kp2acraws2bg3yk57ad0nxm-source/nixosModules/clanCore/nixos-facter.nix':

       (stack trace truncated; use '--show-trace' to show the full, detailed trace)

       error: build of '/nix/store/q1h8mm06ana3jj6ljhmhy9apaa9h0kli-merged-test-dir-dyndns.drv^out' failed: error: error: gRPC AddMultipleToStore on 'nix-store.geninf.io:50051' failed: error: path '/nix/store/7w43kv9n44l91xjg9x0pmqqldk6k95pb-vm' is required, but there is no substituter that can build it
failed eval checks.aarch64-linux.garage —
error: … while evaluating the attribute 'drvPath' at «https://releases.nixos.org/nixpkgs/nixpkgs-26.11pre1085827.aa48d3470809/nixexprs.tar.xz?na …
error:
       … while evaluating the attribute 'drvPath'
         at «https://releases.nixos.org/nixpkgs/nixpkgs-26.11pre1085827.aa48d3470809/nixexprs.tar.xz?narHash=sha256-R4B%2BRRYmze9htmPZ8xeF19mchTSH99GdaqanKCW8CF8%3D»/lib/customisation.nix:416:11:
          415|         // {
          416|           drvPath =
             |           ^
          417|             assert condition;

       … while calling the 'derivationStrict' builtin
         at «nix-internal»/derivation-internal.nix:37:12:
           36|
           37|   strict = derivationStrict drvAttrs;
             |            ^
           38|

       … while evaluating the option `driverConfiguration.vlans':

       … while evaluating definitions from `/nix/store/vlhb7haagkjabf20g1vg9kxi53fcpi17-source/nixos/lib/testing/driver-configuration.nix':

       … while evaluating the option `containers.server.networking.interfaces':

       … while evaluating definitions from `/nix/store/vlhb7haagkjabf20g1vg9kxi53fcpi17-source/nixos/modules/hardware/facter/networking':

       … while evaluating the option `containers.server.hardware.facter.enable':

       … while evaluating the option `containers.server.hardware.facter.report':

       … while evaluating the option `containers.server.hardware.facter.reportPath':

       … while evaluating definitions from `/nix/store/prsp9i0g7kp2acraws2bg3yk57ad0nxm-source/nixosModules/clanCore/nixos-facter.nix':

       (stack trace truncated; use '--show-trace' to show the full, detailed trace)

       error: build of '/nix/store/pxwv2ysglq7205k0pn3rzmv4k07k9nz9-merged-test-dir-garage.drv^out' failed: error: gave up after 9 reschedules
failed eval checks.aarch64-linux.hello-service —
error: … while evaluating the attribute 'drvPath' at «https://releases.nixos.org/nixpkgs/nixpkgs-26.11pre1085827.aa48d3470809/nixexprs.tar.xz?na …
error:
       … while evaluating the attribute 'drvPath'
         at «https://releases.nixos.org/nixpkgs/nixpkgs-26.11pre1085827.aa48d3470809/nixexprs.tar.xz?narHash=sha256-R4B%2BRRYmze9htmPZ8xeF19mchTSH99GdaqanKCW8CF8%3D»/lib/customisation.nix:416:11:
          415|         // {
          416|           drvPath =
             |           ^
          417|             assert condition;

       … while calling the 'derivationStrict' builtin
         at «nix-internal»/derivation-internal.nix:37:12:
           36|
           37|   strict = derivationStrict drvAttrs;
             |            ^
           38|

       … while evaluating the option `driverConfiguration.vlans':

       … while evaluating definitions from `/nix/store/vlhb7haagkjabf20g1vg9kxi53fcpi17-source/nixos/lib/testing/driver-configuration.nix':

       … while evaluating the option `containers.peer1.networking.interfaces':

       … while evaluating definitions from `/nix/store/vlhb7haagkjabf20g1vg9kxi53fcpi17-source/nixos/modules/hardware/facter/networking':

       … while evaluating the option `containers.peer1.hardware.facter.enable':

       … while evaluating the option `containers.peer1.hardware.facter.report':

       … while evaluating the option `containers.peer1.hardware.facter.reportPath':

       … while evaluating definitions from `/nix/store/prsp9i0g7kp2acraws2bg3yk57ad0nxm-source/nixosModules/clanCore/nixos-facter.nix':

       (stack trace truncated; use '--show-trace' to show the full, detailed trace)

       error: build of '/nix/store/w57zn5d5mvjpj5m3vx6ha3l25anzmm6j-merged-test-dir-hello-service.drv^out' failed: error: gave up after 9 reschedules
failed eval checks.aarch64-linux.kde —
error: … while evaluating the attribute 'drvPath' at «https://releases.nixos.org/nixpkgs/nixpkgs-26.11pre1085827.aa48d3470809/nixexprs.tar.xz?na …
error:
       … while evaluating the attribute 'drvPath'
         at «https://releases.nixos.org/nixpkgs/nixpkgs-26.11pre1085827.aa48d3470809/nixexprs.tar.xz?narHash=sha256-R4B%2BRRYmze9htmPZ8xeF19mchTSH99GdaqanKCW8CF8%3D»/lib/customisation.nix:416:11:
          415|         // {
          416|           drvPath =
             |           ^
          417|             assert condition;

       … while calling the 'derivationStrict' builtin
         at «nix-internal»/derivation-internal.nix:37:12:
           36|
           37|   strict = derivationStrict drvAttrs;
             |            ^
           38|

       … while evaluating the option `driverConfiguration.vlans':

       … while evaluating definitions from `/nix/store/vlhb7haagkjabf20g1vg9kxi53fcpi17-source/nixos/lib/testing/driver-configuration.nix':

       … while evaluating the option `containers.client.networking.interfaces':

       … while evaluating definitions from `/nix/store/vlhb7haagkjabf20g1vg9kxi53fcpi17-source/nixos/modules/hardware/facter/networking':

       … while evaluating the option `containers.client.hardware.facter.enable':

       … while evaluating the option `containers.client.hardware.facter.report':

       … while evaluating the option `containers.client.hardware.facter.reportPath':

       … while evaluating definitions from `/nix/store/prsp9i0g7kp2acraws2bg3yk57ad0nxm-source/nixosModules/clanCore/nixos-facter.nix':

       (stack trace truncated; use '--show-trace' to show the full, detailed trace)

       error: build of '/nix/store/7ss8jk5j8lvlkvz9z21kmdvs01hrphhs-merged-test-dir-kde.drv^out' failed: error: gave up after 9 reschedules
failed eval checks.aarch64-linux.localbackup —
error: … while evaluating the attribute 'drvPath' at «https://releases.nixos.org/nixpkgs/nixpkgs-26.11pre1085827.aa48d3470809/nixexprs.tar.xz?na …
error:
       … while evaluating the attribute 'drvPath'
         at «https://releases.nixos.org/nixpkgs/nixpkgs-26.11pre1085827.aa48d3470809/nixexprs.tar.xz?narHash=sha256-R4B%2BRRYmze9htmPZ8xeF19mchTSH99GdaqanKCW8CF8%3D»/lib/customisation.nix:416:11:
          415|         // {
          416|           drvPath =
             |           ^
          417|             assert condition;

       … while calling the 'derivationStrict' builtin
         at «nix-internal»/derivation-internal.nix:37:12:
           36|
           37|   strict = derivationStrict drvAttrs;
             |            ^
           38|

       … while evaluating the option `driverConfiguration.vlans':

       … while evaluating definitions from `/nix/store/vlhb7haagkjabf20g1vg9kxi53fcpi17-source/nixos/lib/testing/driver-configuration.nix':

       … while evaluating the option `containers.machine.networking.interfaces':

       … while evaluating definitions from `/nix/store/vlhb7haagkjabf20g1vg9kxi53fcpi17-source/nixos/modules/hardware/facter/networking':

       … while evaluating the option `containers.machine.hardware.facter.enable':

       … while evaluating the option `containers.machine.hardware.facter.report':

       … while evaluating the option `containers.machine.hardware.facter.reportPath':

       … while evaluating definitions from `/nix/store/prsp9i0g7kp2acraws2bg3yk57ad0nxm-source/nixosModules/clanCore/nixos-facter.nix':

       (stack trace truncated; use '--show-trace' to show the full, detailed trace)

       error: build of '/nix/store/5m2vgn4i1s4amwk8pnrgs25mzmiqbvr0-merged-test-dir-localbackup.drv^out' failed: error: gave up after 9 reschedules
failed eval checks.aarch64-linux.machine-id —
error: … while evaluating the attribute 'drvPath' at «https://releases.nixos.org/nixpkgs/nixpkgs-26.11pre1085827.aa48d3470809/nixexprs.tar.xz?na …
error:
       … while evaluating the attribute 'drvPath'
         at «https://releases.nixos.org/nixpkgs/nixpkgs-26.11pre1085827.aa48d3470809/nixexprs.tar.xz?narHash=sha256-R4B%2BRRYmze9htmPZ8xeF19mchTSH99GdaqanKCW8CF8%3D»/lib/customisation.nix:416:11:
          415|         // {
          416|           drvPath =
             |           ^
          417|             assert condition;

       … while calling the 'derivationStrict' builtin
         at «nix-internal»/derivation-internal.nix:37:12:
           36|
           37|   strict = derivationStrict drvAttrs;
             |            ^
           38|

       … while evaluating the option `driverConfiguration.vlans':

       … while evaluating definitions from `/nix/store/vlhb7haagkjabf20g1vg9kxi53fcpi17-source/nixos/lib/testing/driver-configuration.nix':

       … while evaluating the option `containers.server.networking.interfaces':

       … while evaluating definitions from `/nix/store/vlhb7haagkjabf20g1vg9kxi53fcpi17-source/nixos/modules/hardware/facter/networking':

       … while evaluating the option `containers.server.hardware.facter.enable':

       … while evaluating the option `containers.server.hardware.facter.report':

       … while evaluating the option `containers.server.hardware.facter.reportPath':

       … while evaluating definitions from `/nix/store/prsp9i0g7kp2acraws2bg3yk57ad0nxm-source/nixosModules/clanCore/nixos-facter.nix':

       (stack trace truncated; use '--show-trace' to show the full, detailed trace)

       error: build of '/nix/store/xh8bqz8463ag3rml28aln1fwahy9phhj-merged-test-dir-service-machine-id.drv^out' failed: error: gave up after 9 reschedules
failed eval checks.aarch64-linux.matrix-synapse —
error: … while evaluating the attribute 'drvPath' at «https://releases.nixos.org/nixpkgs/nixpkgs-26.11pre1085827.aa48d3470809/nixexprs.tar.xz?na …
error:
       … while evaluating the attribute 'drvPath'
         at «https://releases.nixos.org/nixpkgs/nixpkgs-26.11pre1085827.aa48d3470809/nixexprs.tar.xz?narHash=sha256-R4B%2BRRYmze9htmPZ8xeF19mchTSH99GdaqanKCW8CF8%3D»/lib/customisation.nix:416:11:
          415|         // {
          416|           drvPath =
             |           ^
          417|             assert condition;

       … while calling the 'derivationStrict' builtin
         at «nix-internal»/derivation-internal.nix:37:12:
           36|
           37|   strict = derivationStrict drvAttrs;
             |            ^
           38|

       … while evaluating the option `driverConfiguration.vlans':

       … while evaluating definitions from `/nix/store/vlhb7haagkjabf20g1vg9kxi53fcpi17-source/nixos/lib/testing/driver-configuration.nix':

       … while evaluating the option `containers.machine.networking.interfaces':

       … while evaluating definitions from `/nix/store/vlhb7haagkjabf20g1vg9kxi53fcpi17-source/nixos/modules/hardware/facter/networking':

       … while evaluating the option `containers.machine.hardware.facter.enable':

       … while evaluating the option `containers.machine.hardware.facter.report':

       … while evaluating the option `containers.machine.hardware.facter.reportPath':

       … while evaluating definitions from `/nix/store/prsp9i0g7kp2acraws2bg3yk57ad0nxm-source/nixosModules/clanCore/nixos-facter.nix':

       (stack trace truncated; use '--show-trace' to show the full, detailed trace)

       error: build of '/nix/store/86asji4bmwf0nk34wr94a16h090d08mi-merged-test-dir-matrix-synapse.drv^out' failed: error: error: gRPC AddMultipleToStore on 'nix-store.geninf.io:50051' failed: error: path '/nix/store/ngz73n5ksvnrzw0p5cay8pxl7fm5hph5-vm' is required, but there is no substituter that can build it
failed eval checks.aarch64-linux.monitoring —
error: … while evaluating the attribute 'drvPath' at «https://releases.nixos.org/nixpkgs/nixpkgs-26.11pre1085827.aa48d3470809/nixexprs.tar.xz?na …
error:
       … while evaluating the attribute 'drvPath'
         at «https://releases.nixos.org/nixpkgs/nixpkgs-26.11pre1085827.aa48d3470809/nixexprs.tar.xz?narHash=sha256-R4B%2BRRYmze9htmPZ8xeF19mchTSH99GdaqanKCW8CF8%3D»/lib/customisation.nix:416:11:
          415|         // {
          416|           drvPath =
             |           ^
          417|             assert condition;

       … while calling the 'derivationStrict' builtin
         at «nix-internal»/derivation-internal.nix:37:12:
           36|
           37|   strict = derivationStrict drvAttrs;
             |            ^
           38|

       … while evaluating the option `driverConfiguration.vlans':

       … while evaluating definitions from `/nix/store/vlhb7haagkjabf20g1vg9kxi53fcpi17-source/nixos/lib/testing/driver-configuration.nix':

       … while evaluating the option `containers.machine1.networking.interfaces':

       … while evaluating definitions from `/nix/store/vlhb7haagkjabf20g1vg9kxi53fcpi17-source/nixos/modules/hardware/facter/networking':

       … while evaluating the option `containers.machine1.hardware.facter.enable':

       … while evaluating the option `containers.machine1.hardware.facter.report':

       … while evaluating the option `containers.machine1.hardware.facter.reportPath':

       … while evaluating definitions from `/nix/store/prsp9i0g7kp2acraws2bg3yk57ad0nxm-source/nixosModules/clanCore/nixos-facter.nix':

       (stack trace truncated; use '--show-trace' to show the full, detailed trace)

       error: build of '/nix/store/zxbvacfhq72cfbwqbkvps2lqr6z2nfcm-merged-test-dir-monitoring.drv^out' failed: error: gave up after 9 reschedules
failed eval checks.aarch64-linux.mycelium —
error: … while evaluating the attribute 'drvPath' at «https://releases.nixos.org/nixpkgs/nixpkgs-26.11pre1085827.aa48d3470809/nixexprs.tar.xz?na …
error:
       … while evaluating the attribute 'drvPath'
         at «https://releases.nixos.org/nixpkgs/nixpkgs-26.11pre1085827.aa48d3470809/nixexprs.tar.xz?narHash=sha256-R4B%2BRRYmze9htmPZ8xeF19mchTSH99GdaqanKCW8CF8%3D»/lib/customisation.nix:416:11:
          415|         // {
          416|           drvPath =
             |           ^
          417|             assert condition;

       … while calling the 'derivationStrict' builtin
         at «nix-internal»/derivation-internal.nix:37:12:
           36|
           37|   strict = derivationStrict drvAttrs;
             |            ^
           38|

       … while evaluating the option `driverConfiguration.vlans':

       … while evaluating definitions from `/nix/store/vlhb7haagkjabf20g1vg9kxi53fcpi17-source/nixos/lib/testing/driver-configuration.nix':

       … while evaluating the option `nodes.server.networking.interfaces':

       … while evaluating definitions from `/nix/store/vlhb7haagkjabf20g1vg9kxi53fcpi17-source/nixos/modules/hardware/facter/networking':

       … while evaluating the option `nodes.server.hardware.facter.enable':

       … while evaluating the option `nodes.server.hardware.facter.report':

       … while evaluating the option `nodes.server.hardware.facter.reportPath':

       … while evaluating definitions from `/nix/store/prsp9i0g7kp2acraws2bg3yk57ad0nxm-source/nixosModules/clanCore/nixos-facter.nix':

       (stack trace truncated; use '--show-trace' to show the full, detailed trace)

       error: build of '/nix/store/xqzx5sw4sqqflh84m47lx6fcajavz3s3-merged-test-dir-mycelium.drv^out' failed: error: gave up after 9 reschedules
failed eval checks.aarch64-linux.ncps —
error: … while evaluating the attribute 'drvPath' at «https://releases.nixos.org/nixpkgs/nixpkgs-26.11pre1085827.aa48d3470809/nixexprs.tar.xz?na …
error:
       … while evaluating the attribute 'drvPath'
         at «https://releases.nixos.org/nixpkgs/nixpkgs-26.11pre1085827.aa48d3470809/nixexprs.tar.xz?narHash=sha256-R4B%2BRRYmze9htmPZ8xeF19mchTSH99GdaqanKCW8CF8%3D»/lib/customisation.nix:416:11:
          415|         // {
          416|           drvPath =
             |           ^
          417|             assert condition;

       … while calling the 'derivationStrict' builtin
         at «nix-internal»/derivation-internal.nix:37:12:
           36|
           37|   strict = derivationStrict drvAttrs;
             |            ^
           38|

       … while evaluating the option `driverConfiguration.vlans':

       … while evaluating definitions from `/nix/store/vlhb7haagkjabf20g1vg9kxi53fcpi17-source/nixos/lib/testing/driver-configuration.nix':

       … while evaluating the option `nodes.alice.networking.interfaces':

       … while evaluating definitions from `/nix/store/vlhb7haagkjabf20g1vg9kxi53fcpi17-source/nixos/modules/hardware/facter/networking':

       … while evaluating the option `nodes.alice.hardware.facter.enable':

       … while evaluating the option `nodes.alice.hardware.facter.report':

       … while evaluating the option `nodes.alice.hardware.facter.reportPath':

       … while evaluating definitions from `/nix/store/prsp9i0g7kp2acraws2bg3yk57ad0nxm-source/nixosModules/clanCore/nixos-facter.nix':

       (stack trace truncated; use '--show-trace' to show the full, detailed trace)

       error: build of '/nix/store/xcqvs306r9b9384ybng2iznhxssi40q1-merged-test-dir-ncps.drv^out' failed: error: gave up after 9 reschedules
failed eval checks.aarch64-linux.nixos-test-password-store-mounts —
error: … while evaluating the attribute 'drvPath' at «https://releases.nixos.org/nixpkgs/nixpkgs-26.11pre1085827.aa48d3470809/nixexprs.tar.xz?na …
error:
       … while evaluating the attribute 'drvPath'
         at «https://releases.nixos.org/nixpkgs/nixpkgs-26.11pre1085827.aa48d3470809/nixexprs.tar.xz?narHash=sha256-R4B%2BRRYmze9htmPZ8xeF19mchTSH99GdaqanKCW8CF8%3D»/lib/customisation.nix:416:11:
          415|         // {
          416|           drvPath =
             |           ^
          417|             assert condition;

       … while calling the 'derivationStrict' builtin
         at «nix-internal»/derivation-internal.nix:37:12:
           36|
           37|   strict = derivationStrict drvAttrs;
             |            ^
           38|

       … while evaluating the option `driverConfiguration.vlans':

       … while evaluating definitions from `/nix/store/vlhb7haagkjabf20g1vg9kxi53fcpi17-source/nixos/lib/testing/driver-configuration.nix':

       … while evaluating the option `nodes.machine.networking.interfaces':

       … while evaluating definitions from `/nix/store/vlhb7haagkjabf20g1vg9kxi53fcpi17-source/nixos/modules/hardware/facter/networking':

       … while evaluating the option `nodes.machine.hardware.facter.enable':

       … while evaluating the option `nodes.machine.hardware.facter.report':

       … while evaluating the option `nodes.machine.hardware.facter.reportPath':

       … while evaluating definitions from `/nix/store/prsp9i0g7kp2acraws2bg3yk57ad0nxm-source/nixosModules/clanCore/nixos-facter.nix':

       (stack trace truncated; use '--show-trace' to show the full, detailed trace)

       error: build of '/nix/store/fd4w6z1djq3452qfd2yvp55jcbvcfrmg-merged-test-dir-nixos-test-password-store-mounts.drv^out' failed: error: error: gRPC AddMultipleToStore on 'nix-store.geninf.io:50051' failed: error: path '/nix/store/147rxl0010d5n36k0a98hw6n0f6w4kri-tests' is required, but there is no substituter that can build it
failed checks.aarch64-linux.nixos-test-secrets 1m 5s
setup: don't know how to build these paths: /nix/store/hnmqjinv1mqx4vh2i1qxaa6s8dn13q12-vm-test-run-secrets.drv warning: ignoring the client-specified setting …
setup:
don't know how to build these paths:
  /nix/store/hnmqjinv1mqx4vh2i1qxaa6s8dn13q12-vm-test-run-secrets.drv
warning: ignoring the client-specified setting 'store', because it is a restricted setting and you are not a trusted user
1cq8p9jlx3jy34fnf8g6f93plz10bf7s-system-units.drv: error: gRPC AddMultipleToStore on 'nix-store.geninf.io:50051' failed: error: path '/nix/store/lkjhawa7yas6n2cjc5h4znwj4knsf5hj-X-Reload-Triggers-systemd-networkd.drv' is required, but there is no substituter that can build it
error: dependency 'fvf5a55420z2jrwl9mb1nsvjssar2mk3-nixos-test-driver-secrets.drv' failed
failed eval checks.aarch64-linux.p2p-ssh-iroh —
error: … while evaluating the attribute 'drvPath' at «https://releases.nixos.org/nixpkgs/nixpkgs-26.11pre1085827.aa48d3470809/nixexprs.tar.xz?na …
error:
       … while evaluating the attribute 'drvPath'
         at «https://releases.nixos.org/nixpkgs/nixpkgs-26.11pre1085827.aa48d3470809/nixexprs.tar.xz?narHash=sha256-R4B%2BRRYmze9htmPZ8xeF19mchTSH99GdaqanKCW8CF8%3D»/lib/customisation.nix:416:11:
          415|         // {
          416|           drvPath =
             |           ^
          417|             assert condition;

       … while calling the 'derivationStrict' builtin
         at «nix-internal»/derivation-internal.nix:37:12:
           36|
           37|   strict = derivationStrict drvAttrs;
             |            ^
           38|

       … while evaluating the option `driverConfiguration.vlans':

       … while evaluating definitions from `/nix/store/vlhb7haagkjabf20g1vg9kxi53fcpi17-source/nixos/lib/testing/driver-configuration.nix':

       … while evaluating the option `containers.client.networking.interfaces':

       … while evaluating definitions from `/nix/store/vlhb7haagkjabf20g1vg9kxi53fcpi17-source/nixos/modules/hardware/facter/networking':

       … while evaluating the option `containers.client.hardware.facter.enable':

       … while evaluating the option `containers.client.hardware.facter.report':

       … while evaluating the option `containers.client.hardware.facter.reportPath':

       … while evaluating definitions from `/nix/store/prsp9i0g7kp2acraws2bg3yk57ad0nxm-source/nixosModules/clanCore/nixos-facter.nix':

       (stack trace truncated; use '--show-trace' to show the full, detailed trace)

       error: build of '/nix/store/g1ydbrlzfvbi1y56lscz5z0n0s495y26-merged-test-dir-clan-test-p2p-ssh-iroh.drv^out' failed: error: error: gRPC AddMultipleToStore on 'nix-store.geninf.io:50051' failed: error: path '/nix/store/jbmz1rgwv3c5640ab19nanq0yvy3lyxn-vm' is required, but there is no substituter that can build it
failed eval checks.aarch64-linux.packages —
error: … while evaluating the attribute 'drvPath' at «https://releases.nixos.org/nixpkgs/nixpkgs-26.11pre1085827.aa48d3470809/nixexprs.tar.xz?na …
error:
       … while evaluating the attribute 'drvPath'
         at «https://releases.nixos.org/nixpkgs/nixpkgs-26.11pre1085827.aa48d3470809/nixexprs.tar.xz?narHash=sha256-R4B%2BRRYmze9htmPZ8xeF19mchTSH99GdaqanKCW8CF8%3D»/lib/customisation.nix:416:11:
          415|         // {
          416|           drvPath =
             |           ^
          417|             assert condition;

       … while calling the 'derivationStrict' builtin
         at «nix-internal»/derivation-internal.nix:37:12:
           36|
           37|   strict = derivationStrict drvAttrs;
             |            ^
           38|

       … while evaluating the option `driverConfiguration.vlans':

       … while evaluating definitions from `/nix/store/vlhb7haagkjabf20g1vg9kxi53fcpi17-source/nixos/lib/testing/driver-configuration.nix':

       … while evaluating the option `containers.server.networking.interfaces':

       … while evaluating definitions from `/nix/store/vlhb7haagkjabf20g1vg9kxi53fcpi17-source/nixos/modules/hardware/facter/networking':

       … while evaluating the option `containers.server.hardware.facter.enable':

       … while evaluating the option `containers.server.hardware.facter.report':

       … while evaluating the option `containers.server.hardware.facter.reportPath':

       … while evaluating definitions from `/nix/store/prsp9i0g7kp2acraws2bg3yk57ad0nxm-source/nixosModules/clanCore/nixos-facter.nix':

       (stack trace truncated; use '--show-trace' to show the full, detailed trace)

       error: build of '/nix/store/nyz3rmrrm4qcxdwbln0414mkr6ldfpqa-merged-test-dir-packages.drv^out' failed: error: error: gRPC AddMultipleToStore on 'nix-store.geninf.io:50051' failed: error: path '/nix/store/3hwv4qpg203232ngaimvmxbx2xmvv9qf-vm' is required, but there is no substituter that can build it
failed eval checks.aarch64-linux.pki —
error: … while evaluating the attribute 'drvPath' at «https://releases.nixos.org/nixpkgs/nixpkgs-26.11pre1085827.aa48d3470809/nixexprs.tar.xz?na …
error:
       … while evaluating the attribute 'drvPath'
         at «https://releases.nixos.org/nixpkgs/nixpkgs-26.11pre1085827.aa48d3470809/nixexprs.tar.xz?narHash=sha256-R4B%2BRRYmze9htmPZ8xeF19mchTSH99GdaqanKCW8CF8%3D»/lib/customisation.nix:416:11:
          415|         // {
          416|           drvPath =
             |           ^
          417|             assert condition;

       … while calling the 'derivationStrict' builtin
         at «nix-internal»/derivation-internal.nix:37:12:
           36|
           37|   strict = derivationStrict drvAttrs;
             |            ^
           38|

       … while evaluating the option `driverConfiguration.vlans':

       … while evaluating definitions from `/nix/store/vlhb7haagkjabf20g1vg9kxi53fcpi17-source/nixos/lib/testing/driver-configuration.nix':

       … while evaluating the option `nodes.caddy.networking.interfaces':

       … while evaluating definitions from `/nix/store/vlhb7haagkjabf20g1vg9kxi53fcpi17-source/nixos/modules/hardware/facter/networking':

       … while evaluating the option `nodes.caddy.hardware.facter.enable':

       … while evaluating the option `nodes.caddy.hardware.facter.report':

       … while evaluating the option `nodes.caddy.hardware.facter.reportPath':

       … while evaluating definitions from `/nix/store/prsp9i0g7kp2acraws2bg3yk57ad0nxm-source/nixosModules/clanCore/nixos-facter.nix':

       (stack trace truncated; use '--show-trace' to show the full, detailed trace)

       error: build of '/nix/store/w8kr1wjhbsz621nwm6cchg61w4hpfsa2-merged-test-dir-pki.drv^out' failed: error: gave up after 9 reschedules
failed eval checks.aarch64-linux.postgresql —
error: … while evaluating the attribute 'drvPath' at «https://releases.nixos.org/nixpkgs/nixpkgs-26.11pre1085827.aa48d3470809/nixexprs.tar.xz?na …
error:
       … while evaluating the attribute 'drvPath'
         at «https://releases.nixos.org/nixpkgs/nixpkgs-26.11pre1085827.aa48d3470809/nixexprs.tar.xz?narHash=sha256-R4B%2BRRYmze9htmPZ8xeF19mchTSH99GdaqanKCW8CF8%3D»/lib/customisation.nix:416:11:
          415|         // {
          416|           drvPath =
             |           ^
          417|             assert condition;

       … while calling the 'derivationStrict' builtin
         at «nix-internal»/derivation-internal.nix:37:12:
           36|
           37|   strict = derivationStrict drvAttrs;
             |            ^
           38|

       … while evaluating the option `driverConfiguration.vlans':

       … while evaluating definitions from `/nix/store/vlhb7haagkjabf20g1vg9kxi53fcpi17-source/nixos/lib/testing/driver-configuration.nix':

       … while evaluating the option `containers.machine.networking.interfaces':

       … while evaluating definitions from `/nix/store/vlhb7haagkjabf20g1vg9kxi53fcpi17-source/nixos/modules/hardware/facter/networking':

       … while evaluating the option `containers.machine.hardware.facter.enable':

       … while evaluating the option `containers.machine.hardware.facter.report':

       … while evaluating the option `containers.machine.hardware.facter.reportPath':

       … while evaluating definitions from `/nix/store/prsp9i0g7kp2acraws2bg3yk57ad0nxm-source/nixosModules/clanCore/nixos-facter.nix':

       (stack trace truncated; use '--show-trace' to show the full, detailed trace)

       error: build of '/nix/store/5iibba5p38fym6ym62k83fx13cnqvabv-merged-test-dir-service-postgresql.drv^out' failed: error: gave up after 9 reschedules
failed eval checks.aarch64-linux.service-dummy-test —
error: … while evaluating the attribute 'drvPath' at «https://releases.nixos.org/nixpkgs/nixpkgs-26.11pre1085827.aa48d3470809/nixexprs.tar.xz?na …
error:
       … while evaluating the attribute 'drvPath'
         at «https://releases.nixos.org/nixpkgs/nixpkgs-26.11pre1085827.aa48d3470809/nixexprs.tar.xz?narHash=sha256-R4B%2BRRYmze9htmPZ8xeF19mchTSH99GdaqanKCW8CF8%3D»/lib/customisation.nix:416:11:
          415|         // {
          416|           drvPath =
             |           ^
          417|             assert condition;

       … while calling the 'derivationStrict' builtin
         at «nix-internal»/derivation-internal.nix:37:12:
           36|
           37|   strict = derivationStrict drvAttrs;
             |            ^
           38|

       … while evaluating the option `driverConfiguration.vlans':

       … while evaluating definitions from `/nix/store/vlhb7haagkjabf20g1vg9kxi53fcpi17-source/nixos/lib/testing/driver-configuration.nix':

       … while evaluating the option `containers.admin1.networking.interfaces':

       … while evaluating definitions from `/nix/store/vlhb7haagkjabf20g1vg9kxi53fcpi17-source/nixos/modules/hardware/facter/networking':

       … while evaluating the option `containers.admin1.hardware.facter.enable':

       … while evaluating the option `containers.admin1.hardware.facter.report':

       … while evaluating the option `containers.admin1.hardware.facter.reportPath':

       … while evaluating definitions from `/nix/store/prsp9i0g7kp2acraws2bg3yk57ad0nxm-source/nixosModules/clanCore/nixos-facter.nix':

       (stack trace truncated; use '--show-trace' to show the full, detailed trace)

       error: build of '/nix/store/z9naskk0hp6d2q9xbqc6m55zqa3y7vhr-merged-test-dir-service-dummy-test.drv^out' failed: error: gave up after 9 reschedules
failed eval checks.aarch64-linux.service-dummy-test-from-flake —
error: … while evaluating the attribute 'drvPath' at «https://releases.nixos.org/nixpkgs/nixpkgs-26.11pre1085827.aa48d3470809/nixexprs.tar.xz?na …
error:
       … while evaluating the attribute 'drvPath'
         at «https://releases.nixos.org/nixpkgs/nixpkgs-26.11pre1085827.aa48d3470809/nixexprs.tar.xz?narHash=sha256-R4B%2BRRYmze9htmPZ8xeF19mchTSH99GdaqanKCW8CF8%3D»/lib/customisation.nix:416:11:
          415|         // {
          416|           drvPath =
             |           ^
          417|             assert condition;

       … while calling the 'derivationStrict' builtin
         at «nix-internal»/derivation-internal.nix:37:12:
           36|
           37|   strict = derivationStrict drvAttrs;
             |            ^
           38|

       … while evaluating the option `driverConfiguration.vlans':

       … while evaluating definitions from `/nix/store/vlhb7haagkjabf20g1vg9kxi53fcpi17-source/nixos/lib/testing/driver-configuration.nix':

       … while evaluating the option `containers.admin1.networking.interfaces':

       … while evaluating definitions from `/nix/store/vlhb7haagkjabf20g1vg9kxi53fcpi17-source/nixos/modules/hardware/facter/networking':

       … while evaluating the option `containers.admin1.hardware.facter.enable':

       … while evaluating the option `containers.admin1.hardware.facter.report':

       … while evaluating the option `containers.admin1.hardware.facter.reportPath':

       … while evaluating definitions from `/nix/store/prsp9i0g7kp2acraws2bg3yk57ad0nxm-source/nixosModules/clanCore/nixos-facter.nix':

       (stack trace truncated; use '--show-trace' to show the full, detailed trace)

       error: build of '/nix/store/1dannijgk3pn19dzpad13p17lhqca1nl-merged-test-dir-service-dummy-test-from-flake.drv^out' failed: error: gave up after 9 reschedules
failed eval checks.aarch64-linux.sshd —
error: … while evaluating the attribute 'drvPath' at «https://releases.nixos.org/nixpkgs/nixpkgs-26.11pre1085827.aa48d3470809/nixexprs.tar.xz?na …
error:
       … while evaluating the attribute 'drvPath'
         at «https://releases.nixos.org/nixpkgs/nixpkgs-26.11pre1085827.aa48d3470809/nixexprs.tar.xz?narHash=sha256-R4B%2BRRYmze9htmPZ8xeF19mchTSH99GdaqanKCW8CF8%3D»/lib/customisation.nix:416:11:
          415|         // {
          416|           drvPath =
             |           ^
          417|             assert condition;

       … while calling the 'derivationStrict' builtin
         at «nix-internal»/derivation-internal.nix:37:12:
           36|
           37|   strict = derivationStrict drvAttrs;
             |            ^
           38|

       … while evaluating the option `driverConfiguration.vlans':

       … while evaluating definitions from `/nix/store/vlhb7haagkjabf20g1vg9kxi53fcpi17-source/nixos/lib/testing/driver-configuration.nix':

       … while evaluating the option `containers.client.networking.interfaces':

       … while evaluating definitions from `/nix/store/vlhb7haagkjabf20g1vg9kxi53fcpi17-source/nixos/modules/hardware/facter/networking':

       … while evaluating the option `containers.client.hardware.facter.enable':

       … while evaluating the option `containers.client.hardware.facter.report':

       … while evaluating the option `containers.client.hardware.facter.reportPath':

       … while evaluating definitions from `/nix/store/prsp9i0g7kp2acraws2bg3yk57ad0nxm-source/nixosModules/clanCore/nixos-facter.nix':

       (stack trace truncated; use '--show-trace' to show the full, detailed trace)

       error: build of '/nix/store/zs4n7j21fmqm1ylli4k5bzv0blvwa0b1-merged-test-dir-sshd.drv^out' failed: error: gave up after 9 reschedules
failed eval checks.aarch64-linux.sshd-no-ca —
error: … while evaluating the attribute 'drvPath' at «https://releases.nixos.org/nixpkgs/nixpkgs-26.11pre1085827.aa48d3470809/nixexprs.tar.xz?na …
error:
       … while evaluating the attribute 'drvPath'
         at «https://releases.nixos.org/nixpkgs/nixpkgs-26.11pre1085827.aa48d3470809/nixexprs.tar.xz?narHash=sha256-R4B%2BRRYmze9htmPZ8xeF19mchTSH99GdaqanKCW8CF8%3D»/lib/customisation.nix:416:11:
          415|         // {
          416|           drvPath =
             |           ^
          417|             assert condition;

       … while calling the 'derivationStrict' builtin
         at «nix-internal»/derivation-internal.nix:37:12:
           36|
           37|   strict = derivationStrict drvAttrs;
             |            ^
           38|

       … while evaluating the option `driverConfiguration.vlans':

       … while evaluating definitions from `/nix/store/vlhb7haagkjabf20g1vg9kxi53fcpi17-source/nixos/lib/testing/driver-configuration.nix':

       … while evaluating the option `containers.client.networking.interfaces':

       … while evaluating definitions from `/nix/store/vlhb7haagkjabf20g1vg9kxi53fcpi17-source/nixos/modules/hardware/facter/networking':

       … while evaluating the option `containers.client.hardware.facter.enable':

       … while evaluating the option `containers.client.hardware.facter.report':

       … while evaluating the option `containers.client.hardware.facter.reportPath':

       … while evaluating definitions from `/nix/store/prsp9i0g7kp2acraws2bg3yk57ad0nxm-source/nixosModules/clanCore/nixos-facter.nix':

       (stack trace truncated; use '--show-trace' to show the full, detailed trace)

       error: build of '/nix/store/avs3c65z02f9gg37cj2lf2qy48pvvlmc-merged-test-dir-sshd.drv^out' failed: error: gave up after 9 reschedules
failed eval checks.aarch64-linux.state-version —
error: … while evaluating the attribute 'drvPath' at «https://releases.nixos.org/nixpkgs/nixpkgs-26.11pre1085827.aa48d3470809/nixexprs.tar.xz?na …
error:
       … while evaluating the attribute 'drvPath'
         at «https://releases.nixos.org/nixpkgs/nixpkgs-26.11pre1085827.aa48d3470809/nixexprs.tar.xz?narHash=sha256-R4B%2BRRYmze9htmPZ8xeF19mchTSH99GdaqanKCW8CF8%3D»/lib/customisation.nix:416:11:
          415|         // {
          416|           drvPath =
             |           ^
          417|             assert condition;

       … while calling the 'derivationStrict' builtin
         at «nix-internal»/derivation-internal.nix:37:12:
           36|
           37|   strict = derivationStrict drvAttrs;
             |            ^
           38|

       … while evaluating the option `driverConfiguration.vlans':

       … while evaluating definitions from `/nix/store/vlhb7haagkjabf20g1vg9kxi53fcpi17-source/nixos/lib/testing/driver-configuration.nix':

       … while evaluating the option `containers.server.networking.interfaces':

       … while evaluating definitions from `/nix/store/vlhb7haagkjabf20g1vg9kxi53fcpi17-source/nixos/modules/hardware/facter/networking':

       … while evaluating the option `containers.server.hardware.facter.enable':

       … while evaluating the option `containers.server.hardware.facter.report':

       … while evaluating the option `containers.server.hardware.facter.reportPath':

       … while evaluating definitions from `/nix/store/prsp9i0g7kp2acraws2bg3yk57ad0nxm-source/nixosModules/clanCore/nixos-facter.nix':

       (stack trace truncated; use '--show-trace' to show the full, detailed trace)

       error: build of '/nix/store/qjlaaplnjd8nacvm4ncscjyl2ixpdnhp-merged-test-dir-service-state-version.drv^out' failed: error: gave up after 9 reschedules
failed eval checks.aarch64-linux.syncthing-service —
error: … while evaluating the attribute 'drvPath' at «https://releases.nixos.org/nixpkgs/nixpkgs-26.11pre1085827.aa48d3470809/nixexprs.tar.xz?na …
error:
       … while evaluating the attribute 'drvPath'
         at «https://releases.nixos.org/nixpkgs/nixpkgs-26.11pre1085827.aa48d3470809/nixexprs.tar.xz?narHash=sha256-R4B%2BRRYmze9htmPZ8xeF19mchTSH99GdaqanKCW8CF8%3D»/lib/customisation.nix:416:11:
          415|         // {
          416|           drvPath =
             |           ^
          417|             assert condition;

       … while calling the 'derivationStrict' builtin
         at «nix-internal»/derivation-internal.nix:37:12:
           36|
           37|   strict = derivationStrict drvAttrs;
             |            ^
           38|

       … while evaluating the option `driverConfiguration.vlans':

       … while evaluating definitions from `/nix/store/vlhb7haagkjabf20g1vg9kxi53fcpi17-source/nixos/lib/testing/driver-configuration.nix':

       … while evaluating the option `containers.machine1.networking.interfaces':

       … while evaluating definitions from `/nix/store/vlhb7haagkjabf20g1vg9kxi53fcpi17-source/nixos/modules/hardware/facter/networking':

       … while evaluating the option `containers.machine1.hardware.facter.enable':

       … while evaluating the option `containers.machine1.hardware.facter.report':

       … while evaluating the option `containers.machine1.hardware.facter.reportPath':

       … while evaluating definitions from `/nix/store/prsp9i0g7kp2acraws2bg3yk57ad0nxm-source/nixosModules/clanCore/nixos-facter.nix':

       (stack trace truncated; use '--show-trace' to show the full, detailed trace)

       error: build of '/nix/store/7pq323b8ncdqa64xkh24ryldvpyqzmxx-merged-test-dir-syncthing-service.drv^out' failed: error: gave up after 9 reschedules
failed eval checks.aarch64-linux.trusted-nix-caches —
error: … while evaluating the attribute 'drvPath' at «https://releases.nixos.org/nixpkgs/nixpkgs-26.11pre1085827.aa48d3470809/nixexprs.tar.xz?na …
error:
       … while evaluating the attribute 'drvPath'
         at «https://releases.nixos.org/nixpkgs/nixpkgs-26.11pre1085827.aa48d3470809/nixexprs.tar.xz?narHash=sha256-R4B%2BRRYmze9htmPZ8xeF19mchTSH99GdaqanKCW8CF8%3D»/lib/customisation.nix:416:11:
          415|         // {
          416|           drvPath =
             |           ^
          417|             assert condition;

       … while calling the 'derivationStrict' builtin
         at «nix-internal»/derivation-internal.nix:37:12:
           36|
           37|   strict = derivationStrict drvAttrs;
             |            ^
           38|

       … while evaluating the option `driverConfiguration.vlans':

       … while evaluating definitions from `/nix/store/vlhb7haagkjabf20g1vg9kxi53fcpi17-source/nixos/lib/testing/driver-configuration.nix':

       … while evaluating the option `containers.server.networking.interfaces':

       … while evaluating definitions from `/nix/store/vlhb7haagkjabf20g1vg9kxi53fcpi17-source/nixos/modules/hardware/facter/networking':

       … while evaluating the option `containers.server.hardware.facter.enable':

       … while evaluating the option `containers.server.hardware.facter.report':

       … while evaluating the option `containers.server.hardware.facter.reportPath':

       … while evaluating definitions from `/nix/store/prsp9i0g7kp2acraws2bg3yk57ad0nxm-source/nixosModules/clanCore/nixos-facter.nix':

       (stack trace truncated; use '--show-trace' to show the full, detailed trace)

       error: build of '/nix/store/dpb92ps6qqwgi1mfb9sp3p8d0ckj9nn3-merged-test-dir-trusted-nix-caches.drv^out' failed: error: error: gRPC AddMultipleToStore on 'nix-store.geninf.io:50051' failed: error: path '/nix/store/79ajsf4ajd494ickr8rdsrbalk7an5f7-vm' is required, but there is no substituter that can build it
failed eval checks.aarch64-linux.users —
error: … while evaluating the attribute 'drvPath' at «https://releases.nixos.org/nixpkgs/nixpkgs-26.11pre1085827.aa48d3470809/nixexprs.tar.xz?na …
error:
       … while evaluating the attribute 'drvPath'
         at «https://releases.nixos.org/nixpkgs/nixpkgs-26.11pre1085827.aa48d3470809/nixexprs.tar.xz?narHash=sha256-R4B%2BRRYmze9htmPZ8xeF19mchTSH99GdaqanKCW8CF8%3D»/lib/customisation.nix:416:11:
          415|         // {
          416|           drvPath =
             |           ^
          417|             assert condition;

       … while calling the 'derivationStrict' builtin
         at «nix-internal»/derivation-internal.nix:37:12:
           36|
           37|   strict = derivationStrict drvAttrs;
             |            ^
           38|

       … while evaluating the option `driverConfiguration.vlans':

       … while evaluating definitions from `/nix/store/vlhb7haagkjabf20g1vg9kxi53fcpi17-source/nixos/lib/testing/driver-configuration.nix':

       … while evaluating the option `containers.server.networking.interfaces':

       … while evaluating definitions from `/nix/store/vlhb7haagkjabf20g1vg9kxi53fcpi17-source/nixos/modules/hardware/facter/networking':

       … while evaluating the option `containers.server.hardware.facter.enable':

       … while evaluating the option `containers.server.hardware.facter.report':

       … while evaluating the option `containers.server.hardware.facter.reportPath':

       … while evaluating definitions from `/nix/store/prsp9i0g7kp2acraws2bg3yk57ad0nxm-source/nixosModules/clanCore/nixos-facter.nix':

       (stack trace truncated; use '--show-trace' to show the full, detailed trace)

       error: build of '/nix/store/74mgk3pp0ff54g80wqfdmxfp0cl282k4-merged-test-dir-users.drv^out' failed: error: gave up after 9 reschedules
failed eval checks.aarch64-linux.wifi —
error: … while evaluating the attribute 'drvPath' at «https://releases.nixos.org/nixpkgs/nixpkgs-26.11pre1085827.aa48d3470809/nixexprs.tar.xz?na …
error:
       … while evaluating the attribute 'drvPath'
         at «https://releases.nixos.org/nixpkgs/nixpkgs-26.11pre1085827.aa48d3470809/nixexprs.tar.xz?narHash=sha256-R4B%2BRRYmze9htmPZ8xeF19mchTSH99GdaqanKCW8CF8%3D»/lib/customisation.nix:416:11:
          415|         // {
          416|           drvPath =
             |           ^
          417|             assert condition;

       … while calling the 'derivationStrict' builtin
         at «nix-internal»/derivation-internal.nix:37:12:
           36|
           37|   strict = derivationStrict drvAttrs;
             |            ^
           38|

       … while evaluating the option `driverConfiguration.vlans':

       … while evaluating definitions from `/nix/store/vlhb7haagkjabf20g1vg9kxi53fcpi17-source/nixos/lib/testing/driver-configuration.nix':

       … while evaluating the option `nodes.second.networking.interfaces':

       … while evaluating definitions from `/nix/store/vlhb7haagkjabf20g1vg9kxi53fcpi17-source/nixos/modules/hardware/facter/networking':

       … while evaluating the option `nodes.second.hardware.facter.enable':

       … while evaluating the option `nodes.second.hardware.facter.report':

       … while evaluating the option `nodes.second.hardware.facter.reportPath':

       … while evaluating definitions from `/nix/store/prsp9i0g7kp2acraws2bg3yk57ad0nxm-source/nixosModules/clanCore/nixos-facter.nix':

       (stack trace truncated; use '--show-trace' to show the full, detailed trace)

       error: build of '/nix/store/5afm43bgg3cqc6a3640y3kz1vkd43swn-merged-test-dir-wifi.drv^out' failed: error: gave up after 9 reschedules
failed eval checks.aarch64-linux.wireguard —
error: … while evaluating the attribute 'drvPath' at «https://releases.nixos.org/nixpkgs/nixpkgs-26.11pre1085827.aa48d3470809/nixexprs.tar.xz?na …
error:
       … while evaluating the attribute 'drvPath'
         at «https://releases.nixos.org/nixpkgs/nixpkgs-26.11pre1085827.aa48d3470809/nixexprs.tar.xz?narHash=sha256-R4B%2BRRYmze9htmPZ8xeF19mchTSH99GdaqanKCW8CF8%3D»/lib/customisation.nix:416:11:
          415|         // {
          416|           drvPath =
             |           ^
          417|             assert condition;

       … while calling the 'derivationStrict' builtin
         at «nix-internal»/derivation-internal.nix:37:12:
           36|
           37|   strict = derivationStrict drvAttrs;
             |            ^
           38|

       … while evaluating the option `driverConfiguration.vlans':

       … while evaluating definitions from `/nix/store/vlhb7haagkjabf20g1vg9kxi53fcpi17-source/nixos/lib/testing/driver-configuration.nix':

       … while evaluating the option `containers.ctrl1.networking.interfaces':

       … while evaluating definitions from `/nix/store/vlhb7haagkjabf20g1vg9kxi53fcpi17-source/nixos/modules/hardware/facter/networking':

       … while evaluating the option `containers.ctrl1.hardware.facter.enable':

       … while evaluating the option `containers.ctrl1.hardware.facter.report':

       … while evaluating the option `containers.ctrl1.hardware.facter.reportPath':

       … while evaluating definitions from `/nix/store/prsp9i0g7kp2acraws2bg3yk57ad0nxm-source/nixosModules/clanCore/nixos-facter.nix':

       (stack trace truncated; use '--show-trace' to show the full, detailed trace)

       error: build of '/nix/store/5wfp9wvkv2k4xjhxygwlp45dvxzpc8kg-merged-test-dir-wireguard.drv^out' failed: error: gave up after 9 reschedules
failed eval checks.aarch64-linux.yggdrasil —
error: … while evaluating the attribute 'drvPath' at «https://releases.nixos.org/nixpkgs/nixpkgs-26.11pre1085827.aa48d3470809/nixexprs.tar.xz?na …
error:
       … while evaluating the attribute 'drvPath'
         at «https://releases.nixos.org/nixpkgs/nixpkgs-26.11pre1085827.aa48d3470809/nixexprs.tar.xz?narHash=sha256-R4B%2BRRYmze9htmPZ8xeF19mchTSH99GdaqanKCW8CF8%3D»/lib/customisation.nix:416:11:
          415|         // {
          416|           drvPath =
             |           ^
          417|             assert condition;

       … while calling the 'derivationStrict' builtin
         at «nix-internal»/derivation-internal.nix:37:12:
           36|
           37|   strict = derivationStrict drvAttrs;
             |            ^
           38|

       … while evaluating the option `driverConfiguration.vlans':

       … while evaluating definitions from `/nix/store/vlhb7haagkjabf20g1vg9kxi53fcpi17-source/nixos/lib/testing/driver-configuration.nix':

       … while evaluating the option `nodes.outsider.networking.interfaces':

       … while evaluating definitions from `/nix/store/vlhb7haagkjabf20g1vg9kxi53fcpi17-source/nixos/modules/hardware/facter/networking':

       … while evaluating the option `nodes.outsider.hardware.facter.enable':

       … while evaluating the option `nodes.outsider.hardware.facter.report':

       … while evaluating the option `nodes.outsider.hardware.facter.reportPath':

       … while evaluating definitions from `/nix/store/prsp9i0g7kp2acraws2bg3yk57ad0nxm-source/nixosModules/clanCore/nixos-facter.nix':

       (stack trace truncated; use '--show-trace' to show the full, detailed trace)

       error: build of '/nix/store/ys05v6p3b2h4kv99fjkmryckr8x6zq4d-merged-test-dir-yggdrasil.drv^out' failed: error: error: gRPC AddMultipleToStore on 'nix-store.geninf.io:50051' failed: error: path '/nix/store/cpq75gs9406rcri2axlirpi84vx0rda4-vm' is required, but there is no substituter that can build it
failed eval checks.aarch64-linux.zerotier —
error: … while evaluating the attribute 'drvPath' at «https://releases.nixos.org/nixpkgs/nixpkgs-26.11pre1085827.aa48d3470809/nixexprs.tar.xz?na …
error:
       … while evaluating the attribute 'drvPath'
         at «https://releases.nixos.org/nixpkgs/nixpkgs-26.11pre1085827.aa48d3470809/nixexprs.tar.xz?narHash=sha256-R4B%2BRRYmze9htmPZ8xeF19mchTSH99GdaqanKCW8CF8%3D»/lib/customisation.nix:416:11:
          415|         // {
          416|           drvPath =
             |           ^
          417|             assert condition;

       … while calling the 'derivationStrict' builtin
         at «nix-internal»/derivation-internal.nix:37:12:
           36|
           37|   strict = derivationStrict drvAttrs;
             |            ^
           38|

       … while evaluating the option `driverConfiguration.vlans':

       … while evaluating definitions from `/nix/store/vlhb7haagkjabf20g1vg9kxi53fcpi17-source/nixos/lib/testing/driver-configuration.nix':

       … while evaluating the option `nodes.controller.networking.interfaces':

       … while evaluating definitions from `/nix/store/vlhb7haagkjabf20g1vg9kxi53fcpi17-source/nixos/modules/hardware/facter/networking':

       … while evaluating the option `nodes.controller.hardware.facter.enable':

       … while evaluating the option `nodes.controller.hardware.facter.report':

       … while evaluating the option `nodes.controller.hardware.facter.reportPath':

       … while evaluating definitions from `/nix/store/prsp9i0g7kp2acraws2bg3yk57ad0nxm-source/nixosModules/clanCore/nixos-facter.nix':

       (stack trace truncated; use '--show-trace' to show the full, detailed trace)

       error: build of '/nix/store/2y0qla7jnff6jkkbmqzj924kfcyr5d9h-merged-test-dir-zerotier.drv^out' failed: error: gave up after 9 reschedules
failed eval checks.aarch64-linux.zerotier-multi-instance —
error: … while evaluating the attribute 'drvPath' at «https://releases.nixos.org/nixpkgs/nixpkgs-26.11pre1085827.aa48d3470809/nixexprs.tar.xz?na …
error:
       … while evaluating the attribute 'drvPath'
         at «https://releases.nixos.org/nixpkgs/nixpkgs-26.11pre1085827.aa48d3470809/nixexprs.tar.xz?narHash=sha256-R4B%2BRRYmze9htmPZ8xeF19mchTSH99GdaqanKCW8CF8%3D»/lib/customisation.nix:416:11:
          415|         // {
          416|           drvPath =
             |           ^
          417|             assert condition;

       … while calling the 'derivationStrict' builtin
         at «nix-internal»/derivation-internal.nix:37:12:
           36|
           37|   strict = derivationStrict drvAttrs;
             |            ^
           38|

       … while evaluating the option `driverConfiguration.vlans':

       … while evaluating definitions from `/nix/store/vlhb7haagkjabf20g1vg9kxi53fcpi17-source/nixos/lib/testing/driver-configuration.nix':

       … while evaluating the option `nodes.alpha.networking.interfaces':

       … while evaluating definitions from `/nix/store/vlhb7haagkjabf20g1vg9kxi53fcpi17-source/nixos/modules/hardware/facter/networking':

       … while evaluating the option `nodes.alpha.hardware.facter.enable':

       … while evaluating the option `nodes.alpha.hardware.facter.report':

       … while evaluating the option `nodes.alpha.hardware.facter.reportPath':

       … while evaluating definitions from `/nix/store/prsp9i0g7kp2acraws2bg3yk57ad0nxm-source/nixosModules/clanCore/nixos-facter.nix':

       (stack trace truncated; use '--show-trace' to show the full, detailed trace)

       error: build of '/nix/store/zi7hx8rgbdz0gqjrz64hsyv4l8lk9vgb-merged-test-dir-zerotier-multi-instance.drv^out' failed: error: gave up after 9 reschedules
failed eval checks.x86_64-linux.admin —
error: … while evaluating the attribute 'drvPath' at «https://releases.nixos.org/nixpkgs/nixpkgs-26.11pre1085827.aa48d3470809/nixexprs.tar.xz?na …
error:
       … while evaluating the attribute 'drvPath'
         at «https://releases.nixos.org/nixpkgs/nixpkgs-26.11pre1085827.aa48d3470809/nixexprs.tar.xz?narHash=sha256-R4B%2BRRYmze9htmPZ8xeF19mchTSH99GdaqanKCW8CF8%3D»/lib/customisation.nix:416:11:
          415|         // {
          416|           drvPath =
             |           ^
          417|             assert condition;

       … while calling the 'derivationStrict' builtin
         at «nix-internal»/derivation-internal.nix:37:12:
           36|
           37|   strict = derivationStrict drvAttrs;
             |            ^
           38|

       … while evaluating the option `driverConfiguration.vlans':

       … while evaluating definitions from `/nix/store/vlhb7haagkjabf20g1vg9kxi53fcpi17-source/nixos/lib/testing/driver-configuration.nix':

       … while evaluating the option `containers.client.networking.interfaces':

       … while evaluating definitions from `/nix/store/vlhb7haagkjabf20g1vg9kxi53fcpi17-source/nixos/modules/hardware/facter/networking':

       … while evaluating the option `containers.client.hardware.facter.enable':

       … while evaluating the option `containers.client.hardware.facter.report':

       … while evaluating the option `containers.client.hardware.facter.reportPath':

       … while evaluating definitions from `/nix/store/prsp9i0g7kp2acraws2bg3yk57ad0nxm-source/nixosModules/clanCore/nixos-facter.nix':

       (stack trace truncated; use '--show-trace' to show the full, detailed trace)

       error: build of '/nix/store/zl84skhp27xnl77b62lzjihlbq07vryd-merged-test-dir-admin.drv^out' failed: error: gave up after 9 reschedules
failed eval checks.x86_64-linux.borgbackup —
error: … while evaluating the attribute 'drvPath' at «https://releases.nixos.org/nixpkgs/nixpkgs-26.11pre1085827.aa48d3470809/nixexprs.tar.xz?na …
error:
       … while evaluating the attribute 'drvPath'
         at «https://releases.nixos.org/nixpkgs/nixpkgs-26.11pre1085827.aa48d3470809/nixexprs.tar.xz?narHash=sha256-R4B%2BRRYmze9htmPZ8xeF19mchTSH99GdaqanKCW8CF8%3D»/lib/customisation.nix:416:11:
          415|         // {
          416|           drvPath =
             |           ^
          417|             assert condition;

       … while calling the 'derivationStrict' builtin
         at «nix-internal»/derivation-internal.nix:37:12:
           36|
           37|   strict = derivationStrict drvAttrs;
             |            ^
           38|

       … while evaluating the option `driverConfiguration.vlans':

       … while evaluating definitions from `/nix/store/vlhb7haagkjabf20g1vg9kxi53fcpi17-source/nixos/lib/testing/driver-configuration.nix':

       … while evaluating the option `containers.clientone.networking.interfaces':

       … while evaluating definitions from `/nix/store/vlhb7haagkjabf20g1vg9kxi53fcpi17-source/nixos/modules/hardware/facter/networking':

       … while evaluating the option `containers.clientone.hardware.facter.enable':

       … while evaluating the option `containers.clientone.hardware.facter.report':

       … while evaluating the option `containers.clientone.hardware.facter.reportPath':

       … while evaluating definitions from `/nix/store/prsp9i0g7kp2acraws2bg3yk57ad0nxm-source/nixosModules/clanCore/nixos-facter.nix':

       (stack trace truncated; use '--show-trace' to show the full, detailed trace)

       error: build of '/nix/store/zivl2hinxs22isnb9dsqbllzg1228q3c-merged-test-dir-borgbackup.drv^out' failed: error: gave up after 9 reschedules
failed eval checks.x86_64-linux.dyndns —
error: … while evaluating the attribute 'drvPath' at «https://releases.nixos.org/nixpkgs/nixpkgs-26.11pre1085827.aa48d3470809/nixexprs.tar.xz?na …
error:
       … while evaluating the attribute 'drvPath'
         at «https://releases.nixos.org/nixpkgs/nixpkgs-26.11pre1085827.aa48d3470809/nixexprs.tar.xz?narHash=sha256-R4B%2BRRYmze9htmPZ8xeF19mchTSH99GdaqanKCW8CF8%3D»/lib/customisation.nix:416:11:
          415|         // {
          416|           drvPath =
             |           ^
          417|             assert condition;

       … while calling the 'derivationStrict' builtin
         at «nix-internal»/derivation-internal.nix:37:12:
           36|
           37|   strict = derivationStrict drvAttrs;
             |            ^
           38|

       … while evaluating the option `driverConfiguration.vlans':

       … while evaluating definitions from `/nix/store/vlhb7haagkjabf20g1vg9kxi53fcpi17-source/nixos/lib/testing/driver-configuration.nix':

       … while evaluating the option `containers.server.networking.interfaces':

       … while evaluating definitions from `/nix/store/vlhb7haagkjabf20g1vg9kxi53fcpi17-source/nixos/modules/hardware/facter/networking':

       … while evaluating the option `containers.server.hardware.facter.enable':

       … while evaluating the option `containers.server.hardware.facter.report':

       … while evaluating the option `containers.server.hardware.facter.reportPath':

       … while evaluating definitions from `/nix/store/prsp9i0g7kp2acraws2bg3yk57ad0nxm-source/nixosModules/clanCore/nixos-facter.nix':

       (stack trace truncated; use '--show-trace' to show the full, detailed trace)

       error: build of '/nix/store/hijqbkrw6bdhd7i3nl64xzd4ldkxna0g-merged-test-dir-dyndns.drv^out' failed: error: error: gRPC AddMultipleToStore on 'nix-store.geninf.io:50051' failed: error: path '/nix/store/7w43kv9n44l91xjg9x0pmqqldk6k95pb-vm' is required, but there is no substituter that can build it
failed eval checks.x86_64-linux.garage —
error: … while evaluating the attribute 'drvPath' at «https://releases.nixos.org/nixpkgs/nixpkgs-26.11pre1085827.aa48d3470809/nixexprs.tar.xz?na …
error:
       … while evaluating the attribute 'drvPath'
         at «https://releases.nixos.org/nixpkgs/nixpkgs-26.11pre1085827.aa48d3470809/nixexprs.tar.xz?narHash=sha256-R4B%2BRRYmze9htmPZ8xeF19mchTSH99GdaqanKCW8CF8%3D»/lib/customisation.nix:416:11:
          415|         // {
          416|           drvPath =
             |           ^
          417|             assert condition;

       … while calling the 'derivationStrict' builtin
         at «nix-internal»/derivation-internal.nix:37:12:
           36|
           37|   strict = derivationStrict drvAttrs;
             |            ^
           38|

       … while evaluating the option `driverConfiguration.vlans':

       … while evaluating definitions from `/nix/store/vlhb7haagkjabf20g1vg9kxi53fcpi17-source/nixos/lib/testing/driver-configuration.nix':

       … while evaluating the option `containers.server.networking.interfaces':

       … while evaluating definitions from `/nix/store/vlhb7haagkjabf20g1vg9kxi53fcpi17-source/nixos/modules/hardware/facter/networking':

       … while evaluating the option `containers.server.hardware.facter.enable':

       … while evaluating the option `containers.server.hardware.facter.report':

       … while evaluating the option `containers.server.hardware.facter.reportPath':

       … while evaluating definitions from `/nix/store/prsp9i0g7kp2acraws2bg3yk57ad0nxm-source/nixosModules/clanCore/nixos-facter.nix':

       (stack trace truncated; use '--show-trace' to show the full, detailed trace)

       error: build of '/nix/store/hyijhzy1ws3zn2n62vxpx45kps0b8l2m-merged-test-dir-garage.drv^out' failed: error: gave up after 9 reschedules
failed eval checks.x86_64-linux.matrix-synapse —
error: … while evaluating the attribute 'drvPath' at «https://releases.nixos.org/nixpkgs/nixpkgs-26.11pre1085827.aa48d3470809/nixexprs.tar.xz?na …
error:
       … while evaluating the attribute 'drvPath'
         at «https://releases.nixos.org/nixpkgs/nixpkgs-26.11pre1085827.aa48d3470809/nixexprs.tar.xz?narHash=sha256-R4B%2BRRYmze9htmPZ8xeF19mchTSH99GdaqanKCW8CF8%3D»/lib/customisation.nix:416:11:
          415|         // {
          416|           drvPath =
             |           ^
          417|             assert condition;

       … while calling the 'derivationStrict' builtin
         at «nix-internal»/derivation-internal.nix:37:12:
           36|
           37|   strict = derivationStrict drvAttrs;
             |            ^
           38|

       … while evaluating the option `driverConfiguration.vlans':

       … while evaluating definitions from `/nix/store/vlhb7haagkjabf20g1vg9kxi53fcpi17-source/nixos/lib/testing/driver-configuration.nix':

       … while evaluating the option `containers.machine.networking.interfaces':

       … while evaluating definitions from `/nix/store/vlhb7haagkjabf20g1vg9kxi53fcpi17-source/nixos/modules/hardware/facter/networking':

       … while evaluating the option `containers.machine.hardware.facter.enable':

       … while evaluating the option `containers.machine.hardware.facter.report':

       … while evaluating the option `containers.machine.hardware.facter.reportPath':

       … while evaluating definitions from `/nix/store/prsp9i0g7kp2acraws2bg3yk57ad0nxm-source/nixosModules/clanCore/nixos-facter.nix':

       (stack trace truncated; use '--show-trace' to show the full, detailed trace)

       error: build of '/nix/store/sdl93209s82p5xhn4v9294pv3hf185c5-merged-test-dir-matrix-synapse.drv^out' failed: error: error: gRPC AddMultipleToStore on 'nix-store.geninf.io:50051' failed: error: path '/nix/store/x5gbvxpcd4fslj5fvg5hrghf6hqyrqj1-generator-matrix-password-someuser.drv' is required, but there is no substituter that can build it
failed eval checks.x86_64-linux.monitoring —
error: … while evaluating the attribute 'drvPath' at «https://releases.nixos.org/nixpkgs/nixpkgs-26.11pre1085827.aa48d3470809/nixexprs.tar.xz?na …
error:
       … while evaluating the attribute 'drvPath'
         at «https://releases.nixos.org/nixpkgs/nixpkgs-26.11pre1085827.aa48d3470809/nixexprs.tar.xz?narHash=sha256-R4B%2BRRYmze9htmPZ8xeF19mchTSH99GdaqanKCW8CF8%3D»/lib/customisation.nix:416:11:
          415|         // {
          416|           drvPath =
             |           ^
          417|             assert condition;

       … while calling the 'derivationStrict' builtin
         at «nix-internal»/derivation-internal.nix:37:12:
           36|
           37|   strict = derivationStrict drvAttrs;
             |            ^
           38|

       … while evaluating the option `driverConfiguration.vlans':

       … while evaluating definitions from `/nix/store/vlhb7haagkjabf20g1vg9kxi53fcpi17-source/nixos/lib/testing/driver-configuration.nix':

       … while evaluating the option `containers.machine1.networking.interfaces':

       … while evaluating definitions from `/nix/store/vlhb7haagkjabf20g1vg9kxi53fcpi17-source/nixos/modules/hardware/facter/networking':

       … while evaluating the option `containers.machine1.hardware.facter.enable':

       … while evaluating the option `containers.machine1.hardware.facter.report':

       … while evaluating the option `containers.machine1.hardware.facter.reportPath':

       … while evaluating definitions from `/nix/store/prsp9i0g7kp2acraws2bg3yk57ad0nxm-source/nixosModules/clanCore/nixos-facter.nix':

       (stack trace truncated; use '--show-trace' to show the full, detailed trace)

       error: build of '/nix/store/pk6c6n73k6gbg9idc748ca11w67cxmwj-merged-test-dir-monitoring.drv^out' failed: error: error: gRPC AddMultipleToStore on 'nix-store.geninf.io:50051' failed: error: path '/nix/store/rnm3xf3acp6hmlvbf6zvydjnp419nlch-generator-mimir-auth.drv' is required, but there is no substituter that can build it
failed eval checks.x86_64-linux.ncps —
error: … while evaluating the attribute 'drvPath' at «https://releases.nixos.org/nixpkgs/nixpkgs-26.11pre1085827.aa48d3470809/nixexprs.tar.xz?na …
error:
       … while evaluating the attribute 'drvPath'
         at «https://releases.nixos.org/nixpkgs/nixpkgs-26.11pre1085827.aa48d3470809/nixexprs.tar.xz?narHash=sha256-R4B%2BRRYmze9htmPZ8xeF19mchTSH99GdaqanKCW8CF8%3D»/lib/customisation.nix:416:11:
          415|         // {
          416|           drvPath =
             |           ^
          417|             assert condition;

       … while calling the 'derivationStrict' builtin
         at «nix-internal»/derivation-internal.nix:37:12:
           36|
           37|   strict = derivationStrict drvAttrs;
             |            ^
           38|

       … while evaluating the option `driverConfiguration.vlans':

       … while evaluating definitions from `/nix/store/vlhb7haagkjabf20g1vg9kxi53fcpi17-source/nixos/lib/testing/driver-configuration.nix':

       … while evaluating the option `nodes.alice.networking.interfaces':

       … while evaluating definitions from `/nix/store/vlhb7haagkjabf20g1vg9kxi53fcpi17-source/nixos/modules/hardware/facter/networking':

       … while evaluating the option `nodes.alice.hardware.facter.enable':

       … while evaluating the option `nodes.alice.hardware.facter.report':

       … while evaluating the option `nodes.alice.hardware.facter.reportPath':

       … while evaluating definitions from `/nix/store/prsp9i0g7kp2acraws2bg3yk57ad0nxm-source/nixosModules/clanCore/nixos-facter.nix':

       (stack trace truncated; use '--show-trace' to show the full, detailed trace)

       error: build of '/nix/store/n45h6kvx18h3iigq74lv8a1gyc50kwma-merged-test-dir-ncps.drv^out' failed: error: error: gRPC BuildDerivation on 'nix-store.geninf.io:50051' failed: build-x86-01: missing: /nix/store/n45h6kvx18h3iigq74lv8a1gyc50kwma-merged-test-dir-ncps.drv
failed eval checks.x86_64-linux.service-dummy-test —
error: … while evaluating the attribute 'drvPath' at «https://releases.nixos.org/nixpkgs/nixpkgs-26.11pre1085827.aa48d3470809/nixexprs.tar.xz?na …
error:
       … while evaluating the attribute 'drvPath'
         at «https://releases.nixos.org/nixpkgs/nixpkgs-26.11pre1085827.aa48d3470809/nixexprs.tar.xz?narHash=sha256-R4B%2BRRYmze9htmPZ8xeF19mchTSH99GdaqanKCW8CF8%3D»/lib/customisation.nix:416:11:
          415|         // {
          416|           drvPath =
             |           ^
          417|             assert condition;

       … while calling the 'derivationStrict' builtin
         at «nix-internal»/derivation-internal.nix:37:12:
           36|
           37|   strict = derivationStrict drvAttrs;
             |            ^
           38|

       … while evaluating the option `driverConfiguration.vlans':

       … while evaluating definitions from `/nix/store/vlhb7haagkjabf20g1vg9kxi53fcpi17-source/nixos/lib/testing/driver-configuration.nix':

       … while evaluating the option `containers.admin1.networking.interfaces':

       … while evaluating definitions from `/nix/store/vlhb7haagkjabf20g1vg9kxi53fcpi17-source/nixos/modules/hardware/facter/networking':

       … while evaluating the option `containers.admin1.hardware.facter.enable':

       … while evaluating the option `containers.admin1.hardware.facter.report':

       … while evaluating the option `containers.admin1.hardware.facter.reportPath':

       … while evaluating definitions from `/nix/store/prsp9i0g7kp2acraws2bg3yk57ad0nxm-source/nixosModules/clanCore/nixos-facter.nix':

       (stack trace truncated; use '--show-trace' to show the full, detailed trace)

       error: build of '/nix/store/czlliyn8fcyjsg46j3ls7fyn7m0hwb2v-merged-test-dir-service-dummy-test.drv^out' failed: error: error: gRPC BuildDerivation on 'nix-store.geninf.io:50051' failed: build-x86-01: missing: /nix/store/czlliyn8fcyjsg46j3ls7fyn7m0hwb2v-merged-test-dir-service-dummy-test.drv
failed eval checks.x86_64-linux.service-dummy-test-from-flake —
error: … while evaluating the attribute 'drvPath' at «https://releases.nixos.org/nixpkgs/nixpkgs-26.11pre1085827.aa48d3470809/nixexprs.tar.xz?na …
error:
       … while evaluating the attribute 'drvPath'
         at «https://releases.nixos.org/nixpkgs/nixpkgs-26.11pre1085827.aa48d3470809/nixexprs.tar.xz?narHash=sha256-R4B%2BRRYmze9htmPZ8xeF19mchTSH99GdaqanKCW8CF8%3D»/lib/customisation.nix:416:11:
          415|         // {
          416|           drvPath =
             |           ^
          417|             assert condition;

       … while calling the 'derivationStrict' builtin
         at «nix-internal»/derivation-internal.nix:37:12:
           36|
           37|   strict = derivationStrict drvAttrs;
             |            ^
           38|

       … while evaluating the option `driverConfiguration.vlans':

       … while evaluating definitions from `/nix/store/vlhb7haagkjabf20g1vg9kxi53fcpi17-source/nixos/lib/testing/driver-configuration.nix':

       … while evaluating the option `containers.admin1.networking.interfaces':

       … while evaluating definitions from `/nix/store/vlhb7haagkjabf20g1vg9kxi53fcpi17-source/nixos/modules/hardware/facter/networking':

       … while evaluating the option `containers.admin1.hardware.facter.enable':

       … while evaluating the option `containers.admin1.hardware.facter.report':

       … while evaluating the option `containers.admin1.hardware.facter.reportPath':

       … while evaluating definitions from `/nix/store/prsp9i0g7kp2acraws2bg3yk57ad0nxm-source/nixosModules/clanCore/nixos-facter.nix':

       (stack trace truncated; use '--show-trace' to show the full, detailed trace)

       error: build of '/nix/store/zgdpzhqa3sxqx7fgzv2k6pkhz7jcmz6j-merged-test-dir-service-dummy-test-from-flake.drv^out' failed: error: error: gRPC BuildDerivation on 'nix-store.geninf.io:50051' failed: build-x86-01: missing: /nix/store/zgdpzhqa3sxqx7fgzv2k6pkhz7jcmz6j-merged-test-dir-service-dummy-test-from-flake.drv
failed eval checks.x86_64-linux.users —
error: … while evaluating the attribute 'drvPath' at «https://releases.nixos.org/nixpkgs/nixpkgs-26.11pre1085827.aa48d3470809/nixexprs.tar.xz?na …
error:
       … while evaluating the attribute 'drvPath'
         at «https://releases.nixos.org/nixpkgs/nixpkgs-26.11pre1085827.aa48d3470809/nixexprs.tar.xz?narHash=sha256-R4B%2BRRYmze9htmPZ8xeF19mchTSH99GdaqanKCW8CF8%3D»/lib/customisation.nix:416:11:
          415|         // {
          416|           drvPath =
             |           ^
          417|             assert condition;

       … while calling the 'derivationStrict' builtin
         at «nix-internal»/derivation-internal.nix:37:12:
           36|
           37|   strict = derivationStrict drvAttrs;
             |            ^
           38|

       … while evaluating the option `driverConfiguration.vlans':

       … while evaluating definitions from `/nix/store/vlhb7haagkjabf20g1vg9kxi53fcpi17-source/nixos/lib/testing/driver-configuration.nix':

       … while evaluating the option `containers.server.networking.interfaces':

       … while evaluating definitions from `/nix/store/vlhb7haagkjabf20g1vg9kxi53fcpi17-source/nixos/modules/hardware/facter/networking':

       … while evaluating the option `containers.server.hardware.facter.enable':

       … while evaluating the option `containers.server.hardware.facter.report':

       … while evaluating the option `containers.server.hardware.facter.reportPath':

       … while evaluating definitions from `/nix/store/prsp9i0g7kp2acraws2bg3yk57ad0nxm-source/nixosModules/clanCore/nixos-facter.nix':

       (stack trace truncated; use '--show-trace' to show the full, detailed trace)

       error: build of '/nix/store/5jqa0ccazzz79ffqwxs63ag4wbmw6r2c-merged-test-dir-users.drv^out' failed: error: gave up after 9 reschedules
failed eval checks.x86_64-linux.zerotier —
error: … while evaluating the attribute 'drvPath' at «https://releases.nixos.org/nixpkgs/nixpkgs-26.11pre1085827.aa48d3470809/nixexprs.tar.xz?na …
error:
       … while evaluating the attribute 'drvPath'
         at «https://releases.nixos.org/nixpkgs/nixpkgs-26.11pre1085827.aa48d3470809/nixexprs.tar.xz?narHash=sha256-R4B%2BRRYmze9htmPZ8xeF19mchTSH99GdaqanKCW8CF8%3D»/lib/customisation.nix:416:11:
          415|         // {
          416|           drvPath =
             |           ^
          417|             assert condition;

       … while calling the 'derivationStrict' builtin
         at «nix-internal»/derivation-internal.nix:37:12:
           36|
           37|   strict = derivationStrict drvAttrs;
             |            ^
           38|

       … while evaluating the option `driverConfiguration.vlans':

       … while evaluating definitions from `/nix/store/vlhb7haagkjabf20g1vg9kxi53fcpi17-source/nixos/lib/testing/driver-configuration.nix':

       … while evaluating the option `nodes.controller.networking.interfaces':

       … while evaluating definitions from `/nix/store/vlhb7haagkjabf20g1vg9kxi53fcpi17-source/nixos/modules/hardware/facter/networking':

       … while evaluating the option `nodes.controller.hardware.facter.enable':

       … while evaluating the option `nodes.controller.hardware.facter.report':

       … while evaluating the option `nodes.controller.hardware.facter.reportPath':

       … while evaluating definitions from `/nix/store/prsp9i0g7kp2acraws2bg3yk57ad0nxm-source/nixosModules/clanCore/nixos-facter.nix':

       (stack trace truncated; use '--show-trace' to show the full, detailed trace)

       error: build of '/nix/store/s51axixpnzcwgjid3rn3hdbphbh02zd2-merged-test-dir-zerotier.drv^out' failed: error: gave up after 9 reschedules
failed eval checks.x86_64-linux.zerotier-multi-instance —
error: … while evaluating the attribute 'drvPath' at «https://releases.nixos.org/nixpkgs/nixpkgs-26.11pre1085827.aa48d3470809/nixexprs.tar.xz?na …
error:
       … while evaluating the attribute 'drvPath'
         at «https://releases.nixos.org/nixpkgs/nixpkgs-26.11pre1085827.aa48d3470809/nixexprs.tar.xz?narHash=sha256-R4B%2BRRYmze9htmPZ8xeF19mchTSH99GdaqanKCW8CF8%3D»/lib/customisation.nix:416:11:
          415|         // {
          416|           drvPath =
             |           ^
          417|             assert condition;

       … while calling the 'derivationStrict' builtin
         at «nix-internal»/derivation-internal.nix:37:12:
           36|
           37|   strict = derivationStrict drvAttrs;
             |            ^
           38|

       … while evaluating the option `driverConfiguration.vlans':

       … while evaluating definitions from `/nix/store/vlhb7haagkjabf20g1vg9kxi53fcpi17-source/nixos/lib/testing/driver-configuration.nix':

       … while evaluating the option `nodes.alpha.networking.interfaces':

       … while evaluating definitions from `/nix/store/vlhb7haagkjabf20g1vg9kxi53fcpi17-source/nixos/modules/hardware/facter/networking':

       … while evaluating the option `nodes.alpha.hardware.facter.enable':

       … while evaluating the option `nodes.alpha.hardware.facter.report':

       … while evaluating the option `nodes.alpha.hardware.facter.reportPath':

       … while evaluating definitions from `/nix/store/prsp9i0g7kp2acraws2bg3yk57ad0nxm-source/nixosModules/clanCore/nixos-facter.nix':

       (stack trace truncated; use '--show-trace' to show the full, detailed trace)

       error: build of '/nix/store/6hg0vipg9pla54dgnknx7jn1gbzmwd8r-merged-test-dir-zerotier-multi-instance.drv^out' failed: error: error: gRPC AddMultipleToStore on 'nix-store.geninf.io:50051' failed: error: path '/nix/store/h6x2fl501pridikljhsbh4y5vhamza9x-generator-zerotier-ip-beta-net-b.drv' is required, but there is no substituter that can build it
22 succeeded ⚠ 1
68 already built
skipped attributes
status attribute duration
loading…