nixbot

builds

clan/clan-core build #941 failed

branch 26.05 · PR #8212 · commit 2bfe5e9da0 · · took 10m 23s · eval 1m 36s

eval warnings 50 kinds · 189 occurrences
  • error …-merged-test-dir-borgbackup.drv: gi-build-x86-02: gi-build-x86-02: input not substitutable: error: path '/nix/store/…-test-vars-generated' is required, but there is no substituter that can build it, asking the scheduler again ×6
  • error …-merged-test-dir-data-mesher.drv: error: gRPC BuildDerivation on 'nix-store.geninf.io:50051' failed: build-x86-01: missing: /nix/store/…-merged-test-dir-data-mesher.drv ×2
  • error ×41
  • error build of '/nix/store/…-merged-test-dir-data-mesher.drv^out' failed: error: error: gRPC BuildDerivation on 'nix-store.geninf.io:50051' failed: build-x86-01: missing: /nix/store/…-merged-test-dir-data-mesher.drv ×2
  • error …-merged-test-dir-certificates.drv: error: gRPC BuildDerivation on 'nix-store.geninf.io:50051' failed: build-x86-01: missing: /nix/store/…-merged-test-dir-certificates.drv ×1
  • error build of '/nix/store/…-merged-test-dir-certificates.drv^out' failed: error: error: gRPC BuildDerivation on 'nix-store.geninf.io:50051' failed: build-x86-01: missing: /nix/store/…-merged-test-dir-certificates.drv ×1
  • error …-merged-test-dir-borgbackup.drv: error: gRPC BuildDerivation on 'nix-store.geninf.io:50051' failed: build-x86-01: missing: /nix/store/…-merged-test-dir-borgbackup.drv ×2
  • error build of '/nix/store/…-merged-test-dir-borgbackup.drv^out' failed: error: error: gRPC BuildDerivation on 'nix-store.geninf.io:50051' failed: build-x86-01: missing: /nix/store/…-merged-test-dir-borgbackup.drv ×2
  • error …-merged-test-dir-dm-dns.drv: gi-build-x86-02: gi-build-x86-02: input not substitutable: error: path '/nix/store/…-test-vars-generated' is required, but there is no substituter that can build it, asking the scheduler again ×2
  • error …-merged-test-dir-garage.drv: gi-build-x86-02: gi-build-x86-02: input not substitutable: error: path '/nix/store/…-test-vars-generated' is required, but there is no substituter that can build it, asking the scheduler again ×6
  • error …-merged-test-dir-service-machine-id.drv: build-x86-01: build-x86-01: input not substitutable: error: path '/nix/store/…-test-vars-generated' is required, but there is no substituter that can build it, asking the scheduler again ×7
  • error …-merged-test-dir-service-machine-id.drv: gi-build-x86-02: gi-build-x86-02: input not substitutable: error: path '/nix/store/…-test-vars-generated' is required, but there is no substituter that can build it, asking the scheduler again ×11
  • error …-merged-test-dir-dm-dns.drv: error: gRPC BuildDerivation on 'nix-store.geninf.io:50051' failed: build-x86-01: missing: /nix/store/…-merged-test-dir-dm-dns.drv ×2
  • error build of '/nix/store/…-merged-test-dir-dm-dns.drv^out' failed: error: error: gRPC BuildDerivation on 'nix-store.geninf.io:50051' failed: build-x86-01: missing: /nix/store/…-merged-test-dir-dm-dns.drv ×2
  • error …-merged-test-dir-mycelium.drv: gi-build-x86-02: gi-build-x86-02: input not substitutable: error: path '/nix/store/…-test-vars-generated' is required, but there is no substituter that can build it, asking the scheduler again ×4
  • error …-merged-test-dir-monitoring.drv: gi-build-x86-02: gi-build-x86-02: input not substitutable: error: path '/nix/store/…-test-vars-generated' is required, but there is no substituter that can build it, asking the scheduler again ×11
  • error …-merged-test-dir-garage.drv: error: gRPC BuildDerivation on 'nix-store.geninf.io:50051' failed: build-x86-01: missing: /nix/store/…-merged-test-dir-garage.drv ×2
  • error build of '/nix/store/…-merged-test-dir-garage.drv^out' failed: error: error: gRPC BuildDerivation on 'nix-store.geninf.io:50051' failed: build-x86-01: missing: /nix/store/…-merged-test-dir-garage.drv ×2
  • error …-merged-test-dir-nixos-test-password-store-mounts.drv: gi-build-x86-02: gi-build-x86-02: input not substitutable: error: path '/nix/store/…-test-vars-generated' is required, but there is no substituter that can build it, asking the scheduler again ×15
  • error …-merged-test-dir-matrix-synapse.drv: gi-build-x86-02: gi-build-x86-02: input not substitutable: error: path '/nix/store/…-test-vars-generated' is required, but there is no substituter that can build it, asking the scheduler again ×4
  • error …-merged-test-dir-nixos-test-password-store-mounts.drv: build-x86-01: build-x86-01: input not substitutable: error: path '/nix/store/…-test-vars-generated' is required, but there is no substituter that can build it, asking the scheduler again ×3
  • error …-merged-test-dir-mycelium.drv: error: gRPC BuildDerivation on 'nix-store.geninf.io:50051' failed: build-x86-01: missing: /nix/store/…-merged-test-dir-mycelium.drv ×2
  • error build of '/nix/store/…-merged-test-dir-mycelium.drv^out' failed: error: error: gRPC BuildDerivation on 'nix-store.geninf.io:50051' failed: build-x86-01: missing: /nix/store/…-merged-test-dir-mycelium.drv ×2
  • error …-merged-test-dir-ncps.drv: gi-build-x86-02: gi-build-x86-02: input not substitutable: error: path '/nix/store/…-test-vars-generated' is required, but there is no substituter that can build it, asking the scheduler again ×2
  • error …-merged-test-dir-monitoring.drv: error: gRPC BuildDerivation on 'nix-store.geninf.io:50051' failed: build-x86-01: missing: /nix/store/…-merged-test-dir-monitoring.drv ×1
  • error build of '/nix/store/…-merged-test-dir-monitoring.drv^out' failed: error: error: gRPC BuildDerivation on 'nix-store.geninf.io:50051' failed: build-x86-01: missing: /nix/store/…-merged-test-dir-monitoring.drv ×1
  • error build of '/nix/store/…-merged-test-dir-service-machine-id.drv^out' failed: error: gave up after 9 reschedules ×2
  • error …-merged-test-dir-ncps.drv: error: gRPC BuildDerivation on 'nix-store.geninf.io:50051' failed: build-x86-01: missing: /nix/store/…-merged-test-dir-ncps.drv ×2
  • error build of '/nix/store/…-merged-test-dir-ncps.drv^out' failed: error: error: gRPC BuildDerivation on 'nix-store.geninf.io:50051' failed: build-x86-01: missing: /nix/store/…-merged-test-dir-ncps.drv ×2
  • error …-merged-test-dir-matrix-synapse.drv: error: gRPC BuildDerivation on 'nix-store.geninf.io:50051' failed: build-x86-01: missing: /nix/store/…-merged-test-dir-matrix-synapse.drv ×2
  • error build of '/nix/store/…-merged-test-dir-matrix-synapse.drv^out' failed: error: error: gRPC BuildDerivation on 'nix-store.geninf.io:50051' failed: build-x86-01: missing: /nix/store/…-merged-test-dir-matrix-synapse.drv ×2
  • error build of '/nix/store/…-merged-test-dir-nixos-test-password-store-mounts.drv^out' failed: error: gave up after 9 reschedules ×2
  • error …-merged-test-dir-service-dummy-test.drv: gi-build-x86-02: gi-build-x86-02: input not substitutable: error: path '/nix/store/…-test-vars-generated' is required, but there is no substituter that can build it, asking the scheduler again ×4
  • error …-merged-test-dir-pki.drv: error: gRPC BuildDerivation on 'nix-store.geninf.io:50051' failed: build-x86-01: missing: /nix/store/…-merged-test-dir-pki.drv ×2
  • error build of '/nix/store/…-merged-test-dir-pki.drv^out' failed: error: error: gRPC BuildDerivation on 'nix-store.geninf.io:50051' failed: build-x86-01: missing: /nix/store/…-merged-test-dir-pki.drv ×2
  • error …-merged-test-dir-clan-test-p2p-ssh-iroh.drv: gi-build-x86-02: gi-build-x86-02: input not substitutable: error: path '/nix/store/…-test-vars-generated' is required, but there is no substituter that can build it, asking the scheduler again ×4
  • error …-merged-test-dir-service-dummy-test.drv: error: gRPC BuildDerivation on 'nix-store.geninf.io:50051' failed: build-x86-01: missing: /nix/store/…-merged-test-dir-service-dummy-test.drv ×2
  • error build of '/nix/store/…-merged-test-dir-service-dummy-test.drv^out' failed: error: error: gRPC BuildDerivation on 'nix-store.geninf.io:50051' failed: build-x86-01: missing: /nix/store/…-merged-test-dir-service-dummy-test.drv ×2
  • error …-merged-test-dir-clan-test-p2p-ssh-iroh.drv: error: gRPC BuildDerivation on 'nix-store.geninf.io:50051' failed: build-x86-01: missing: /nix/store/…-merged-test-dir-clan-test-p2p-ssh-iroh.drv ×2
  • error build of '/nix/store/…-merged-test-dir-clan-test-p2p-ssh-iroh.drv^out' failed: error: error: gRPC BuildDerivation on 'nix-store.geninf.io:50051' failed: build-x86-01: missing: /nix/store/…-merged-test-dir-clan-test-p2p-ssh-iroh.drv ×2
  • error …-merged-test-dir-service-dummy-test-from-flake.drv: gi-build-x86-02: gi-build-x86-02: input not substitutable: error: path '/nix/store/…-test-vars-generated' is required, but there is no substituter that can build it, asking the scheduler again ×1
  • error …-merged-test-dir-service-dummy-test-from-flake.drv: error: gRPC BuildDerivation on 'nix-store.geninf.io:50051' failed: build-x86-01: missing: /nix/store/…-merged-test-dir-service-dummy-test-from-flake.drv ×2
  • error build of '/nix/store/…-merged-test-dir-service-dummy-test-from-flake.drv^out' failed: error: error: gRPC BuildDerivation on 'nix-store.geninf.io:50051' failed: build-x86-01: missing: /nix/store/…-merged-test-dir-service-dummy-test-from-flake.drv ×2
  • error …-merged-test-dir-users.drv: gi-build-x86-02: gi-build-x86-02: input not substitutable: error: path '/nix/store/…-test-vars-generated' is required, but there is no substituter that can build it, asking the scheduler again ×3
  • error …-merged-test-dir-syncthing-service.drv: error: gRPC BuildDerivation on 'nix-store.geninf.io:50051' failed: build-x86-01: missing: /nix/store/…-merged-test-dir-syncthing-service.drv ×2
  • error build of '/nix/store/…-merged-test-dir-syncthing-service.drv^out' failed: error: error: gRPC BuildDerivation on 'nix-store.geninf.io:50051' failed: build-x86-01: missing: /nix/store/…-merged-test-dir-syncthing-service.drv ×2
  • error …-merged-test-dir-users.drv: error: gRPC BuildDerivation on 'nix-store.geninf.io:50051' failed: build-x86-01: missing: /nix/store/…-merged-test-dir-users.drv ×2
  • error build of '/nix/store/…-merged-test-dir-users.drv^out' failed: error: error: gRPC BuildDerivation on 'nix-store.geninf.io:50051' failed: build-x86-01: missing: /nix/store/…-merged-test-dir-users.drv ×2
  • error …-merged-test-dir-wireguard.drv: gi-build-x86-02: gi-build-x86-02: input not substitutable: error: path '/nix/store/…-test-vars-generated' is required, but there is no substituter that can build it, asking the scheduler again ×3
  • error …-merged-test-dir-wireguard.drv: error: gRPC BuildDerivation on 'nix-store.geninf.io:50051' failed: build-x86-01: missing: /nix/store/…-merged-test-dir-wireguard.drv ×2

65 failed
failed attributes
status attribute duration
failed checks.aarch64-darwin.all-packages 2m 2s
setup: warning: ignoring the client-specified setting 'store', because it is a restricted setting and you are not a trusted user warning: 0g5glhyydg8af0k7y2aasp …
setup:
warning: ignoring the client-specified setting 'store', because it is a restricted setting and you are not a trusted user
warning: 0g5glhyydg8af0k7y2aasp3rbmdwp87p-clan-cli-source.drv: no connected, non-draining worker for system 'aarch64-darwin' offers features {}, the workers offer {}, waiting up to 120s for a worker
warning: 8vx96rx3q9y5kf7chijipjzv789qpjiw-clan-cli-source.drv: no connected, non-draining worker for system 'aarch64-darwin' offers features {}, the workers offer {}, waiting up to 120s for a worker
warning: q7kcs4s67705v3af2bhi76c5z91kcigh-clan-core-flake.drv: no connected, non-draining worker for system 'aarch64-darwin' offers features {}, the workers offer {}, waiting up to 120s for a worker
0g5glhyydg8af0k7y2aasp3rbmdwp87p-clan-cli-source.drv: no connected, non-draining worker for system 'aarch64-darwin' offers features {}, the workers offer {}
8vx96rx3q9y5kf7chijipjzv789qpjiw-clan-cli-source.drv: no connected, non-draining worker for system 'aarch64-darwin' offers features {}, the workers offer {}
q7kcs4s67705v3af2bhi76c5z91kcigh-clan-core-flake.drv: no connected, non-draining worker for system 'aarch64-darwin' offers features {}, the workers offer {}
error: dependency 'q7kcs4s67705v3af2bhi76c5z91kcigh-clan-core-flake.drv' failed
failed checks.aarch64-darwin.clan-app-pytest 2m 0s
setup: don't know how to build these paths: /nix/store/fqjlgd0rzfdbdyzk6zr2w3kvhr99qx4p-clan-app-pytest.drv warning: ignoring the client-specified setting 'st …
setup:
don't know how to build these paths:
  /nix/store/fqjlgd0rzfdbdyzk6zr2w3kvhr99qx4p-clan-app-pytest.drv
warning: ignoring the client-specified setting 'store', because it is a restricted setting and you are not a trusted user
warning: 0g5glhyydg8af0k7y2aasp3rbmdwp87p-clan-cli-source.drv: no connected, non-draining worker for system 'aarch64-darwin' offers features {}, the workers offer {}, waiting up to 120s for a worker
0g5glhyydg8af0k7y2aasp3rbmdwp87p-clan-cli-source.drv: no connected, non-draining worker for system 'aarch64-darwin' offers features {}, the workers offer {}
error: dependency 'ppqdcinfasipjyhdrlrwnfq8niw0pbdd-python3-3.13.15-env.drv' failed
failed checks.aarch64-darwin.clan-pytest-with-core 2m 1s
setup: don't know how to build these paths: /nix/store/pxpm7awxskhrg6zc3gxywmyvnjav5xgx-clan-pytest-with-core.drv warning: ignoring the client-specified setti …
setup:
don't know how to build these paths:
  /nix/store/pxpm7awxskhrg6zc3gxywmyvnjav5xgx-clan-pytest-with-core.drv
warning: ignoring the client-specified setting 'store', because it is a restricted setting and you are not a trusted user
warning: 4w0bxxjxxz494ap2pppl82bx67zbxljk-clan-core-flake.drv: no connected, non-draining worker for system 'aarch64-darwin' offers features {}, the workers offer {}, waiting up to 120s for a worker
warning: ss4f1wpqca1q5ll0q3jzykmghx8i8y85-clan-cli-source.drv: no connected, non-draining worker for system 'aarch64-darwin' offers features {}, the workers offer {}, waiting up to 120s for a worker
4w0bxxjxxz494ap2pppl82bx67zbxljk-clan-core-flake.drv: no connected, non-draining worker for system 'aarch64-darwin' offers features {}, the workers offer {}
ss4f1wpqca1q5ll0q3jzykmghx8i8y85-clan-cli-source.drv: no connected, non-draining worker for system 'aarch64-darwin' offers features {}, the workers offer {}
error: dependency '4w0bxxjxxz494ap2pppl82bx67zbxljk-clan-core-flake.drv' failed
failed checks.aarch64-darwin.clan-pytest-without-core 2m 2s
setup: don't know how to build these paths: /nix/store/qrfim1rbf8blyyqfrb8mmpnjsx60akir-clan-pytest-without-core.drv warning: ignoring the client-specified se …
setup:
don't know how to build these paths:
  /nix/store/qrfim1rbf8blyyqfrb8mmpnjsx60akir-clan-pytest-without-core.drv
warning: ignoring the client-specified setting 'store', because it is a restricted setting and you are not a trusted user
warning: ss4f1wpqca1q5ll0q3jzykmghx8i8y85-clan-cli-source.drv: no connected, non-draining worker for system 'aarch64-darwin' offers features {}, the workers offer {}, waiting up to 120s for a worker
ss4f1wpqca1q5ll0q3jzykmghx8i8y85-clan-cli-source.drv: no connected, non-draining worker for system 'aarch64-darwin' offers features {}, the workers offer {}
error: dependency 'ss4f1wpqca1q5ll0q3jzykmghx8i8y85-clan-cli-source.drv' failed
failed checks.aarch64-darwin.devshell 2m 1s
setup: don't know how to build these paths: /nix/store/a2p7lsz60099imqm4bynv527rhwwhbar-check-devshell-not-depends-on-clan-cli.drv warning: ignoring the clien …
setup:
don't know how to build these paths:
  /nix/store/a2p7lsz60099imqm4bynv527rhwwhbar-check-devshell-not-depends-on-clan-cli.drv
warning: ignoring the client-specified setting 'store', because it is a restricted setting and you are not a trusted user
warning: 0g5glhyydg8af0k7y2aasp3rbmdwp87p-clan-cli-source.drv: no connected, non-draining worker for system 'aarch64-darwin' offers features {}, the workers offer {}, waiting up to 120s for a worker
0g5glhyydg8af0k7y2aasp3rbmdwp87p-clan-cli-source.drv: no connected, non-draining worker for system 'aarch64-darwin' offers features {}, the workers offer {}
error: dependency 'jna75qfzkhjzpk2pyc1rhdc1lylizl0d-clan-cli.drv' failed
failed checks.aarch64-darwin.devShell-clan-app 2m 5s
setup: don't know how to build these paths: /nix/store/zdpfh1q26zqw6lkjhaji6vna8znpyhmr-ui.drv warning: ignoring the client-specified setting 'store', because …
setup:
don't know how to build these paths:
  /nix/store/zdpfh1q26zqw6lkjhaji6vna8znpyhmr-ui.drv
warning: ignoring the client-specified setting 'store', because it is a restricted setting and you are not a trusted user
warning: 0g5glhyydg8af0k7y2aasp3rbmdwp87p-clan-cli-source.drv: no connected, non-draining worker for system 'aarch64-darwin' offers features {}, the workers offer {}, waiting up to 120s for a worker
0g5glhyydg8af0k7y2aasp3rbmdwp87p-clan-cli-source.drv: no connected, non-draining worker for system 'aarch64-darwin' offers features {}, the workers offer {}
error: dependency 'j1jinngm146hbzxnjw0362ql5wfa8sk1-python3-3.13.15-env.drv' failed
failed checks.aarch64-darwin.devShell-clan-site 2m 2s
setup: don't know how to build these paths: /nix/store/qnf2v0k27angp0dds6irfmdr36rja8p9-nix-shell.drv warning: ignoring the client-specified setting 'store', …
setup:
don't know how to build these paths:
  /nix/store/qnf2v0k27angp0dds6irfmdr36rja8p9-nix-shell.drv
warning: ignoring the client-specified setting 'store', because it is a restricted setting and you are not a trusted user
warning: 0g5glhyydg8af0k7y2aasp3rbmdwp87p-clan-cli-source.drv: no connected, non-draining worker for system 'aarch64-darwin' offers features {}, the workers offer {}, waiting up to 120s for a worker
0g5glhyydg8af0k7y2aasp3rbmdwp87p-clan-cli-source.drv: no connected, non-draining worker for system 'aarch64-darwin' offers features {}, the workers offer {}
error: dependency '65xwf3031nrb3616kazqk28z65l1xwln-generated-docs.drv' failed
failed checks.aarch64-darwin.eval-tests 2m 9s
setup: j0iib2xj4h3xjx6v8wimagpbqi56rpjx-evalCheck-eval-tests-zerotier.drv: no connected, non-draining worker for system 'aarch64-darwin' offers features {}, the …
setup:
j0iib2xj4h3xjx6v8wimagpbqi56rpjx-evalCheck-eval-tests-zerotier.drv: no connected, non-draining worker for system 'aarch64-darwin' offers features {}, the workers offer {}
j502szvvlilxnq789xasv873bbzli5hx-evalCheck-eval-lib-exports.drv: no connected, non-draining worker for system 'aarch64-darwin' offers features {}, the workers offer {}
jw5wr9ngzli13ff3j25bf4nwa52axw38-evalCheck-eval-vars-backends.drv: no connected, non-draining worker for system 'aarch64-darwin' offers features {}, the workers offer {}
n4mlla0ji8mss71565dij16a1nlhhlbv-evalCheck-eval-lib-relativeDir.drv: no connected, non-draining worker for system 'aarch64-darwin' offers features {}, the workers offer {}
sffhhzwk3dwsa97v0jla74pj0nc5435d-evalCheck-eval-lib-distributedServices.drv: no connected, non-draining worker for system 'aarch64-darwin' offers features {}, the workers offer {}
swl1fryzv6jgphp5a5gyrx960cz6mxy3-evalCheck-eval-tests-syncthing.drv: no connected, non-draining worker for system 'aarch64-darwin' offers features {}, the workers offer {}
wkwsqnrhqgyv3mdmyqfnfl76vkb2ppqm-evalCheck-eval-tests-installer.drv: no connected, non-draining worker for system 'aarch64-darwin' offers features {}, the workers offer {}
error: dependency '2lmlfjbq8y17fhz9nhhn4r00w7y3fdwh-evalCheck-eval-lib-build-clan.drv' failed
failed checks.aarch64-darwin.treefmt 2m 2s
setup: don't know how to build these paths: /nix/store/k5asa2clfa7mfbbg05b57zcn2ry5hg13-treefmt-check.drv warning: ignoring the client-specified setting 'stor …
setup:
don't know how to build these paths:
  /nix/store/k5asa2clfa7mfbbg05b57zcn2ry5hg13-treefmt-check.drv
warning: ignoring the client-specified setting 'store', because it is a restricted setting and you are not a trusted user
warning: k5asa2clfa7mfbbg05b57zcn2ry5hg13-treefmt-check.drv: no connected, non-draining worker for system 'aarch64-darwin' offers features {}, the workers offer {}, waiting up to 120s for a worker
k5asa2clfa7mfbbg05b57zcn2ry5hg13-treefmt-check.drv: no connected, non-draining worker for system 'aarch64-darwin' offers features {}, the workers offer {}
error: no connected, non-draining worker for system 'aarch64-darwin' offers features {}, the workers offer {}
failed checks.aarch64-linux.all-packages 1m 11s
setup: r7dx80nl9w5v1jjdzvyyndnfznmdgj63-clan-cli.drv: build01: build01: input not substitutable: error: path '/nix/store/qhy9dfxfqapakppa3yjja1zkzn8p31sa-python …
setup:
r7dx80nl9w5v1jjdzvyyndnfznmdgj63-clan-cli.drv: build01: build01: input not substitutable: error: path '/nix/store/qhy9dfxfqapakppa3yjja1zkzn8p31sa-python3-3.13.15-env' is required, but there is no substituter that can build it, asking the scheduler again
pg0hcmpq73ja69vv1qhxwy6am4avil46-clan-cli.drv: build01: build01: input not substitutable: error: path '/nix/store/qhy9dfxfqapakppa3yjja1zkzn8p31sa-python3-3.13.15-env' is required, but there is no substituter that can build it, asking the scheduler again
r7dx80nl9w5v1jjdzvyyndnfznmdgj63-clan-cli.drv: build01: build01: input not substitutable: error: path '/nix/store/qhy9dfxfqapakppa3yjja1zkzn8p31sa-python3-3.13.15-env' is required, but there is no substituter that can build it, asking the scheduler again
pg0hcmpq73ja69vv1qhxwy6am4avil46-clan-cli.drv: build01: the build this call attached to did not finish, retry, asking the scheduler again
r7dx80nl9w5v1jjdzvyyndnfznmdgj63-clan-cli.drv: build01: build01: input not substitutable: error: path '/nix/store/qhy9dfxfqapakppa3yjja1zkzn8p31sa-python3-3.13.15-env' is required, but there is no substituter that can build it, asking the scheduler again
pg0hcmpq73ja69vv1qhxwy6am4avil46-clan-cli.drv: build01: build01: input not substitutable: error: path '/nix/store/qhy9dfxfqapakppa3yjja1zkzn8p31sa-python3-3.13.15-env' is required, but there is no substituter that can build it, asking the scheduler again
r7dx80nl9w5v1jjdzvyyndnfznmdgj63-clan-cli.drv: build01: build01: input not substitutable: error: path '/nix/store/qhy9dfxfqapakppa3yjja1zkzn8p31sa-python3-3.13.15-env' is required, but there is no substituter that can build it, asking the scheduler again
error: dependency 'pg0hcmpq73ja69vv1qhxwy6am4avil46-clan-cli.drv' failed
failed eval checks.aarch64-linux.borgbackup —
error: … while evaluating the attribute 'drvPath' at «https://releases.nixos.org/nixos/26.05/nixos-26.05.11045.774debe7a0d1/nixexprs.tar.xz?narH …
error:
       … while evaluating the attribute 'drvPath'
         at «https://releases.nixos.org/nixos/26.05/nixos-26.05.11045.774debe7a0d1/nixexprs.tar.xz?narHash=sha256-S5MjznoY0gbQbcANPLz5RYjg%2B5/WQmFRgNbHcP%2Bydcg%3D»/lib/customisation.nix:427:7:
          426|     // {
          427|       drvPath =
             |       ^
          428|         assert condition;

       … while calling the 'derivationStrict' builtin
         at «nix-internal»/derivation-internal.nix:37:12:
           36|
           37|   strict = derivationStrict drvAttrs;
             |            ^
           38|

       … while evaluating the option `nodes.clientone.networking.interfaces':

       … while evaluating definitions from `/nix/store/csk881ggvmifg4qf1cal0r1ffflbmlhp-source/nixos/modules/hardware/facter/networking':

       … while evaluating the option `nodes.clientone.hardware.facter.enable':

       … while evaluating the option `nodes.clientone.hardware.facter.report':

       … while evaluating the option `nodes.clientone.hardware.facter.reportPath':

       … while evaluating definitions from `/nix/store/5hqygz6mbjfcigd522vb486qjqgn7i9w-source/nixosModules/clanCore/nixos-facter.nix':

       (stack trace truncated; use '--show-trace' to show the full, detailed trace)

       error: build of '/nix/store/c20nf5ixxlkl98byh90mdyscphw2i96v-merged-test-dir-borgbackup.drv^out' failed: error: error: gRPC BuildDerivation on 'nix-store.geninf.io:50051' failed: build-x86-01: missing: /nix/store/c20nf5ixxlkl98byh90mdyscphw2i96v-merged-test-dir-borgbackup.drv
failed eval checks.aarch64-linux.certificates —
error: … while evaluating the attribute 'drvPath' at «https://releases.nixos.org/nixos/26.05/nixos-26.05.11045.774debe7a0d1/nixexprs.tar.xz?narH …
error:
       … while evaluating the attribute 'drvPath'
         at «https://releases.nixos.org/nixos/26.05/nixos-26.05.11045.774debe7a0d1/nixexprs.tar.xz?narHash=sha256-S5MjznoY0gbQbcANPLz5RYjg%2B5/WQmFRgNbHcP%2Bydcg%3D»/lib/customisation.nix:427:7:
          426|     // {
          427|       drvPath =
             |       ^
          428|         assert condition;

       … while calling the 'derivationStrict' builtin
         at «nix-internal»/derivation-internal.nix:37:12:
           36|
           37|   strict = derivationStrict drvAttrs;
             |            ^
           38|

       … while evaluating the option `nodes.ca.networking.interfaces':

       … while evaluating definitions from `/nix/store/csk881ggvmifg4qf1cal0r1ffflbmlhp-source/nixos/modules/hardware/facter/networking':

       … while evaluating the option `nodes.ca.hardware.facter.enable':

       … while evaluating the option `nodes.ca.hardware.facter.report':

       … while evaluating the option `nodes.ca.hardware.facter.reportPath':

       … while evaluating definitions from `/nix/store/5hqygz6mbjfcigd522vb486qjqgn7i9w-source/nixosModules/clanCore/nixos-facter.nix':

       (stack trace truncated; use '--show-trace' to show the full, detailed trace)

       error: build of '/nix/store/2sfs7lp26wpjls0kgvikwkqadn400rph-merged-test-dir-certificates.drv^out' failed: error: error: gRPC BuildDerivation on 'nix-store.geninf.io:50051' failed: build-x86-01: missing: /nix/store/2sfs7lp26wpjls0kgvikwkqadn400rph-merged-test-dir-certificates.drv
failed checks.aarch64-linux.clan-app-pytest 1m 5s
setup: r7dx80nl9w5v1jjdzvyyndnfznmdgj63-clan-cli.drv: build01: not scheduled here: r7dx80nl9w5v1jjdzvyyndnfznmdgj63-clan-cli.drv, asking the scheduler again r7d …
setup:
r7dx80nl9w5v1jjdzvyyndnfznmdgj63-clan-cli.drv: build01: not scheduled here: r7dx80nl9w5v1jjdzvyyndnfznmdgj63-clan-cli.drv, asking the scheduler again
r7dx80nl9w5v1jjdzvyyndnfznmdgj63-clan-cli.drv: build01: the build this call attached to did not finish, retry, asking the scheduler again
r7dx80nl9w5v1jjdzvyyndnfznmdgj63-clan-cli.drv: build01: the build this call attached to did not finish, retry, asking the scheduler again
r7dx80nl9w5v1jjdzvyyndnfznmdgj63-clan-cli.drv: build01: the build this call attached to did not finish, retry, asking the scheduler again
r7dx80nl9w5v1jjdzvyyndnfznmdgj63-clan-cli.drv: build01: the build this call attached to did not finish, retry, asking the scheduler again
r7dx80nl9w5v1jjdzvyyndnfznmdgj63-clan-cli.drv: build01: the build this call attached to did not finish, retry, asking the scheduler again
r7dx80nl9w5v1jjdzvyyndnfznmdgj63-clan-cli.drv: build01: build01: input not substitutable: error: path '/nix/store/qhy9dfxfqapakppa3yjja1zkzn8p31sa-python3-3.13.15-env' is required, but there is no substituter that can build it, asking the scheduler again
error: dependency '5xk9k174455g4i97z6pwp0m8h7q0w3ws-python3-3.13.15-env.drv' failed
failed checks.aarch64-linux.clan-pytest-with-core 28s
setup: /nix/store/13vkic2v8zac4m6p38asdhasb3xylv07-zlib-1.3.2.tar.gz /nix/store/6fhxdm9f25c7h86nadfy8qim4h9hq04d-zlib-ng-2.3.3 /nix/store/i8f26lwk8i93hmiy …
setup:
  /nix/store/13vkic2v8zac4m6p38asdhasb3xylv07-zlib-1.3.2.tar.gz
  /nix/store/6fhxdm9f25c7h86nadfy8qim4h9hq04d-zlib-ng-2.3.3
  /nix/store/i8f26lwk8i93hmiyrmsy752m6nwi4pmk-zstd-1.5.7
  /nix/store/j3zlp8gw0674jlwjy1v6g6d08mri7agz-zvbi-0.2.45
  /nix/store/pfns7xmwpx19sr5nyfpigxf22v2xf9h7-zxing-cpp-2.3.0
warning: ignoring the client-specified setting 'store', because it is a restricted setting and you are not a trusted user
65fr9ygf5bskhqw4jznb1qav418bnasj-clan-pytest-with-core.drv: error: gRPC AddMultipleToStore on 'nix-store.geninf.io:50051' failed: error: path '/nix/store/6skwd76b3h16zdxxlzvmsb7jbw2hm6lj-closure-info.drv' is required, but there is no substituter that can build it
error: error: gRPC AddMultipleToStore on 'nix-store.geninf.io:50051' failed: error: path '/nix/store/6skwd76b3h16zdxxlzvmsb7jbw2hm6lj-closure-info.drv' is required, but there is no substituter that can build it
failed checks.aarch64-linux.clan-pytest-without-core 26s
setup: don't know how to build these paths: /nix/store/acb2x6mqimcicffwwyzsixww2wzpq8dr-clan-pytest-without-core.drv warning: ignoring the client-specified se …
setup:
don't know how to build these paths:
  /nix/store/acb2x6mqimcicffwwyzsixww2wzpq8dr-clan-pytest-without-core.drv
warning: ignoring the client-specified setting 'store', because it is a restricted setting and you are not a trusted user
acb2x6mqimcicffwwyzsixww2wzpq8dr-clan-pytest-without-core.drv: error: gRPC AddMultipleToStore on 'nix-store.geninf.io:50051' failed: error: path '/nix/store/1ib56lqznbxil4awa7rfh3slkawciibm-python3-3.13.15-env.drv' is required, but there is no substituter that can build it
error: error: gRPC AddMultipleToStore on 'nix-store.geninf.io:50051' failed: error: path '/nix/store/1ib56lqznbxil4awa7rfh3slkawciibm-python3-3.13.15-env.drv' is required, but there is no substituter that can build it
failed checks.aarch64-linux.clan-site-lint 1m 6s
setup: r7dx80nl9w5v1jjdzvyyndnfznmdgj63-clan-cli.drv: build01: build01: input not substitutable: error: path '/nix/store/qhy9dfxfqapakppa3yjja1zkzn8p31sa-python …
setup:
r7dx80nl9w5v1jjdzvyyndnfznmdgj63-clan-cli.drv: build01: build01: input not substitutable: error: path '/nix/store/qhy9dfxfqapakppa3yjja1zkzn8p31sa-python3-3.13.15-env' is required, but there is no substituter that can build it, asking the scheduler again
r7dx80nl9w5v1jjdzvyyndnfznmdgj63-clan-cli.drv: build01: the build this call attached to did not finish, retry, asking the scheduler again
r7dx80nl9w5v1jjdzvyyndnfznmdgj63-clan-cli.drv: build01: the build this call attached to did not finish, retry, asking the scheduler again
r7dx80nl9w5v1jjdzvyyndnfznmdgj63-clan-cli.drv: build01: the build this call attached to did not finish, retry, asking the scheduler again
r7dx80nl9w5v1jjdzvyyndnfznmdgj63-clan-cli.drv: build01: build01: input not substitutable: error: path '/nix/store/qhy9dfxfqapakppa3yjja1zkzn8p31sa-python3-3.13.15-env' is required, but there is no substituter that can build it, asking the scheduler again
r7dx80nl9w5v1jjdzvyyndnfznmdgj63-clan-cli.drv: build01: the build this call attached to did not finish, retry, asking the scheduler again
r7dx80nl9w5v1jjdzvyyndnfznmdgj63-clan-cli.drv: build01: the build this call attached to did not finish, retry, asking the scheduler again
error: dependency 'k8bjq9j9gv5nnzlmv9jia9v5s1vjz0q9-generated-docs.drv' failed
failed checks.aarch64-linux.clan-test-iso 1m 11s
setup: pg0hcmpq73ja69vv1qhxwy6am4avil46-clan-cli.drv: build01: the build this call attached to did not finish, retry, asking the scheduler again lp4sr0hrxcnxx39 …
setup:
pg0hcmpq73ja69vv1qhxwy6am4avil46-clan-cli.drv: build01: the build this call attached to did not finish, retry, asking the scheduler again
lp4sr0hrxcnxx39dall65f2y7z7ybh9j-closure-info.drv: error: gRPC AddMultipleToStore on 'nix-store.geninf.io:50051' failed: error: some references of path '/nix/store/n2p02gjiqfhl4sy08ay55klv7jbz845l-perl-5.42.0-env.drv' could not be realised
pg0hcmpq73ja69vv1qhxwy6am4avil46-clan-cli.drv: build01: build01: input not substitutable: error: path '/nix/store/qhy9dfxfqapakppa3yjja1zkzn8p31sa-python3-3.13.15-env' is required, but there is no substituter that can build it, asking the scheduler again
pg0hcmpq73ja69vv1qhxwy6am4avil46-clan-cli.drv: build01: the build this call attached to did not finish, retry, asking the scheduler again
pg0hcmpq73ja69vv1qhxwy6am4avil46-clan-cli.drv: build01: the build this call attached to did not finish, retry, asking the scheduler again
pg0hcmpq73ja69vv1qhxwy6am4avil46-clan-cli.drv: build01: build01: input not substitutable: error: path '/nix/store/qhy9dfxfqapakppa3yjja1zkzn8p31sa-python3-3.13.15-env' is required, but there is no substituter that can build it, asking the scheduler again
pg0hcmpq73ja69vv1qhxwy6am4avil46-clan-cli.drv: build01: the build this call attached to did not finish, retry, asking the scheduler again
error: dependency '2ck2ack1w4qb7hg13h8xbv4m0pw2ic92-nixos-test-driver-clan-test-iso.drv' failed
failed eval checks.aarch64-linux.data-mesher —
error: … while evaluating the attribute 'drvPath' at «https://releases.nixos.org/nixos/26.05/nixos-26.05.11045.774debe7a0d1/nixexprs.tar.xz?narH …
error:
       … while evaluating the attribute 'drvPath'
         at «https://releases.nixos.org/nixos/26.05/nixos-26.05.11045.774debe7a0d1/nixexprs.tar.xz?narHash=sha256-S5MjznoY0gbQbcANPLz5RYjg%2B5/WQmFRgNbHcP%2Bydcg%3D»/lib/customisation.nix:427:7:
          426|     // {
          427|       drvPath =
             |       ^
          428|         assert condition;

       … while calling the 'derivationStrict' builtin
         at «nix-internal»/derivation-internal.nix:37:12:
           36|
           37|   strict = derivationStrict drvAttrs;
             |            ^
           38|

       … while evaluating the option `nodes.alpha.networking.interfaces':

       … while evaluating definitions from `/nix/store/csk881ggvmifg4qf1cal0r1ffflbmlhp-source/nixos/modules/hardware/facter/networking':

       … while evaluating the option `nodes.alpha.hardware.facter.enable':

       … while evaluating the option `nodes.alpha.hardware.facter.report':

       … while evaluating the option `nodes.alpha.hardware.facter.reportPath':

       … while evaluating definitions from `/nix/store/5hqygz6mbjfcigd522vb486qjqgn7i9w-source/nixosModules/clanCore/nixos-facter.nix':

       (stack trace truncated; use '--show-trace' to show the full, detailed trace)

       error: build of '/nix/store/bisdrchsk95mhvw467p4wq5b2f79msnx-merged-test-dir-data-mesher.drv^out' failed: error: error: gRPC BuildDerivation on 'nix-store.geninf.io:50051' failed: build-x86-01: missing: /nix/store/bisdrchsk95mhvw467p4wq5b2f79msnx-merged-test-dir-data-mesher.drv
failed checks.aarch64-linux.devshell 1m 5s
setup: r7dx80nl9w5v1jjdzvyyndnfznmdgj63-clan-cli.drv: build01: build01: input not substitutable: error: path '/nix/store/qhy9dfxfqapakppa3yjja1zkzn8p31sa-python …
setup:
r7dx80nl9w5v1jjdzvyyndnfznmdgj63-clan-cli.drv: build01: build01: input not substitutable: error: path '/nix/store/qhy9dfxfqapakppa3yjja1zkzn8p31sa-python3-3.13.15-env' is required, but there is no substituter that can build it, asking the scheduler again
r7dx80nl9w5v1jjdzvyyndnfznmdgj63-clan-cli.drv: build01: build01: input not substitutable: error: path '/nix/store/qhy9dfxfqapakppa3yjja1zkzn8p31sa-python3-3.13.15-env' is required, but there is no substituter that can build it, asking the scheduler again
r7dx80nl9w5v1jjdzvyyndnfznmdgj63-clan-cli.drv: build01: the build this call attached to did not finish, retry, asking the scheduler again
r7dx80nl9w5v1jjdzvyyndnfznmdgj63-clan-cli.drv: build01: the build this call attached to did not finish, retry, asking the scheduler again
r7dx80nl9w5v1jjdzvyyndnfznmdgj63-clan-cli.drv: build01: build01: input not substitutable: error: path '/nix/store/qhy9dfxfqapakppa3yjja1zkzn8p31sa-python3-3.13.15-env' is required, but there is no substituter that can build it, asking the scheduler again
r7dx80nl9w5v1jjdzvyyndnfznmdgj63-clan-cli.drv: build01: the build this call attached to did not finish, retry, asking the scheduler again
r7dx80nl9w5v1jjdzvyyndnfznmdgj63-clan-cli.drv: build01: build01: input not substitutable: error: path '/nix/store/qhy9dfxfqapakppa3yjja1zkzn8p31sa-python3-3.13.15-env' is required, but there is no substituter that can build it, asking the scheduler again
error: dependency 'r7dx80nl9w5v1jjdzvyyndnfznmdgj63-clan-cli.drv' failed
failed checks.aarch64-linux.devShell-clan-app 1m 5s
setup: r7dx80nl9w5v1jjdzvyyndnfznmdgj63-clan-cli.drv: build01: the build this call attached to did not finish, retry, asking the scheduler again r7dx80nl9w5v1jj …
setup:
r7dx80nl9w5v1jjdzvyyndnfznmdgj63-clan-cli.drv: build01: the build this call attached to did not finish, retry, asking the scheduler again
r7dx80nl9w5v1jjdzvyyndnfznmdgj63-clan-cli.drv: build01: the build this call attached to did not finish, retry, asking the scheduler again
r7dx80nl9w5v1jjdzvyyndnfznmdgj63-clan-cli.drv: build01: the build this call attached to did not finish, retry, asking the scheduler again
r7dx80nl9w5v1jjdzvyyndnfznmdgj63-clan-cli.drv: build01: build01: input not substitutable: error: path '/nix/store/qhy9dfxfqapakppa3yjja1zkzn8p31sa-python3-3.13.15-env' is required, but there is no substituter that can build it, asking the scheduler again
r7dx80nl9w5v1jjdzvyyndnfznmdgj63-clan-cli.drv: build01: the build this call attached to did not finish, retry, asking the scheduler again
r7dx80nl9w5v1jjdzvyyndnfznmdgj63-clan-cli.drv: build01: the build this call attached to did not finish, retry, asking the scheduler again
r7dx80nl9w5v1jjdzvyyndnfznmdgj63-clan-cli.drv: build01: the build this call attached to did not finish, retry, asking the scheduler again
error: dependency '15kpw1pz6qprqx86n81cjp1ss63hpyqr-python3-3.13.15-env.drv' failed
failed checks.aarch64-linux.devShell-clan-site 1m 6s
setup: r7dx80nl9w5v1jjdzvyyndnfznmdgj63-clan-cli.drv: build01: the build this call attached to did not finish, retry, asking the scheduler again r7dx80nl9w5v1jj …
setup:
r7dx80nl9w5v1jjdzvyyndnfznmdgj63-clan-cli.drv: build01: the build this call attached to did not finish, retry, asking the scheduler again
r7dx80nl9w5v1jjdzvyyndnfznmdgj63-clan-cli.drv: build01: the build this call attached to did not finish, retry, asking the scheduler again
r7dx80nl9w5v1jjdzvyyndnfznmdgj63-clan-cli.drv: build01: the build this call attached to did not finish, retry, asking the scheduler again
r7dx80nl9w5v1jjdzvyyndnfznmdgj63-clan-cli.drv: build01: the build this call attached to did not finish, retry, asking the scheduler again
r7dx80nl9w5v1jjdzvyyndnfznmdgj63-clan-cli.drv: build01: the build this call attached to did not finish, retry, asking the scheduler again
r7dx80nl9w5v1jjdzvyyndnfznmdgj63-clan-cli.drv: build01: the build this call attached to did not finish, retry, asking the scheduler again
r7dx80nl9w5v1jjdzvyyndnfznmdgj63-clan-cli.drv: build01: the build this call attached to did not finish, retry, asking the scheduler again
error: dependency 'k8bjq9j9gv5nnzlmv9jia9v5s1vjz0q9-generated-docs.drv' failed
failed checks.aarch64-linux.devShell-docs 1m 5s
setup: r7dx80nl9w5v1jjdzvyyndnfznmdgj63-clan-cli.drv: build01: the build this call attached to did not finish, retry, asking the scheduler again r7dx80nl9w5v1jj …
setup:
r7dx80nl9w5v1jjdzvyyndnfznmdgj63-clan-cli.drv: build01: the build this call attached to did not finish, retry, asking the scheduler again
r7dx80nl9w5v1jjdzvyyndnfznmdgj63-clan-cli.drv: build01: the build this call attached to did not finish, retry, asking the scheduler again
r7dx80nl9w5v1jjdzvyyndnfznmdgj63-clan-cli.drv: build01: the build this call attached to did not finish, retry, asking the scheduler again
r7dx80nl9w5v1jjdzvyyndnfznmdgj63-clan-cli.drv: build01: the build this call attached to did not finish, retry, asking the scheduler again
r7dx80nl9w5v1jjdzvyyndnfznmdgj63-clan-cli.drv: build01: the build this call attached to did not finish, retry, asking the scheduler again
r7dx80nl9w5v1jjdzvyyndnfznmdgj63-clan-cli.drv: build01: the build this call attached to did not finish, retry, asking the scheduler again
r7dx80nl9w5v1jjdzvyyndnfznmdgj63-clan-cli.drv: build01: the build this call attached to did not finish, retry, asking the scheduler again
error: dependency 'k8bjq9j9gv5nnzlmv9jia9v5s1vjz0q9-generated-docs.drv' failed
failed eval checks.aarch64-linux.dm-dns —
error: … while evaluating the attribute 'drvPath' at «https://releases.nixos.org/nixos/26.05/nixos-26.05.11045.774debe7a0d1/nixexprs.tar.xz?narH …
error:
       … while evaluating the attribute 'drvPath'
         at «https://releases.nixos.org/nixos/26.05/nixos-26.05.11045.774debe7a0d1/nixexprs.tar.xz?narHash=sha256-S5MjznoY0gbQbcANPLz5RYjg%2B5/WQmFRgNbHcP%2Bydcg%3D»/lib/customisation.nix:427:7:
          426|     // {
          427|       drvPath =
             |       ^
          428|         assert condition;

       … while calling the 'derivationStrict' builtin
         at «nix-internal»/derivation-internal.nix:37:12:
           36|
           37|   strict = derivationStrict drvAttrs;
             |            ^
           38|

       … while evaluating the option `nodes.client.networking.interfaces':

       … while evaluating definitions from `/nix/store/csk881ggvmifg4qf1cal0r1ffflbmlhp-source/nixos/modules/hardware/facter/networking':

       … while evaluating the option `nodes.client.hardware.facter.enable':

       … while evaluating the option `nodes.client.hardware.facter.report':

       … while evaluating the option `nodes.client.hardware.facter.reportPath':

       … while evaluating definitions from `/nix/store/5hqygz6mbjfcigd522vb486qjqgn7i9w-source/nixosModules/clanCore/nixos-facter.nix':

       (stack trace truncated; use '--show-trace' to show the full, detailed trace)

       error: build of '/nix/store/yln3f9jkdz1nwbsd4mb869zl8hfcnvyl-merged-test-dir-dm-dns.drv^out' failed: error: error: gRPC BuildDerivation on 'nix-store.geninf.io:50051' failed: build-x86-01: missing: /nix/store/yln3f9jkdz1nwbsd4mb869zl8hfcnvyl-merged-test-dir-dm-dns.drv
failed checks.aarch64-linux.eval-tests 12s
setup: 5fgym6zrra9h213xd3ln30fkzd6mcfrm-evalCheck-eval-vars-backends.drv: error: gRPC AddMultipleToStore on 'nix-store.geninf.io:50051' failed: error: some refe …
setup:
5fgym6zrra9h213xd3ln30fkzd6mcfrm-evalCheck-eval-vars-backends.drv: error: gRPC AddMultipleToStore on 'nix-store.geninf.io:50051' failed: error: some references of path '/nix/store/m1zliyrmawgmkdvw46626rlgv64vqfd9-nix-unit-2.34.2.drv' could not be realised
7cvv6flb995mqlxznfrd1rzw1mpcmffm-evalCheck-eval-lib-build-clan.drv: error: gRPC AddMultipleToStore on 'nix-store.geninf.io:50051' failed: error: some references of path '/nix/store/m1zliyrmawgmkdvw46626rlgv64vqfd9-nix-unit-2.34.2.drv' could not be realised
viak8kjhiqsfg9zpjc2ijgfciaw2dvxr-evalCheck-eval-tests-zerotier.drv: error: gRPC AddMultipleToStore on 'nix-store.geninf.io:50051' failed: error: some references of path '/nix/store/m1zliyrmawgmkdvw46626rlgv64vqfd9-nix-unit-2.34.2.drv' could not be realised
qm9x5b0pyw9gy79m15p4cy784dpl160f-evalCheck-eval-tests-hello-world.drv: error: gRPC AddMultipleToStore on 'nix-store.geninf.io:50051' failed: error: some references of path '/nix/store/m1zliyrmawgmkdvw46626rlgv64vqfd9-nix-unit-2.34.2.drv' could not be realised
6ygm0dfhi3b768v8ymn8rkj0g653287w-evalCheck-eval-lib-distributedServices.drv: error: gRPC AddMultipleToStore on 'nix-store.geninf.io:50051' failed: error: some references of path '/nix/store/m1zliyrmawgmkdvw46626rlgv64vqfd9-nix-unit-2.34.2.drv' could not be realised
jgibbp1ffcg379lk2zclz740wl4pmwg4-evalCheck-eval-tests-types.drv: error: gRPC AddMultipleToStore on 'nix-store.geninf.io:50051' failed: error: some references of path '/nix/store/m1zliyrmawgmkdvw46626rlgv64vqfd9-nix-unit-2.34.2.drv' could not be realised
xiv617865wpcn0skxkvjbnq80i67iw8r-evalCheck-eval-tests-installer.drv: error: gRPC AddMultipleToStore on 'nix-store.geninf.io:50051' failed: error: some references of path '/nix/store/m1zliyrmawgmkdvw46626rlgv64vqfd9-nix-unit-2.34.2.drv' could not be realised
error: dependency 'km48bji9fnka80vj7gygda2i75a7vq1z-evalCheck-lib-jsonschema-unit-tests.drv' failed
failed eval checks.aarch64-linux.garage —
error: … while evaluating the attribute 'drvPath' at «https://releases.nixos.org/nixos/26.05/nixos-26.05.11045.774debe7a0d1/nixexprs.tar.xz?narH …
error:
       … while evaluating the attribute 'drvPath'
         at «https://releases.nixos.org/nixos/26.05/nixos-26.05.11045.774debe7a0d1/nixexprs.tar.xz?narHash=sha256-S5MjznoY0gbQbcANPLz5RYjg%2B5/WQmFRgNbHcP%2Bydcg%3D»/lib/customisation.nix:427:7:
          426|     // {
          427|       drvPath =
             |       ^
          428|         assert condition;

       … while calling the 'derivationStrict' builtin
         at «nix-internal»/derivation-internal.nix:37:12:
           36|
           37|   strict = derivationStrict drvAttrs;
             |            ^
           38|

       … while evaluating the option `nodes.server.networking.interfaces':

       … while evaluating definitions from `/nix/store/csk881ggvmifg4qf1cal0r1ffflbmlhp-source/nixos/modules/hardware/facter/networking':

       … while evaluating the option `nodes.server.hardware.facter.enable':

       … while evaluating the option `nodes.server.hardware.facter.report':

       … while evaluating the option `nodes.server.hardware.facter.reportPath':

       … while evaluating definitions from `/nix/store/5hqygz6mbjfcigd522vb486qjqgn7i9w-source/nixosModules/clanCore/nixos-facter.nix':

       (stack trace truncated; use '--show-trace' to show the full, detailed trace)

       error: build of '/nix/store/m5bznfa9ljfbjad6mr813wqn4ncj0h1c-merged-test-dir-garage.drv^out' failed: error: error: gRPC BuildDerivation on 'nix-store.geninf.io:50051' failed: build-x86-01: missing: /nix/store/m5bznfa9ljfbjad6mr813wqn4ncj0h1c-merged-test-dir-garage.drv
failed eval checks.aarch64-linux.machine-id —
error: … while evaluating the attribute 'drvPath' at «https://releases.nixos.org/nixos/26.05/nixos-26.05.11045.774debe7a0d1/nixexprs.tar.xz?narH …
error:
       … while evaluating the attribute 'drvPath'
         at «https://releases.nixos.org/nixos/26.05/nixos-26.05.11045.774debe7a0d1/nixexprs.tar.xz?narHash=sha256-S5MjznoY0gbQbcANPLz5RYjg%2B5/WQmFRgNbHcP%2Bydcg%3D»/lib/customisation.nix:427:7:
          426|     // {
          427|       drvPath =
             |       ^
          428|         assert condition;

       … while calling the 'derivationStrict' builtin
         at «nix-internal»/derivation-internal.nix:37:12:
           36|
           37|   strict = derivationStrict drvAttrs;
             |            ^
           38|

       … while evaluating the option `nodes.server.networking.interfaces':

       … while evaluating definitions from `/nix/store/csk881ggvmifg4qf1cal0r1ffflbmlhp-source/nixos/modules/hardware/facter/networking':

       … while evaluating the option `nodes.server.hardware.facter.enable':

       … while evaluating the option `nodes.server.hardware.facter.report':

       … while evaluating the option `nodes.server.hardware.facter.reportPath':

       … while evaluating definitions from `/nix/store/5hqygz6mbjfcigd522vb486qjqgn7i9w-source/nixosModules/clanCore/nixos-facter.nix':

       (stack trace truncated; use '--show-trace' to show the full, detailed trace)

       error: build of '/nix/store/1aw9g733adh7hh3dcxcs1bmkzhb8izr1-merged-test-dir-service-machine-id.drv^out' failed: error: gave up after 9 reschedules
failed eval checks.aarch64-linux.matrix-synapse —
error: … while evaluating the attribute 'drvPath' at «https://releases.nixos.org/nixos/26.05/nixos-26.05.11045.774debe7a0d1/nixexprs.tar.xz?narH …
error:
       … while evaluating the attribute 'drvPath'
         at «https://releases.nixos.org/nixos/26.05/nixos-26.05.11045.774debe7a0d1/nixexprs.tar.xz?narHash=sha256-S5MjznoY0gbQbcANPLz5RYjg%2B5/WQmFRgNbHcP%2Bydcg%3D»/lib/customisation.nix:427:7:
          426|     // {
          427|       drvPath =
             |       ^
          428|         assert condition;

       … while calling the 'derivationStrict' builtin
         at «nix-internal»/derivation-internal.nix:37:12:
           36|
           37|   strict = derivationStrict drvAttrs;
             |            ^
           38|

       … while evaluating the option `nodes.machine.networking.interfaces':

       … while evaluating definitions from `/nix/store/csk881ggvmifg4qf1cal0r1ffflbmlhp-source/nixos/modules/hardware/facter/networking':

       … while evaluating the option `nodes.machine.hardware.facter.enable':

       … while evaluating the option `nodes.machine.hardware.facter.report':

       … while evaluating the option `nodes.machine.hardware.facter.reportPath':

       … while evaluating definitions from `/nix/store/5hqygz6mbjfcigd522vb486qjqgn7i9w-source/nixosModules/clanCore/nixos-facter.nix':

       (stack trace truncated; use '--show-trace' to show the full, detailed trace)

       error: build of '/nix/store/1k4q4h7b0264nnw73rgmiyag11gv3b9k-merged-test-dir-matrix-synapse.drv^out' failed: error: error: gRPC BuildDerivation on 'nix-store.geninf.io:50051' failed: build-x86-01: missing: /nix/store/1k4q4h7b0264nnw73rgmiyag11gv3b9k-merged-test-dir-matrix-synapse.drv
failed eval checks.aarch64-linux.monitoring —
error: … while evaluating the attribute 'drvPath' at «https://releases.nixos.org/nixos/26.05/nixos-26.05.11045.774debe7a0d1/nixexprs.tar.xz?narH …
error:
       … while evaluating the attribute 'drvPath'
         at «https://releases.nixos.org/nixos/26.05/nixos-26.05.11045.774debe7a0d1/nixexprs.tar.xz?narHash=sha256-S5MjznoY0gbQbcANPLz5RYjg%2B5/WQmFRgNbHcP%2Bydcg%3D»/lib/customisation.nix:427:7:
          426|     // {
          427|       drvPath =
             |       ^
          428|         assert condition;

       … while calling the 'derivationStrict' builtin
         at «nix-internal»/derivation-internal.nix:37:12:
           36|
           37|   strict = derivationStrict drvAttrs;
             |            ^
           38|

       … while evaluating the option `nodes.machine1.networking.interfaces':

       … while evaluating definitions from `/nix/store/csk881ggvmifg4qf1cal0r1ffflbmlhp-source/nixos/modules/hardware/facter/networking':

       … while evaluating the option `nodes.machine1.hardware.facter.enable':

       … while evaluating the option `nodes.machine1.hardware.facter.report':

       … while evaluating the option `nodes.machine1.hardware.facter.reportPath':

       … while evaluating definitions from `/nix/store/5hqygz6mbjfcigd522vb486qjqgn7i9w-source/nixosModules/clanCore/nixos-facter.nix':

       (stack trace truncated; use '--show-trace' to show the full, detailed trace)

       error: build of '/nix/store/w7lsmv9zb3ng21k9akkmgq342l47ylf2-merged-test-dir-monitoring.drv^out' failed: error: error: gRPC BuildDerivation on 'nix-store.geninf.io:50051' failed: build-x86-01: missing: /nix/store/w7lsmv9zb3ng21k9akkmgq342l47ylf2-merged-test-dir-monitoring.drv
failed eval checks.aarch64-linux.mycelium —
error: … while evaluating the attribute 'drvPath' at «https://releases.nixos.org/nixos/26.05/nixos-26.05.11045.774debe7a0d1/nixexprs.tar.xz?narH …
error:
       … while evaluating the attribute 'drvPath'
         at «https://releases.nixos.org/nixos/26.05/nixos-26.05.11045.774debe7a0d1/nixexprs.tar.xz?narHash=sha256-S5MjznoY0gbQbcANPLz5RYjg%2B5/WQmFRgNbHcP%2Bydcg%3D»/lib/customisation.nix:427:7:
          426|     // {
          427|       drvPath =
             |       ^
          428|         assert condition;

       … while calling the 'derivationStrict' builtin
         at «nix-internal»/derivation-internal.nix:37:12:
           36|
           37|   strict = derivationStrict drvAttrs;
             |            ^
           38|

       … while evaluating the option `driverConfiguration.vlans':

       … while evaluating definitions from `/nix/store/csk881ggvmifg4qf1cal0r1ffflbmlhp-source/nixos/lib/testing/driver-configuration.nix':

       … while evaluating the option `nodes.server.networking.interfaces':

       … while evaluating definitions from `/nix/store/csk881ggvmifg4qf1cal0r1ffflbmlhp-source/nixos/modules/hardware/facter/networking':

       … while evaluating the option `nodes.server.hardware.facter.enable':

       … while evaluating the option `nodes.server.hardware.facter.report':

       … while evaluating the option `nodes.server.hardware.facter.reportPath':

       … while evaluating definitions from `/nix/store/5hqygz6mbjfcigd522vb486qjqgn7i9w-source/nixosModules/clanCore/nixos-facter.nix':

       (stack trace truncated; use '--show-trace' to show the full, detailed trace)

       error: build of '/nix/store/wrfb0i91rk06qpfq4p27lyskcqjlvfl6-merged-test-dir-mycelium.drv^out' failed: error: error: gRPC BuildDerivation on 'nix-store.geninf.io:50051' failed: build-x86-01: missing: /nix/store/wrfb0i91rk06qpfq4p27lyskcqjlvfl6-merged-test-dir-mycelium.drv
failed eval checks.aarch64-linux.ncps —
error: … while evaluating the attribute 'drvPath' at «https://releases.nixos.org/nixos/26.05/nixos-26.05.11045.774debe7a0d1/nixexprs.tar.xz?narH …
error:
       … while evaluating the attribute 'drvPath'
         at «https://releases.nixos.org/nixos/26.05/nixos-26.05.11045.774debe7a0d1/nixexprs.tar.xz?narHash=sha256-S5MjznoY0gbQbcANPLz5RYjg%2B5/WQmFRgNbHcP%2Bydcg%3D»/lib/customisation.nix:427:7:
          426|     // {
          427|       drvPath =
             |       ^
          428|         assert condition;

       … while calling the 'derivationStrict' builtin
         at «nix-internal»/derivation-internal.nix:37:12:
           36|
           37|   strict = derivationStrict drvAttrs;
             |            ^
           38|

       … while evaluating the option `nodes.alice.networking.interfaces':

       … while evaluating definitions from `/nix/store/csk881ggvmifg4qf1cal0r1ffflbmlhp-source/nixos/modules/hardware/facter/networking':

       … while evaluating the option `nodes.alice.hardware.facter.enable':

       … while evaluating the option `nodes.alice.hardware.facter.report':

       … while evaluating the option `nodes.alice.hardware.facter.reportPath':

       … while evaluating definitions from `/nix/store/5hqygz6mbjfcigd522vb486qjqgn7i9w-source/nixosModules/clanCore/nixos-facter.nix':

       (stack trace truncated; use '--show-trace' to show the full, detailed trace)

       error: build of '/nix/store/0b9va4azqjj9ka1fylgah8qwbq7xx0l5-merged-test-dir-ncps.drv^out' failed: error: error: gRPC BuildDerivation on 'nix-store.geninf.io:50051' failed: build-x86-01: missing: /nix/store/0b9va4azqjj9ka1fylgah8qwbq7xx0l5-merged-test-dir-ncps.drv
failed checks.aarch64-linux.nixos-systemd-abstraction 1m 11s
setup: pg0hcmpq73ja69vv1qhxwy6am4avil46-clan-cli.drv: build01: build01: input not substitutable: error: path '/nix/store/qhy9dfxfqapakppa3yjja1zkzn8p31sa-python …
setup:
pg0hcmpq73ja69vv1qhxwy6am4avil46-clan-cli.drv: build01: build01: input not substitutable: error: path '/nix/store/qhy9dfxfqapakppa3yjja1zkzn8p31sa-python3-3.13.15-env' is required, but there is no substituter that can build it, asking the scheduler again
pg0hcmpq73ja69vv1qhxwy6am4avil46-clan-cli.drv: build01: build01: input not substitutable: error: path '/nix/store/qhy9dfxfqapakppa3yjja1zkzn8p31sa-python3-3.13.15-env' is required, but there is no substituter that can build it, asking the scheduler again
pg0hcmpq73ja69vv1qhxwy6am4avil46-clan-cli.drv: build01: the build this call attached to did not finish, retry, asking the scheduler again
pg0hcmpq73ja69vv1qhxwy6am4avil46-clan-cli.drv: build01: the build this call attached to did not finish, retry, asking the scheduler again
pg0hcmpq73ja69vv1qhxwy6am4avil46-clan-cli.drv: build01: build01: input not substitutable: error: path '/nix/store/qhy9dfxfqapakppa3yjja1zkzn8p31sa-python3-3.13.15-env' is required, but there is no substituter that can build it, asking the scheduler again
pg0hcmpq73ja69vv1qhxwy6am4avil46-clan-cli.drv: build01: the build this call attached to did not finish, retry, asking the scheduler again
pg0hcmpq73ja69vv1qhxwy6am4avil46-clan-cli.drv: build01: the build this call attached to did not finish, retry, asking the scheduler again
error: dependency 'irw8fy6iyirqvz1mm62dyv8w0ybs0pm9-nixos-test-driver-systemd-abstraction.drv' failed
failed eval checks.aarch64-linux.nixos-test-password-store-mounts —
error: … while evaluating the attribute 'drvPath' at «https://releases.nixos.org/nixos/26.05/nixos-26.05.11045.774debe7a0d1/nixexprs.tar.xz?narH …
error:
       … while evaluating the attribute 'drvPath'
         at «https://releases.nixos.org/nixos/26.05/nixos-26.05.11045.774debe7a0d1/nixexprs.tar.xz?narHash=sha256-S5MjznoY0gbQbcANPLz5RYjg%2B5/WQmFRgNbHcP%2Bydcg%3D»/lib/customisation.nix:427:7:
          426|     // {
          427|       drvPath =
             |       ^
          428|         assert condition;

       … while calling the 'derivationStrict' builtin
         at «nix-internal»/derivation-internal.nix:37:12:
           36|
           37|   strict = derivationStrict drvAttrs;
             |            ^
           38|

       … while evaluating the option `driverConfiguration.vlans':

       … while evaluating definitions from `/nix/store/csk881ggvmifg4qf1cal0r1ffflbmlhp-source/nixos/lib/testing/driver-configuration.nix':

       … while evaluating the option `nodes.machine.networking.interfaces':

       … while evaluating definitions from `/nix/store/csk881ggvmifg4qf1cal0r1ffflbmlhp-source/nixos/modules/hardware/facter/networking':

       … while evaluating the option `nodes.machine.hardware.facter.enable':

       … while evaluating the option `nodes.machine.hardware.facter.report':

       … while evaluating the option `nodes.machine.hardware.facter.reportPath':

       … while evaluating definitions from `/nix/store/5hqygz6mbjfcigd522vb486qjqgn7i9w-source/nixosModules/clanCore/nixos-facter.nix':

       (stack trace truncated; use '--show-trace' to show the full, detailed trace)

       error: build of '/nix/store/f3zzvddf2jfahb56201p48pfrxvn9qkr-merged-test-dir-nixos-test-password-store-mounts.drv^out' failed: error: gave up after 9 reschedules
failed checks.aarch64-linux.nixos-test-secrets 1m 9s
setup: don't know how to build these paths: /nix/store/9abj6z12lnjzb2861szlg0bkcwidk57r-vm-test-run-secrets.drv warning: ignoring the client-specified setting …
setup:
don't know how to build these paths:
  /nix/store/9abj6z12lnjzb2861szlg0bkcwidk57r-vm-test-run-secrets.drv
warning: ignoring the client-specified setting 'store', because it is a restricted setting and you are not a trusted user
mhpz9869y7xs4v6imnlhzs0nbm43fw9y-system-path.drv: error: gRPC AddMultipleToStore on 'nix-store.geninf.io:50051' failed: error: some references of path '/nix/store/n2p02gjiqfhl4sy08ay55klv7jbz845l-perl-5.42.0-env.drv' could not be realised
45jiglfx2wkxnbyfcjchd5ziwvh6sdxz-dry-activate.drv: error: gRPC AddMultipleToStore on 'nix-store.geninf.io:50051' failed: error: path '/nix/store/w8nzfg41s3rnysdqpkhivzcyj1dh5bx6-users-groups.json.drv' is required, but there is no substituter that can build it
error: dependency 'kv93ajaz72mypg7x4lm2pp1dlf39zkpf-nixos-test-driver-secrets.drv' failed
failed eval checks.aarch64-linux.p2p-ssh-iroh —
error: … while evaluating the attribute 'drvPath' at «https://releases.nixos.org/nixos/26.05/nixos-26.05.11045.774debe7a0d1/nixexprs.tar.xz?narH …
error:
       … while evaluating the attribute 'drvPath'
         at «https://releases.nixos.org/nixos/26.05/nixos-26.05.11045.774debe7a0d1/nixexprs.tar.xz?narHash=sha256-S5MjznoY0gbQbcANPLz5RYjg%2B5/WQmFRgNbHcP%2Bydcg%3D»/lib/customisation.nix:427:7:
          426|     // {
          427|       drvPath =
             |       ^
          428|         assert condition;

       … while calling the 'derivationStrict' builtin
         at «nix-internal»/derivation-internal.nix:37:12:
           36|
           37|   strict = derivationStrict drvAttrs;
             |            ^
           38|

       … while evaluating the option `nodes.client.networking.interfaces':

       … while evaluating definitions from `/nix/store/csk881ggvmifg4qf1cal0r1ffflbmlhp-source/nixos/modules/hardware/facter/networking':

       … while evaluating the option `nodes.client.hardware.facter.enable':

       … while evaluating the option `nodes.client.hardware.facter.report':

       … while evaluating the option `nodes.client.hardware.facter.reportPath':

       … while evaluating definitions from `/nix/store/5hqygz6mbjfcigd522vb486qjqgn7i9w-source/nixosModules/clanCore/nixos-facter.nix':

       (stack trace truncated; use '--show-trace' to show the full, detailed trace)

       error: build of '/nix/store/66ndbbglvmibsd07r7ajj48sdckr2kcz-merged-test-dir-clan-test-p2p-ssh-iroh.drv^out' failed: error: error: gRPC BuildDerivation on 'nix-store.geninf.io:50051' failed: build-x86-01: missing: /nix/store/66ndbbglvmibsd07r7ajj48sdckr2kcz-merged-test-dir-clan-test-p2p-ssh-iroh.drv
failed eval checks.aarch64-linux.pki —
error: … while evaluating the attribute 'drvPath' at «https://releases.nixos.org/nixos/26.05/nixos-26.05.11045.774debe7a0d1/nixexprs.tar.xz?narH …
error:
       … while evaluating the attribute 'drvPath'
         at «https://releases.nixos.org/nixos/26.05/nixos-26.05.11045.774debe7a0d1/nixexprs.tar.xz?narHash=sha256-S5MjznoY0gbQbcANPLz5RYjg%2B5/WQmFRgNbHcP%2Bydcg%3D»/lib/customisation.nix:427:7:
          426|     // {
          427|       drvPath =
             |       ^
          428|         assert condition;

       … while calling the 'derivationStrict' builtin
         at «nix-internal»/derivation-internal.nix:37:12:
           36|
           37|   strict = derivationStrict drvAttrs;
             |            ^
           38|

       … while evaluating the option `driverConfiguration.vlans':

       … while evaluating definitions from `/nix/store/csk881ggvmifg4qf1cal0r1ffflbmlhp-source/nixos/lib/testing/driver-configuration.nix':

       … while evaluating the option `nodes.caddy.networking.interfaces':

       … while evaluating definitions from `/nix/store/csk881ggvmifg4qf1cal0r1ffflbmlhp-source/nixos/modules/hardware/facter/networking':

       … while evaluating the option `nodes.caddy.hardware.facter.enable':

       … while evaluating the option `nodes.caddy.hardware.facter.report':

       … while evaluating the option `nodes.caddy.hardware.facter.reportPath':

       … while evaluating definitions from `/nix/store/5hqygz6mbjfcigd522vb486qjqgn7i9w-source/nixosModules/clanCore/nixos-facter.nix':

       (stack trace truncated; use '--show-trace' to show the full, detailed trace)

       error: build of '/nix/store/jifhxdzffi03r9ax3ri3nqdg8rcg62ax-merged-test-dir-pki.drv^out' failed: error: error: gRPC BuildDerivation on 'nix-store.geninf.io:50051' failed: build-x86-01: missing: /nix/store/jifhxdzffi03r9ax3ri3nqdg8rcg62ax-merged-test-dir-pki.drv
failed eval checks.aarch64-linux.service-dummy-test —
error: … while evaluating the attribute 'drvPath' at «https://releases.nixos.org/nixos/26.05/nixos-26.05.11045.774debe7a0d1/nixexprs.tar.xz?narH …
error:
       … while evaluating the attribute 'drvPath'
         at «https://releases.nixos.org/nixos/26.05/nixos-26.05.11045.774debe7a0d1/nixexprs.tar.xz?narHash=sha256-S5MjznoY0gbQbcANPLz5RYjg%2B5/WQmFRgNbHcP%2Bydcg%3D»/lib/customisation.nix:427:7:
          426|     // {
          427|       drvPath =
             |       ^
          428|         assert condition;

       … while calling the 'derivationStrict' builtin
         at «nix-internal»/derivation-internal.nix:37:12:
           36|
           37|   strict = derivationStrict drvAttrs;
             |            ^
           38|

       … while evaluating the option `nodes.admin1.networking.interfaces':

       … while evaluating definitions from `/nix/store/csk881ggvmifg4qf1cal0r1ffflbmlhp-source/nixos/modules/hardware/facter/networking':

       … while evaluating the option `nodes.admin1.hardware.facter.enable':

       … while evaluating the option `nodes.admin1.hardware.facter.report':

       … while evaluating the option `nodes.admin1.hardware.facter.reportPath':

       … while evaluating definitions from `/nix/store/5hqygz6mbjfcigd522vb486qjqgn7i9w-source/nixosModules/clanCore/nixos-facter.nix':

       (stack trace truncated; use '--show-trace' to show the full, detailed trace)

       error: build of '/nix/store/93r99wqlyhxzhj15ga3hbs1inkv5rq1w-merged-test-dir-service-dummy-test.drv^out' failed: error: error: gRPC BuildDerivation on 'nix-store.geninf.io:50051' failed: build-x86-01: missing: /nix/store/93r99wqlyhxzhj15ga3hbs1inkv5rq1w-merged-test-dir-service-dummy-test.drv
failed eval checks.aarch64-linux.service-dummy-test-from-flake —
error: … while evaluating the attribute 'drvPath' at «https://releases.nixos.org/nixos/26.05/nixos-26.05.11045.774debe7a0d1/nixexprs.tar.xz?narH …
error:
       … while evaluating the attribute 'drvPath'
         at «https://releases.nixos.org/nixos/26.05/nixos-26.05.11045.774debe7a0d1/nixexprs.tar.xz?narHash=sha256-S5MjznoY0gbQbcANPLz5RYjg%2B5/WQmFRgNbHcP%2Bydcg%3D»/lib/customisation.nix:427:7:
          426|     // {
          427|       drvPath =
             |       ^
          428|         assert condition;

       … while calling the 'derivationStrict' builtin
         at «nix-internal»/derivation-internal.nix:37:12:
           36|
           37|   strict = derivationStrict drvAttrs;
             |            ^
           38|

       … while evaluating the option `nodes.admin1.networking.interfaces':

       … while evaluating definitions from `/nix/store/csk881ggvmifg4qf1cal0r1ffflbmlhp-source/nixos/modules/hardware/facter/networking':

       … while evaluating the option `nodes.admin1.hardware.facter.enable':

       … while evaluating the option `nodes.admin1.hardware.facter.report':

       … while evaluating the option `nodes.admin1.hardware.facter.reportPath':

       … while evaluating definitions from `/nix/store/5hqygz6mbjfcigd522vb486qjqgn7i9w-source/nixosModules/clanCore/nixos-facter.nix':

       (stack trace truncated; use '--show-trace' to show the full, detailed trace)

       error: build of '/nix/store/qsfzrf8p2qb5lhr0nf2j11s5gyi38qbl-merged-test-dir-service-dummy-test-from-flake.drv^out' failed: error: error: gRPC BuildDerivation on 'nix-store.geninf.io:50051' failed: build-x86-01: missing: /nix/store/qsfzrf8p2qb5lhr0nf2j11s5gyi38qbl-merged-test-dir-service-dummy-test-from-flake.drv
failed eval checks.aarch64-linux.syncthing-service —
error: … while evaluating the attribute 'drvPath' at «https://releases.nixos.org/nixos/26.05/nixos-26.05.11045.774debe7a0d1/nixexprs.tar.xz?narH …
error:
       … while evaluating the attribute 'drvPath'
         at «https://releases.nixos.org/nixos/26.05/nixos-26.05.11045.774debe7a0d1/nixexprs.tar.xz?narHash=sha256-S5MjznoY0gbQbcANPLz5RYjg%2B5/WQmFRgNbHcP%2Bydcg%3D»/lib/customisation.nix:427:7:
          426|     // {
          427|       drvPath =
             |       ^
          428|         assert condition;

       … while calling the 'derivationStrict' builtin
         at «nix-internal»/derivation-internal.nix:37:12:
           36|
           37|   strict = derivationStrict drvAttrs;
             |            ^
           38|

       … while evaluating the option `nodes.machine1.networking.interfaces':

       … while evaluating definitions from `/nix/store/csk881ggvmifg4qf1cal0r1ffflbmlhp-source/nixos/modules/hardware/facter/networking':

       … while evaluating the option `nodes.machine1.hardware.facter.enable':

       … while evaluating the option `nodes.machine1.hardware.facter.report':

       … while evaluating the option `nodes.machine1.hardware.facter.reportPath':

       … while evaluating definitions from `/nix/store/5hqygz6mbjfcigd522vb486qjqgn7i9w-source/nixosModules/clanCore/nixos-facter.nix':

       (stack trace truncated; use '--show-trace' to show the full, detailed trace)

       error: build of '/nix/store/8ixbnwzwsadhimss7kqf9qm86dgjzchh-merged-test-dir-syncthing-service.drv^out' failed: error: error: gRPC BuildDerivation on 'nix-store.geninf.io:50051' failed: build-x86-01: missing: /nix/store/8ixbnwzwsadhimss7kqf9qm86dgjzchh-merged-test-dir-syncthing-service.drv
failed checks.aarch64-linux.treefmt 29s
setup: cmwnlx96z2wglrgaqycq77rsh7qhn7hs-treefmt-check.drv: build01: build01: input not substitutable: error: some references of path '/nix/store/nq7qhm9f18ilkx5 …
setup:
cmwnlx96z2wglrgaqycq77rsh7qhn7hs-treefmt-check.drv: build01: build01: input not substitutable: error: some references of path '/nix/store/nq7qhm9f18ilkx5ffi48gs0sfyxzcgs2-treefmt' could not be realised, asking the scheduler again
cmwnlx96z2wglrgaqycq77rsh7qhn7hs-treefmt-check.drv: build01: build01: input not substitutable: error: some references of path '/nix/store/nq7qhm9f18ilkx5ffi48gs0sfyxzcgs2-treefmt' could not be realised, asking the scheduler again
cmwnlx96z2wglrgaqycq77rsh7qhn7hs-treefmt-check.drv: build01: build01: input not substitutable: error: some references of path '/nix/store/nq7qhm9f18ilkx5ffi48gs0sfyxzcgs2-treefmt' could not be realised, asking the scheduler again
cmwnlx96z2wglrgaqycq77rsh7qhn7hs-treefmt-check.drv: build01: build01: input not substitutable: error: some references of path '/nix/store/nq7qhm9f18ilkx5ffi48gs0sfyxzcgs2-treefmt' could not be realised, asking the scheduler again
cmwnlx96z2wglrgaqycq77rsh7qhn7hs-treefmt-check.drv: build01: build01: input not substitutable: error: some references of path '/nix/store/nq7qhm9f18ilkx5ffi48gs0sfyxzcgs2-treefmt' could not be realised, asking the scheduler again
cmwnlx96z2wglrgaqycq77rsh7qhn7hs-treefmt-check.drv: build01: build01: input not substitutable: error: some references of path '/nix/store/nq7qhm9f18ilkx5ffi48gs0sfyxzcgs2-treefmt' could not be realised, asking the scheduler again
cmwnlx96z2wglrgaqycq77rsh7qhn7hs-treefmt-check.drv: build01: build01: input not substitutable: error: some references of path '/nix/store/nq7qhm9f18ilkx5ffi48gs0sfyxzcgs2-treefmt' could not be realised, asking the scheduler again
error: gave up after 9 reschedules
failed eval checks.aarch64-linux.users —
error: … while evaluating the attribute 'drvPath' at «https://releases.nixos.org/nixos/26.05/nixos-26.05.11045.774debe7a0d1/nixexprs.tar.xz?narH …
error:
       … while evaluating the attribute 'drvPath'
         at «https://releases.nixos.org/nixos/26.05/nixos-26.05.11045.774debe7a0d1/nixexprs.tar.xz?narHash=sha256-S5MjznoY0gbQbcANPLz5RYjg%2B5/WQmFRgNbHcP%2Bydcg%3D»/lib/customisation.nix:427:7:
          426|     // {
          427|       drvPath =
             |       ^
          428|         assert condition;

       … while calling the 'derivationStrict' builtin
         at «nix-internal»/derivation-internal.nix:37:12:
           36|
           37|   strict = derivationStrict drvAttrs;
             |            ^
           38|

       … while evaluating the option `nodes.server.networking.interfaces':

       … while evaluating definitions from `/nix/store/csk881ggvmifg4qf1cal0r1ffflbmlhp-source/nixos/modules/hardware/facter/networking':

       … while evaluating the option `nodes.server.hardware.facter.enable':

       … while evaluating the option `nodes.server.hardware.facter.report':

       … while evaluating the option `nodes.server.hardware.facter.reportPath':

       … while evaluating definitions from `/nix/store/5hqygz6mbjfcigd522vb486qjqgn7i9w-source/nixosModules/clanCore/nixos-facter.nix':

       (stack trace truncated; use '--show-trace' to show the full, detailed trace)

       error: build of '/nix/store/rx39mmxfmdxw2hp0hy63igdj7q0j0mqw-merged-test-dir-users.drv^out' failed: error: error: gRPC BuildDerivation on 'nix-store.geninf.io:50051' failed: build-x86-01: missing: /nix/store/rx39mmxfmdxw2hp0hy63igdj7q0j0mqw-merged-test-dir-users.drv
failed eval checks.aarch64-linux.wireguard —
error: … while evaluating the attribute 'drvPath' at «https://releases.nixos.org/nixos/26.05/nixos-26.05.11045.774debe7a0d1/nixexprs.tar.xz?narH …
error:
       … while evaluating the attribute 'drvPath'
         at «https://releases.nixos.org/nixos/26.05/nixos-26.05.11045.774debe7a0d1/nixexprs.tar.xz?narHash=sha256-S5MjznoY0gbQbcANPLz5RYjg%2B5/WQmFRgNbHcP%2Bydcg%3D»/lib/customisation.nix:427:7:
          426|     // {
          427|       drvPath =
             |       ^
          428|         assert condition;

       … while calling the 'derivationStrict' builtin
         at «nix-internal»/derivation-internal.nix:37:12:
           36|
           37|   strict = derivationStrict drvAttrs;
             |            ^
           38|

       … while evaluating the option `nodes.controller1.networking.interfaces':

       … while evaluating definitions from `/nix/store/csk881ggvmifg4qf1cal0r1ffflbmlhp-source/nixos/modules/hardware/facter/networking':

       … while evaluating the option `nodes.controller1.hardware.facter.enable':

       … while evaluating the option `nodes.controller1.hardware.facter.report':

       … while evaluating the option `nodes.controller1.hardware.facter.reportPath':

       … while evaluating definitions from `/nix/store/5hqygz6mbjfcigd522vb486qjqgn7i9w-source/nixosModules/clanCore/nixos-facter.nix':

       (stack trace truncated; use '--show-trace' to show the full, detailed trace)

       error: build of '/nix/store/k99w3l2gf1wlzjh8lihbaw1rh078jaka-merged-test-dir-wireguard.drv^out' failed: error: error: gRPC BuildDerivation on 'nix-store.geninf.io:50051' failed: build-x86-01: missing: /nix/store/k99w3l2gf1wlzjh8lihbaw1rh078jaka-merged-test-dir-wireguard.drv
failed eval checks.aarch64-linux.zerotier —
error: … while evaluating the attribute 'drvPath' at «https://releases.nixos.org/nixos/26.05/nixos-26.05.11045.774debe7a0d1/nixexprs.tar.xz?narH …
error:
       … while evaluating the attribute 'drvPath'
         at «https://releases.nixos.org/nixos/26.05/nixos-26.05.11045.774debe7a0d1/nixexprs.tar.xz?narHash=sha256-S5MjznoY0gbQbcANPLz5RYjg%2B5/WQmFRgNbHcP%2Bydcg%3D»/lib/customisation.nix:427:7:
          426|     // {
          427|       drvPath =
             |       ^
          428|         assert condition;

       … while calling the 'derivationStrict' builtin
         at «nix-internal»/derivation-internal.nix:37:12:
           36|
           37|   strict = derivationStrict drvAttrs;
             |            ^
           38|

       … while evaluating the option `driverConfiguration.vlans':

       … while evaluating definitions from `/nix/store/csk881ggvmifg4qf1cal0r1ffflbmlhp-source/nixos/lib/testing/driver-configuration.nix':

       … while evaluating the option `nodes.controller.networking.interfaces':

       … while evaluating definitions from `/nix/store/csk881ggvmifg4qf1cal0r1ffflbmlhp-source/nixos/modules/hardware/facter/networking':

       … while evaluating the option `nodes.controller.hardware.facter.enable':

       … while evaluating the option `nodes.controller.hardware.facter.report':

       … while evaluating the option `nodes.controller.hardware.facter.reportPath':

       … while evaluating definitions from `/nix/store/5hqygz6mbjfcigd522vb486qjqgn7i9w-source/nixosModules/clanCore/nixos-facter.nix':

       (stack trace truncated; use '--show-trace' to show the full, detailed trace)

       error: build of '/nix/store/plrafijfzclzss9dl00yfdm906l5p3xx-merged-test-dir-zerotier.drv^out' failed: error: error: gRPC BuildDerivation on 'nix-store.geninf.io:50051' failed: build-x86-01: missing: /nix/store/plrafijfzclzss9dl00yfdm906l5p3xx-merged-test-dir-zerotier.drv
failed eval checks.aarch64-linux.zerotier-multi-instance —
error: … while evaluating the attribute 'drvPath' at «https://releases.nixos.org/nixos/26.05/nixos-26.05.11045.774debe7a0d1/nixexprs.tar.xz?narH …
error:
       … while evaluating the attribute 'drvPath'
         at «https://releases.nixos.org/nixos/26.05/nixos-26.05.11045.774debe7a0d1/nixexprs.tar.xz?narHash=sha256-S5MjznoY0gbQbcANPLz5RYjg%2B5/WQmFRgNbHcP%2Bydcg%3D»/lib/customisation.nix:427:7:
          426|     // {
          427|       drvPath =
             |       ^
          428|         assert condition;

       … while calling the 'derivationStrict' builtin
         at «nix-internal»/derivation-internal.nix:37:12:
           36|
           37|   strict = derivationStrict drvAttrs;
             |            ^
           38|

       … while evaluating the option `driverConfiguration.vlans':

       … while evaluating definitions from `/nix/store/csk881ggvmifg4qf1cal0r1ffflbmlhp-source/nixos/lib/testing/driver-configuration.nix':

       … while evaluating the option `nodes.alpha.networking.interfaces':

       … while evaluating definitions from `/nix/store/csk881ggvmifg4qf1cal0r1ffflbmlhp-source/nixos/modules/hardware/facter/networking':

       … while evaluating the option `nodes.alpha.hardware.facter.enable':

       … while evaluating the option `nodes.alpha.hardware.facter.report':

       … while evaluating the option `nodes.alpha.hardware.facter.reportPath':

       … while evaluating definitions from `/nix/store/5hqygz6mbjfcigd522vb486qjqgn7i9w-source/nixosModules/clanCore/nixos-facter.nix':

       (stack trace truncated; use '--show-trace' to show the full, detailed trace)

       error: build of '/nix/store/gb0pvdh3p89c6fjyqzfav5y3w7dlns4m-merged-test-dir-zerotier-multi-instance.drv^out' failed: error: error: gRPC BuildDerivation on 'nix-store.geninf.io:50051' failed: build-x86-01: missing: /nix/store/gb0pvdh3p89c6fjyqzfav5y3w7dlns4m-merged-test-dir-zerotier-multi-instance.drv
failed eval checks.x86_64-linux.borgbackup —
error: … while evaluating the attribute 'drvPath' at «https://releases.nixos.org/nixos/26.05/nixos-26.05.11045.774debe7a0d1/nixexprs.tar.xz?narH …
error:
       … while evaluating the attribute 'drvPath'
         at «https://releases.nixos.org/nixos/26.05/nixos-26.05.11045.774debe7a0d1/nixexprs.tar.xz?narHash=sha256-S5MjznoY0gbQbcANPLz5RYjg%2B5/WQmFRgNbHcP%2Bydcg%3D»/lib/customisation.nix:427:7:
          426|     // {
          427|       drvPath =
             |       ^
          428|         assert condition;

       … while calling the 'derivationStrict' builtin
         at «nix-internal»/derivation-internal.nix:37:12:
           36|
           37|   strict = derivationStrict drvAttrs;
             |            ^
           38|

       … while evaluating the option `nodes.clientone.networking.interfaces':

       … while evaluating definitions from `/nix/store/csk881ggvmifg4qf1cal0r1ffflbmlhp-source/nixos/modules/hardware/facter/networking':

       … while evaluating the option `nodes.clientone.hardware.facter.enable':

       … while evaluating the option `nodes.clientone.hardware.facter.report':

       … while evaluating the option `nodes.clientone.hardware.facter.reportPath':

       … while evaluating definitions from `/nix/store/5hqygz6mbjfcigd522vb486qjqgn7i9w-source/nixosModules/clanCore/nixos-facter.nix':

       (stack trace truncated; use '--show-trace' to show the full, detailed trace)

       error: build of '/nix/store/c20nf5ixxlkl98byh90mdyscphw2i96v-merged-test-dir-borgbackup.drv^out' failed: error: error: gRPC BuildDerivation on 'nix-store.geninf.io:50051' failed: build-x86-01: missing: /nix/store/c20nf5ixxlkl98byh90mdyscphw2i96v-merged-test-dir-borgbackup.drv
failed eval checks.x86_64-linux.certificates —
error: … while evaluating the attribute 'drvPath' at «https://releases.nixos.org/nixos/26.05/nixos-26.05.11045.774debe7a0d1/nixexprs.tar.xz?narH …
error:
       … while evaluating the attribute 'drvPath'
         at «https://releases.nixos.org/nixos/26.05/nixos-26.05.11045.774debe7a0d1/nixexprs.tar.xz?narHash=sha256-S5MjznoY0gbQbcANPLz5RYjg%2B5/WQmFRgNbHcP%2Bydcg%3D»/lib/customisation.nix:427:7:
          426|     // {
          427|       drvPath =
             |       ^
          428|         assert condition;

       … while calling the 'derivationStrict' builtin
         at «nix-internal»/derivation-internal.nix:37:12:
           36|
           37|   strict = derivationStrict drvAttrs;
             |            ^
           38|

       … while evaluating the option `nodes.ca.networking.interfaces':

       … while evaluating definitions from `/nix/store/csk881ggvmifg4qf1cal0r1ffflbmlhp-source/nixos/modules/hardware/facter/networking':

       … while evaluating the option `nodes.ca.hardware.facter.enable':

       … while evaluating the option `nodes.ca.hardware.facter.report':

       … while evaluating the option `nodes.ca.hardware.facter.reportPath':

       … while evaluating definitions from `/nix/store/5hqygz6mbjfcigd522vb486qjqgn7i9w-source/nixosModules/clanCore/nixos-facter.nix':

       (stack trace truncated; use '--show-trace' to show the full, detailed trace)

       error: build of '/nix/store/2sfs7lp26wpjls0kgvikwkqadn400rph-merged-test-dir-certificates.drv^out' failed: error: gave up after 9 reschedules
failed eval checks.x86_64-linux.clan-test-update —
error: … while evaluating the attribute 'drvPath' at «https://releases.nixos.org/nixos/26.05/nixos-26.05.11045.774debe7a0d1/nixexprs.tar.xz?narH …
error:
       … while evaluating the attribute 'drvPath'
         at «https://releases.nixos.org/nixos/26.05/nixos-26.05.11045.774debe7a0d1/nixexprs.tar.xz?narHash=sha256-S5MjznoY0gbQbcANPLz5RYjg%2B5/WQmFRgNbHcP%2Bydcg%3D»/lib/customisation.nix:427:7:
          426|     // {
          427|       drvPath =
             |       ^
          428|         assert condition;

       … while calling the 'derivationStrict' builtin
         at «nix-internal»/derivation-internal.nix:37:12:
           36|
           37|   strict = derivationStrict drvAttrs;
             |            ^
           38|

       … while evaluating the option `nodes.test-update-machine.networking.interfaces':

       … while evaluating definitions from `/nix/store/csk881ggvmifg4qf1cal0r1ffflbmlhp-source/nixos/modules/hardware/facter/networking':

       … while evaluating the option `nodes.test-update-machine.hardware.facter.enable':

       … while evaluating the option `nodes.test-update-machine.hardware.facter.report':

       … while evaluating the option `nodes.test-update-machine.hardware.facter.reportPath':

       … while evaluating definitions from `/nix/store/5hqygz6mbjfcigd522vb486qjqgn7i9w-source/nixosModules/clanCore/nixos-facter.nix':

       (stack trace truncated; use '--show-trace' to show the full, detailed trace)

       error: build of '/nix/store/3ny5bysiwfn40mfsp9682fq77wi4dvpl-merged-test-dir-clan-test-update.drv^out' failed: error: gave up after 9 reschedules
failed eval checks.x86_64-linux.data-mesher —
error: … while evaluating the attribute 'drvPath' at «https://releases.nixos.org/nixos/26.05/nixos-26.05.11045.774debe7a0d1/nixexprs.tar.xz?narH …
error:
       … while evaluating the attribute 'drvPath'
         at «https://releases.nixos.org/nixos/26.05/nixos-26.05.11045.774debe7a0d1/nixexprs.tar.xz?narHash=sha256-S5MjznoY0gbQbcANPLz5RYjg%2B5/WQmFRgNbHcP%2Bydcg%3D»/lib/customisation.nix:427:7:
          426|     // {
          427|       drvPath =
             |       ^
          428|         assert condition;

       … while calling the 'derivationStrict' builtin
         at «nix-internal»/derivation-internal.nix:37:12:
           36|
           37|   strict = derivationStrict drvAttrs;
             |            ^
           38|

       … while evaluating the option `nodes.alpha.networking.interfaces':

       … while evaluating definitions from `/nix/store/csk881ggvmifg4qf1cal0r1ffflbmlhp-source/nixos/modules/hardware/facter/networking':

       … while evaluating the option `nodes.alpha.hardware.facter.enable':

       … while evaluating the option `nodes.alpha.hardware.facter.report':

       … while evaluating the option `nodes.alpha.hardware.facter.reportPath':

       … while evaluating definitions from `/nix/store/5hqygz6mbjfcigd522vb486qjqgn7i9w-source/nixosModules/clanCore/nixos-facter.nix':

       (stack trace truncated; use '--show-trace' to show the full, detailed trace)

       error: build of '/nix/store/bisdrchsk95mhvw467p4wq5b2f79msnx-merged-test-dir-data-mesher.drv^out' failed: error: error: gRPC BuildDerivation on 'nix-store.geninf.io:50051' failed: build-x86-01: missing: /nix/store/bisdrchsk95mhvw467p4wq5b2f79msnx-merged-test-dir-data-mesher.drv
failed eval checks.x86_64-linux.dm-dns —
error: … while evaluating the attribute 'drvPath' at «https://releases.nixos.org/nixos/26.05/nixos-26.05.11045.774debe7a0d1/nixexprs.tar.xz?narH …
error:
       … while evaluating the attribute 'drvPath'
         at «https://releases.nixos.org/nixos/26.05/nixos-26.05.11045.774debe7a0d1/nixexprs.tar.xz?narHash=sha256-S5MjznoY0gbQbcANPLz5RYjg%2B5/WQmFRgNbHcP%2Bydcg%3D»/lib/customisation.nix:427:7:
          426|     // {
          427|       drvPath =
             |       ^
          428|         assert condition;

       … while calling the 'derivationStrict' builtin
         at «nix-internal»/derivation-internal.nix:37:12:
           36|
           37|   strict = derivationStrict drvAttrs;
             |            ^
           38|

       … while evaluating the option `nodes.client.networking.interfaces':

       … while evaluating definitions from `/nix/store/csk881ggvmifg4qf1cal0r1ffflbmlhp-source/nixos/modules/hardware/facter/networking':

       … while evaluating the option `nodes.client.hardware.facter.enable':

       … while evaluating the option `nodes.client.hardware.facter.report':

       … while evaluating the option `nodes.client.hardware.facter.reportPath':

       … while evaluating definitions from `/nix/store/5hqygz6mbjfcigd522vb486qjqgn7i9w-source/nixosModules/clanCore/nixos-facter.nix':

       (stack trace truncated; use '--show-trace' to show the full, detailed trace)

       error: build of '/nix/store/yln3f9jkdz1nwbsd4mb869zl8hfcnvyl-merged-test-dir-dm-dns.drv^out' failed: error: error: gRPC BuildDerivation on 'nix-store.geninf.io:50051' failed: build-x86-01: missing: /nix/store/yln3f9jkdz1nwbsd4mb869zl8hfcnvyl-merged-test-dir-dm-dns.drv
failed eval checks.x86_64-linux.garage —
error: … while evaluating the attribute 'drvPath' at «https://releases.nixos.org/nixos/26.05/nixos-26.05.11045.774debe7a0d1/nixexprs.tar.xz?narH …
error:
       … while evaluating the attribute 'drvPath'
         at «https://releases.nixos.org/nixos/26.05/nixos-26.05.11045.774debe7a0d1/nixexprs.tar.xz?narHash=sha256-S5MjznoY0gbQbcANPLz5RYjg%2B5/WQmFRgNbHcP%2Bydcg%3D»/lib/customisation.nix:427:7:
          426|     // {
          427|       drvPath =
             |       ^
          428|         assert condition;

       … while calling the 'derivationStrict' builtin
         at «nix-internal»/derivation-internal.nix:37:12:
           36|
           37|   strict = derivationStrict drvAttrs;
             |            ^
           38|

       … while evaluating the option `nodes.server.networking.interfaces':

       … while evaluating definitions from `/nix/store/csk881ggvmifg4qf1cal0r1ffflbmlhp-source/nixos/modules/hardware/facter/networking':

       … while evaluating the option `nodes.server.hardware.facter.enable':

       … while evaluating the option `nodes.server.hardware.facter.report':

       … while evaluating the option `nodes.server.hardware.facter.reportPath':

       … while evaluating definitions from `/nix/store/5hqygz6mbjfcigd522vb486qjqgn7i9w-source/nixosModules/clanCore/nixos-facter.nix':

       (stack trace truncated; use '--show-trace' to show the full, detailed trace)

       error: build of '/nix/store/m5bznfa9ljfbjad6mr813wqn4ncj0h1c-merged-test-dir-garage.drv^out' failed: error: error: gRPC BuildDerivation on 'nix-store.geninf.io:50051' failed: build-x86-01: missing: /nix/store/m5bznfa9ljfbjad6mr813wqn4ncj0h1c-merged-test-dir-garage.drv
failed eval checks.x86_64-linux.machine-id —
error: … while evaluating the attribute 'drvPath' at «https://releases.nixos.org/nixos/26.05/nixos-26.05.11045.774debe7a0d1/nixexprs.tar.xz?narH …
error:
       … while evaluating the attribute 'drvPath'
         at «https://releases.nixos.org/nixos/26.05/nixos-26.05.11045.774debe7a0d1/nixexprs.tar.xz?narHash=sha256-S5MjznoY0gbQbcANPLz5RYjg%2B5/WQmFRgNbHcP%2Bydcg%3D»/lib/customisation.nix:427:7:
          426|     // {
          427|       drvPath =
             |       ^
          428|         assert condition;

       … while calling the 'derivationStrict' builtin
         at «nix-internal»/derivation-internal.nix:37:12:
           36|
           37|   strict = derivationStrict drvAttrs;
             |            ^
           38|

       … while evaluating the option `nodes.server.networking.interfaces':

       … while evaluating definitions from `/nix/store/csk881ggvmifg4qf1cal0r1ffflbmlhp-source/nixos/modules/hardware/facter/networking':

       … while evaluating the option `nodes.server.hardware.facter.enable':

       … while evaluating the option `nodes.server.hardware.facter.report':

       … while evaluating the option `nodes.server.hardware.facter.reportPath':

       … while evaluating definitions from `/nix/store/5hqygz6mbjfcigd522vb486qjqgn7i9w-source/nixosModules/clanCore/nixos-facter.nix':

       (stack trace truncated; use '--show-trace' to show the full, detailed trace)

       error: build of '/nix/store/1aw9g733adh7hh3dcxcs1bmkzhb8izr1-merged-test-dir-service-machine-id.drv^out' failed: error: gave up after 9 reschedules
failed eval checks.x86_64-linux.matrix-synapse —
error: … while evaluating the attribute 'drvPath' at «https://releases.nixos.org/nixos/26.05/nixos-26.05.11045.774debe7a0d1/nixexprs.tar.xz?narH …
error:
       … while evaluating the attribute 'drvPath'
         at «https://releases.nixos.org/nixos/26.05/nixos-26.05.11045.774debe7a0d1/nixexprs.tar.xz?narHash=sha256-S5MjznoY0gbQbcANPLz5RYjg%2B5/WQmFRgNbHcP%2Bydcg%3D»/lib/customisation.nix:427:7:
          426|     // {
          427|       drvPath =
             |       ^
          428|         assert condition;

       … while calling the 'derivationStrict' builtin
         at «nix-internal»/derivation-internal.nix:37:12:
           36|
           37|   strict = derivationStrict drvAttrs;
             |            ^
           38|

       … while evaluating the option `nodes.machine.networking.interfaces':

       … while evaluating definitions from `/nix/store/csk881ggvmifg4qf1cal0r1ffflbmlhp-source/nixos/modules/hardware/facter/networking':

       … while evaluating the option `nodes.machine.hardware.facter.enable':

       … while evaluating the option `nodes.machine.hardware.facter.report':

       … while evaluating the option `nodes.machine.hardware.facter.reportPath':

       … while evaluating definitions from `/nix/store/5hqygz6mbjfcigd522vb486qjqgn7i9w-source/nixosModules/clanCore/nixos-facter.nix':

       (stack trace truncated; use '--show-trace' to show the full, detailed trace)

       error: build of '/nix/store/1k4q4h7b0264nnw73rgmiyag11gv3b9k-merged-test-dir-matrix-synapse.drv^out' failed: error: error: gRPC BuildDerivation on 'nix-store.geninf.io:50051' failed: build-x86-01: missing: /nix/store/1k4q4h7b0264nnw73rgmiyag11gv3b9k-merged-test-dir-matrix-synapse.drv
failed eval checks.x86_64-linux.monitoring —
error: … while evaluating the attribute 'drvPath' at «https://releases.nixos.org/nixos/26.05/nixos-26.05.11045.774debe7a0d1/nixexprs.tar.xz?narH …
error:
       … while evaluating the attribute 'drvPath'
         at «https://releases.nixos.org/nixos/26.05/nixos-26.05.11045.774debe7a0d1/nixexprs.tar.xz?narHash=sha256-S5MjznoY0gbQbcANPLz5RYjg%2B5/WQmFRgNbHcP%2Bydcg%3D»/lib/customisation.nix:427:7:
          426|     // {
          427|       drvPath =
             |       ^
          428|         assert condition;

       … while calling the 'derivationStrict' builtin
         at «nix-internal»/derivation-internal.nix:37:12:
           36|
           37|   strict = derivationStrict drvAttrs;
             |            ^
           38|

       … while evaluating the option `nodes.machine1.networking.interfaces':

       … while evaluating definitions from `/nix/store/csk881ggvmifg4qf1cal0r1ffflbmlhp-source/nixos/modules/hardware/facter/networking':

       … while evaluating the option `nodes.machine1.hardware.facter.enable':

       … while evaluating the option `nodes.machine1.hardware.facter.report':

       … while evaluating the option `nodes.machine1.hardware.facter.reportPath':

       … while evaluating definitions from `/nix/store/5hqygz6mbjfcigd522vb486qjqgn7i9w-source/nixosModules/clanCore/nixos-facter.nix':

       (stack trace truncated; use '--show-trace' to show the full, detailed trace)

       error: build of '/nix/store/w7lsmv9zb3ng21k9akkmgq342l47ylf2-merged-test-dir-monitoring.drv^out' failed: error: gave up after 9 reschedules
failed eval checks.x86_64-linux.mycelium —
error: … while evaluating the attribute 'drvPath' at «https://releases.nixos.org/nixos/26.05/nixos-26.05.11045.774debe7a0d1/nixexprs.tar.xz?narH …
error:
       … while evaluating the attribute 'drvPath'
         at «https://releases.nixos.org/nixos/26.05/nixos-26.05.11045.774debe7a0d1/nixexprs.tar.xz?narHash=sha256-S5MjznoY0gbQbcANPLz5RYjg%2B5/WQmFRgNbHcP%2Bydcg%3D»/lib/customisation.nix:427:7:
          426|     // {
          427|       drvPath =
             |       ^
          428|         assert condition;

       … while calling the 'derivationStrict' builtin
         at «nix-internal»/derivation-internal.nix:37:12:
           36|
           37|   strict = derivationStrict drvAttrs;
             |            ^
           38|

       … while evaluating the option `driverConfiguration.vlans':

       … while evaluating definitions from `/nix/store/csk881ggvmifg4qf1cal0r1ffflbmlhp-source/nixos/lib/testing/driver-configuration.nix':

       … while evaluating the option `nodes.server.networking.interfaces':

       … while evaluating definitions from `/nix/store/csk881ggvmifg4qf1cal0r1ffflbmlhp-source/nixos/modules/hardware/facter/networking':

       … while evaluating the option `nodes.server.hardware.facter.enable':

       … while evaluating the option `nodes.server.hardware.facter.report':

       … while evaluating the option `nodes.server.hardware.facter.reportPath':

       … while evaluating definitions from `/nix/store/5hqygz6mbjfcigd522vb486qjqgn7i9w-source/nixosModules/clanCore/nixos-facter.nix':

       (stack trace truncated; use '--show-trace' to show the full, detailed trace)

       error: build of '/nix/store/wrfb0i91rk06qpfq4p27lyskcqjlvfl6-merged-test-dir-mycelium.drv^out' failed: error: error: gRPC BuildDerivation on 'nix-store.geninf.io:50051' failed: build-x86-01: missing: /nix/store/wrfb0i91rk06qpfq4p27lyskcqjlvfl6-merged-test-dir-mycelium.drv
failed eval checks.x86_64-linux.ncps —
error: … while evaluating the attribute 'drvPath' at «https://releases.nixos.org/nixos/26.05/nixos-26.05.11045.774debe7a0d1/nixexprs.tar.xz?narH …
error:
       … while evaluating the attribute 'drvPath'
         at «https://releases.nixos.org/nixos/26.05/nixos-26.05.11045.774debe7a0d1/nixexprs.tar.xz?narHash=sha256-S5MjznoY0gbQbcANPLz5RYjg%2B5/WQmFRgNbHcP%2Bydcg%3D»/lib/customisation.nix:427:7:
          426|     // {
          427|       drvPath =
             |       ^
          428|         assert condition;

       … while calling the 'derivationStrict' builtin
         at «nix-internal»/derivation-internal.nix:37:12:
           36|
           37|   strict = derivationStrict drvAttrs;
             |            ^
           38|

       … while evaluating the option `nodes.alice.networking.interfaces':

       … while evaluating definitions from `/nix/store/csk881ggvmifg4qf1cal0r1ffflbmlhp-source/nixos/modules/hardware/facter/networking':

       … while evaluating the option `nodes.alice.hardware.facter.enable':

       … while evaluating the option `nodes.alice.hardware.facter.report':

       … while evaluating the option `nodes.alice.hardware.facter.reportPath':

       … while evaluating definitions from `/nix/store/5hqygz6mbjfcigd522vb486qjqgn7i9w-source/nixosModules/clanCore/nixos-facter.nix':

       (stack trace truncated; use '--show-trace' to show the full, detailed trace)

       error: build of '/nix/store/0b9va4azqjj9ka1fylgah8qwbq7xx0l5-merged-test-dir-ncps.drv^out' failed: error: error: gRPC BuildDerivation on 'nix-store.geninf.io:50051' failed: build-x86-01: missing: /nix/store/0b9va4azqjj9ka1fylgah8qwbq7xx0l5-merged-test-dir-ncps.drv
failed eval checks.x86_64-linux.nixos-test-password-store-mounts —
error: … while evaluating the attribute 'drvPath' at «https://releases.nixos.org/nixos/26.05/nixos-26.05.11045.774debe7a0d1/nixexprs.tar.xz?narH …
error:
       … while evaluating the attribute 'drvPath'
         at «https://releases.nixos.org/nixos/26.05/nixos-26.05.11045.774debe7a0d1/nixexprs.tar.xz?narHash=sha256-S5MjznoY0gbQbcANPLz5RYjg%2B5/WQmFRgNbHcP%2Bydcg%3D»/lib/customisation.nix:427:7:
          426|     // {
          427|       drvPath =
             |       ^
          428|         assert condition;

       … while calling the 'derivationStrict' builtin
         at «nix-internal»/derivation-internal.nix:37:12:
           36|
           37|   strict = derivationStrict drvAttrs;
             |            ^
           38|

       … while evaluating the option `driverConfiguration.vlans':

       … while evaluating definitions from `/nix/store/csk881ggvmifg4qf1cal0r1ffflbmlhp-source/nixos/lib/testing/driver-configuration.nix':

       … while evaluating the option `nodes.machine.networking.interfaces':

       … while evaluating definitions from `/nix/store/csk881ggvmifg4qf1cal0r1ffflbmlhp-source/nixos/modules/hardware/facter/networking':

       … while evaluating the option `nodes.machine.hardware.facter.enable':

       … while evaluating the option `nodes.machine.hardware.facter.report':

       … while evaluating the option `nodes.machine.hardware.facter.reportPath':

       … while evaluating definitions from `/nix/store/5hqygz6mbjfcigd522vb486qjqgn7i9w-source/nixosModules/clanCore/nixos-facter.nix':

       (stack trace truncated; use '--show-trace' to show the full, detailed trace)

       error: build of '/nix/store/f3zzvddf2jfahb56201p48pfrxvn9qkr-merged-test-dir-nixos-test-password-store-mounts.drv^out' failed: error: gave up after 9 reschedules
failed checks.x86_64-linux.nixos-test-secrets 36s
setup: /nix/store/0qxnwnzy6wr9sn96ld299ikwfi9nnjyl-xz-5.8.4-man /nix/store/qlnky885gm1ssq1ah0zplcr1w3097d26-zlib-1.3.2-static /nix/store/fl0wgyyqi2ra1rpkv …
setup:
  /nix/store/0qxnwnzy6wr9sn96ld299ikwfi9nnjyl-xz-5.8.4-man
  /nix/store/qlnky885gm1ssq1ah0zplcr1w3097d26-zlib-1.3.2-static
  /nix/store/fl0wgyyqi2ra1rpkvb3f4aa2ndxghj2h-zlib-ng-2.3.3
  /nix/store/m65jx29i0xqgzxl890drxrn8sj97v2yr-zstd-1.5.7-bin
  /nix/store/pjw0gfl1i83a03a6jnqcbms4kcv0yakg-zstd-1.5.7-man
warning: ignoring the client-specified setting 'store', because it is a restricted setting and you are not a trusted user
13dn2y480kb6320nvmxd6sgm051536gs-etc.drv: error: gRPC AddMultipleToStore on 'nix-store.geninf.io:50051' failed: error: path '/nix/store/35j1bgg213aj308a51v5mzpyvnayapns-X-Reload-Triggers-systemd-networkd.drv' is required, but there is no substituter that can build it
error: dependency 'b67l9qiffvavsji6asrgrpa16qkm07bf-nixos-test-driver-secrets.drv' failed
failed eval checks.x86_64-linux.p2p-ssh-iroh —
error: … while evaluating the attribute 'drvPath' at «https://releases.nixos.org/nixos/26.05/nixos-26.05.11045.774debe7a0d1/nixexprs.tar.xz?narH …
error:
       … while evaluating the attribute 'drvPath'
         at «https://releases.nixos.org/nixos/26.05/nixos-26.05.11045.774debe7a0d1/nixexprs.tar.xz?narHash=sha256-S5MjznoY0gbQbcANPLz5RYjg%2B5/WQmFRgNbHcP%2Bydcg%3D»/lib/customisation.nix:427:7:
          426|     // {
          427|       drvPath =
             |       ^
          428|         assert condition;

       … while calling the 'derivationStrict' builtin
         at «nix-internal»/derivation-internal.nix:37:12:
           36|
           37|   strict = derivationStrict drvAttrs;
             |            ^
           38|

       … while evaluating the option `nodes.client.networking.interfaces':

       … while evaluating definitions from `/nix/store/csk881ggvmifg4qf1cal0r1ffflbmlhp-source/nixos/modules/hardware/facter/networking':

       … while evaluating the option `nodes.client.hardware.facter.enable':

       … while evaluating the option `nodes.client.hardware.facter.report':

       … while evaluating the option `nodes.client.hardware.facter.reportPath':

       … while evaluating definitions from `/nix/store/5hqygz6mbjfcigd522vb486qjqgn7i9w-source/nixosModules/clanCore/nixos-facter.nix':

       (stack trace truncated; use '--show-trace' to show the full, detailed trace)

       error: build of '/nix/store/66ndbbglvmibsd07r7ajj48sdckr2kcz-merged-test-dir-clan-test-p2p-ssh-iroh.drv^out' failed: error: error: gRPC BuildDerivation on 'nix-store.geninf.io:50051' failed: build-x86-01: missing: /nix/store/66ndbbglvmibsd07r7ajj48sdckr2kcz-merged-test-dir-clan-test-p2p-ssh-iroh.drv
failed eval checks.x86_64-linux.pki —
error: … while evaluating the attribute 'drvPath' at «https://releases.nixos.org/nixos/26.05/nixos-26.05.11045.774debe7a0d1/nixexprs.tar.xz?narH …
error:
       … while evaluating the attribute 'drvPath'
         at «https://releases.nixos.org/nixos/26.05/nixos-26.05.11045.774debe7a0d1/nixexprs.tar.xz?narHash=sha256-S5MjznoY0gbQbcANPLz5RYjg%2B5/WQmFRgNbHcP%2Bydcg%3D»/lib/customisation.nix:427:7:
          426|     // {
          427|       drvPath =
             |       ^
          428|         assert condition;

       … while calling the 'derivationStrict' builtin
         at «nix-internal»/derivation-internal.nix:37:12:
           36|
           37|   strict = derivationStrict drvAttrs;
             |            ^
           38|

       … while evaluating the option `driverConfiguration.vlans':

       … while evaluating definitions from `/nix/store/csk881ggvmifg4qf1cal0r1ffflbmlhp-source/nixos/lib/testing/driver-configuration.nix':

       … while evaluating the option `nodes.caddy.networking.interfaces':

       … while evaluating definitions from `/nix/store/csk881ggvmifg4qf1cal0r1ffflbmlhp-source/nixos/modules/hardware/facter/networking':

       … while evaluating the option `nodes.caddy.hardware.facter.enable':

       … while evaluating the option `nodes.caddy.hardware.facter.report':

       … while evaluating the option `nodes.caddy.hardware.facter.reportPath':

       … while evaluating definitions from `/nix/store/5hqygz6mbjfcigd522vb486qjqgn7i9w-source/nixosModules/clanCore/nixos-facter.nix':

       (stack trace truncated; use '--show-trace' to show the full, detailed trace)

       error: build of '/nix/store/jifhxdzffi03r9ax3ri3nqdg8rcg62ax-merged-test-dir-pki.drv^out' failed: error: error: gRPC BuildDerivation on 'nix-store.geninf.io:50051' failed: build-x86-01: missing: /nix/store/jifhxdzffi03r9ax3ri3nqdg8rcg62ax-merged-test-dir-pki.drv
failed eval checks.x86_64-linux.service-dummy-test —
error: … while evaluating the attribute 'drvPath' at «https://releases.nixos.org/nixos/26.05/nixos-26.05.11045.774debe7a0d1/nixexprs.tar.xz?narH …
error:
       … while evaluating the attribute 'drvPath'
         at «https://releases.nixos.org/nixos/26.05/nixos-26.05.11045.774debe7a0d1/nixexprs.tar.xz?narHash=sha256-S5MjznoY0gbQbcANPLz5RYjg%2B5/WQmFRgNbHcP%2Bydcg%3D»/lib/customisation.nix:427:7:
          426|     // {
          427|       drvPath =
             |       ^
          428|         assert condition;

       … while calling the 'derivationStrict' builtin
         at «nix-internal»/derivation-internal.nix:37:12:
           36|
           37|   strict = derivationStrict drvAttrs;
             |            ^
           38|

       … while evaluating the option `nodes.admin1.networking.interfaces':

       … while evaluating definitions from `/nix/store/csk881ggvmifg4qf1cal0r1ffflbmlhp-source/nixos/modules/hardware/facter/networking':

       … while evaluating the option `nodes.admin1.hardware.facter.enable':

       … while evaluating the option `nodes.admin1.hardware.facter.report':

       … while evaluating the option `nodes.admin1.hardware.facter.reportPath':

       … while evaluating definitions from `/nix/store/5hqygz6mbjfcigd522vb486qjqgn7i9w-source/nixosModules/clanCore/nixos-facter.nix':

       (stack trace truncated; use '--show-trace' to show the full, detailed trace)

       error: build of '/nix/store/93r99wqlyhxzhj15ga3hbs1inkv5rq1w-merged-test-dir-service-dummy-test.drv^out' failed: error: error: gRPC BuildDerivation on 'nix-store.geninf.io:50051' failed: build-x86-01: missing: /nix/store/93r99wqlyhxzhj15ga3hbs1inkv5rq1w-merged-test-dir-service-dummy-test.drv
failed eval checks.x86_64-linux.service-dummy-test-from-flake —
error: … while evaluating the attribute 'drvPath' at «https://releases.nixos.org/nixos/26.05/nixos-26.05.11045.774debe7a0d1/nixexprs.tar.xz?narH …
error:
       … while evaluating the attribute 'drvPath'
         at «https://releases.nixos.org/nixos/26.05/nixos-26.05.11045.774debe7a0d1/nixexprs.tar.xz?narHash=sha256-S5MjznoY0gbQbcANPLz5RYjg%2B5/WQmFRgNbHcP%2Bydcg%3D»/lib/customisation.nix:427:7:
          426|     // {
          427|       drvPath =
             |       ^
          428|         assert condition;

       … while calling the 'derivationStrict' builtin
         at «nix-internal»/derivation-internal.nix:37:12:
           36|
           37|   strict = derivationStrict drvAttrs;
             |            ^
           38|

       … while evaluating the option `nodes.admin1.networking.interfaces':

       … while evaluating definitions from `/nix/store/csk881ggvmifg4qf1cal0r1ffflbmlhp-source/nixos/modules/hardware/facter/networking':

       … while evaluating the option `nodes.admin1.hardware.facter.enable':

       … while evaluating the option `nodes.admin1.hardware.facter.report':

       … while evaluating the option `nodes.admin1.hardware.facter.reportPath':

       … while evaluating definitions from `/nix/store/5hqygz6mbjfcigd522vb486qjqgn7i9w-source/nixosModules/clanCore/nixos-facter.nix':

       (stack trace truncated; use '--show-trace' to show the full, detailed trace)

       error: build of '/nix/store/qsfzrf8p2qb5lhr0nf2j11s5gyi38qbl-merged-test-dir-service-dummy-test-from-flake.drv^out' failed: error: error: gRPC BuildDerivation on 'nix-store.geninf.io:50051' failed: build-x86-01: missing: /nix/store/qsfzrf8p2qb5lhr0nf2j11s5gyi38qbl-merged-test-dir-service-dummy-test-from-flake.drv
failed eval checks.x86_64-linux.syncthing-service —
error: … while evaluating the attribute 'drvPath' at «https://releases.nixos.org/nixos/26.05/nixos-26.05.11045.774debe7a0d1/nixexprs.tar.xz?narH …
error:
       … while evaluating the attribute 'drvPath'
         at «https://releases.nixos.org/nixos/26.05/nixos-26.05.11045.774debe7a0d1/nixexprs.tar.xz?narHash=sha256-S5MjznoY0gbQbcANPLz5RYjg%2B5/WQmFRgNbHcP%2Bydcg%3D»/lib/customisation.nix:427:7:
          426|     // {
          427|       drvPath =
             |       ^
          428|         assert condition;

       … while calling the 'derivationStrict' builtin
         at «nix-internal»/derivation-internal.nix:37:12:
           36|
           37|   strict = derivationStrict drvAttrs;
             |            ^
           38|

       … while evaluating the option `nodes.machine1.networking.interfaces':

       … while evaluating definitions from `/nix/store/csk881ggvmifg4qf1cal0r1ffflbmlhp-source/nixos/modules/hardware/facter/networking':

       … while evaluating the option `nodes.machine1.hardware.facter.enable':

       … while evaluating the option `nodes.machine1.hardware.facter.report':

       … while evaluating the option `nodes.machine1.hardware.facter.reportPath':

       … while evaluating definitions from `/nix/store/5hqygz6mbjfcigd522vb486qjqgn7i9w-source/nixosModules/clanCore/nixos-facter.nix':

       (stack trace truncated; use '--show-trace' to show the full, detailed trace)

       error: build of '/nix/store/8ixbnwzwsadhimss7kqf9qm86dgjzchh-merged-test-dir-syncthing-service.drv^out' failed: error: error: gRPC BuildDerivation on 'nix-store.geninf.io:50051' failed: build-x86-01: missing: /nix/store/8ixbnwzwsadhimss7kqf9qm86dgjzchh-merged-test-dir-syncthing-service.drv
failed eval checks.x86_64-linux.users —
error: … while evaluating the attribute 'drvPath' at «https://releases.nixos.org/nixos/26.05/nixos-26.05.11045.774debe7a0d1/nixexprs.tar.xz?narH …
error:
       … while evaluating the attribute 'drvPath'
         at «https://releases.nixos.org/nixos/26.05/nixos-26.05.11045.774debe7a0d1/nixexprs.tar.xz?narHash=sha256-S5MjznoY0gbQbcANPLz5RYjg%2B5/WQmFRgNbHcP%2Bydcg%3D»/lib/customisation.nix:427:7:
          426|     // {
          427|       drvPath =
             |       ^
          428|         assert condition;

       … while calling the 'derivationStrict' builtin
         at «nix-internal»/derivation-internal.nix:37:12:
           36|
           37|   strict = derivationStrict drvAttrs;
             |            ^
           38|

       … while evaluating the option `nodes.server.networking.interfaces':

       … while evaluating definitions from `/nix/store/csk881ggvmifg4qf1cal0r1ffflbmlhp-source/nixos/modules/hardware/facter/networking':

       … while evaluating the option `nodes.server.hardware.facter.enable':

       … while evaluating the option `nodes.server.hardware.facter.report':

       … while evaluating the option `nodes.server.hardware.facter.reportPath':

       … while evaluating definitions from `/nix/store/5hqygz6mbjfcigd522vb486qjqgn7i9w-source/nixosModules/clanCore/nixos-facter.nix':

       (stack trace truncated; use '--show-trace' to show the full, detailed trace)

       error: build of '/nix/store/rx39mmxfmdxw2hp0hy63igdj7q0j0mqw-merged-test-dir-users.drv^out' failed: error: error: gRPC BuildDerivation on 'nix-store.geninf.io:50051' failed: build-x86-01: missing: /nix/store/rx39mmxfmdxw2hp0hy63igdj7q0j0mqw-merged-test-dir-users.drv
failed eval checks.x86_64-linux.wireguard —
error: … while evaluating the attribute 'drvPath' at «https://releases.nixos.org/nixos/26.05/nixos-26.05.11045.774debe7a0d1/nixexprs.tar.xz?narH …
error:
       … while evaluating the attribute 'drvPath'
         at «https://releases.nixos.org/nixos/26.05/nixos-26.05.11045.774debe7a0d1/nixexprs.tar.xz?narHash=sha256-S5MjznoY0gbQbcANPLz5RYjg%2B5/WQmFRgNbHcP%2Bydcg%3D»/lib/customisation.nix:427:7:
          426|     // {
          427|       drvPath =
             |       ^
          428|         assert condition;

       … while calling the 'derivationStrict' builtin
         at «nix-internal»/derivation-internal.nix:37:12:
           36|
           37|   strict = derivationStrict drvAttrs;
             |            ^
           38|

       … while evaluating the option `nodes.controller1.networking.interfaces':

       … while evaluating definitions from `/nix/store/csk881ggvmifg4qf1cal0r1ffflbmlhp-source/nixos/modules/hardware/facter/networking':

       … while evaluating the option `nodes.controller1.hardware.facter.enable':

       … while evaluating the option `nodes.controller1.hardware.facter.report':

       … while evaluating the option `nodes.controller1.hardware.facter.reportPath':

       … while evaluating definitions from `/nix/store/5hqygz6mbjfcigd522vb486qjqgn7i9w-source/nixosModules/clanCore/nixos-facter.nix':

       (stack trace truncated; use '--show-trace' to show the full, detailed trace)

       error: build of '/nix/store/k99w3l2gf1wlzjh8lihbaw1rh078jaka-merged-test-dir-wireguard.drv^out' failed: error: error: gRPC BuildDerivation on 'nix-store.geninf.io:50051' failed: build-x86-01: missing: /nix/store/k99w3l2gf1wlzjh8lihbaw1rh078jaka-merged-test-dir-wireguard.drv
failed eval checks.x86_64-linux.zerotier —
error: … while evaluating the attribute 'drvPath' at «https://releases.nixos.org/nixos/26.05/nixos-26.05.11045.774debe7a0d1/nixexprs.tar.xz?narH …
error:
       … while evaluating the attribute 'drvPath'
         at «https://releases.nixos.org/nixos/26.05/nixos-26.05.11045.774debe7a0d1/nixexprs.tar.xz?narHash=sha256-S5MjznoY0gbQbcANPLz5RYjg%2B5/WQmFRgNbHcP%2Bydcg%3D»/lib/customisation.nix:427:7:
          426|     // {
          427|       drvPath =
             |       ^
          428|         assert condition;

       … while calling the 'derivationStrict' builtin
         at «nix-internal»/derivation-internal.nix:37:12:
           36|
           37|   strict = derivationStrict drvAttrs;
             |            ^
           38|

       … while evaluating the option `driverConfiguration.vlans':

       … while evaluating definitions from `/nix/store/csk881ggvmifg4qf1cal0r1ffflbmlhp-source/nixos/lib/testing/driver-configuration.nix':

       … while evaluating the option `nodes.controller.networking.interfaces':

       … while evaluating definitions from `/nix/store/csk881ggvmifg4qf1cal0r1ffflbmlhp-source/nixos/modules/hardware/facter/networking':

       … while evaluating the option `nodes.controller.hardware.facter.enable':

       … while evaluating the option `nodes.controller.hardware.facter.report':

       … while evaluating the option `nodes.controller.hardware.facter.reportPath':

       … while evaluating definitions from `/nix/store/5hqygz6mbjfcigd522vb486qjqgn7i9w-source/nixosModules/clanCore/nixos-facter.nix':

       (stack trace truncated; use '--show-trace' to show the full, detailed trace)

       error: build of '/nix/store/plrafijfzclzss9dl00yfdm906l5p3xx-merged-test-dir-zerotier.drv^out' failed: error: gave up after 9 reschedules
failed eval checks.x86_64-linux.zerotier-multi-instance —
error: … while evaluating the attribute 'drvPath' at «https://releases.nixos.org/nixos/26.05/nixos-26.05.11045.774debe7a0d1/nixexprs.tar.xz?narH …
error:
       … while evaluating the attribute 'drvPath'
         at «https://releases.nixos.org/nixos/26.05/nixos-26.05.11045.774debe7a0d1/nixexprs.tar.xz?narHash=sha256-S5MjznoY0gbQbcANPLz5RYjg%2B5/WQmFRgNbHcP%2Bydcg%3D»/lib/customisation.nix:427:7:
          426|     // {
          427|       drvPath =
             |       ^
          428|         assert condition;

       … while calling the 'derivationStrict' builtin
         at «nix-internal»/derivation-internal.nix:37:12:
           36|
           37|   strict = derivationStrict drvAttrs;
             |            ^
           38|

       … while evaluating the option `driverConfiguration.vlans':

       … while evaluating definitions from `/nix/store/csk881ggvmifg4qf1cal0r1ffflbmlhp-source/nixos/lib/testing/driver-configuration.nix':

       … while evaluating the option `nodes.alpha.networking.interfaces':

       … while evaluating definitions from `/nix/store/csk881ggvmifg4qf1cal0r1ffflbmlhp-source/nixos/modules/hardware/facter/networking':

       … while evaluating the option `nodes.alpha.hardware.facter.enable':

       … while evaluating the option `nodes.alpha.hardware.facter.report':

       … while evaluating the option `nodes.alpha.hardware.facter.reportPath':

       … while evaluating definitions from `/nix/store/5hqygz6mbjfcigd522vb486qjqgn7i9w-source/nixosModules/clanCore/nixos-facter.nix':

       (stack trace truncated; use '--show-trace' to show the full, detailed trace)

       error: build of '/nix/store/gb0pvdh3p89c6fjyqzfav5y3w7dlns4m-merged-test-dir-zerotier-multi-instance.drv^out' failed: error: error: gRPC BuildDerivation on 'nix-store.geninf.io:50051' failed: build-x86-01: missing: /nix/store/gb0pvdh3p89c6fjyqzfav5y3w7dlns4m-merged-test-dir-zerotier-multi-instance.drv
20 succeeded
succeeded attributes
status attribute duration
loading…
80 already built
skipped attributes
status attribute duration
loading…