nixbot

builds

clan/clan-core build #951 failed

branch 26.05 · PR #8209 · commit ade4aeb77e · · took 56m 45s · eval 6m 5s

eval warnings 1 kind · 1 occurrence
  • warn /nix/var/nix does not exist, so Nix will use "/homeless-shelter/.local/share/nix/root" as a chroot store ×1

12 failed
failed attributes
status attribute duration
failed checks.aarch64-darwin.all-packages 13m 30s
setup: y64zr7zs1hr18jbqk4lajbk77qbkazi1-clan-site-assets.drv: no connected, non-draining worker for system 'aarch64-darwin' offers features {}, the workers offe …
setup:
y64zr7zs1hr18jbqk4lajbk77qbkazi1-clan-site-assets.drv: no connected, non-draining worker for system 'aarch64-darwin' offers features {}, the workers offer {}
yzis5i2zwqgkblifvpjg1bkrpfxcln6j-options.json.drv: no connected, non-draining worker for system 'aarch64-darwin' offers features {}, the workers offer {}
zkz51xbwp7hbwz94iykjdx4sxb25lsmp-clan-site.drv: no connected, non-draining worker for system 'aarch64-darwin' offers features {}, the workers offer {}
zwkzz07cvzm8z2yk09dxqf6bl8slgzck-options.json.drv: no connected, non-draining worker for system 'aarch64-darwin' offers features {}, the workers offer {}
8ddnhfxpj0h22m1hzzjzw3dc6g6nc94q--clan-ui-0.0.1-sources.drv: Stream removed (RST_STREAM (Received RST_STREAM with error code 2)), asking the scheduler again
warning: 8ddnhfxpj0h22m1hzzjzw3dc6g6nc94q--clan-ui-0.0.1-sources.drv: no connected, non-draining worker for system 'aarch64-darwin' offers features {}, the workers offer {}, waiting up to 120s for a worker
8ddnhfxpj0h22m1hzzjzw3dc6g6nc94q--clan-ui-0.0.1-sources.drv: no connected, non-draining worker for system 'aarch64-darwin' offers features {}, the workers offer {}
error: dependency 'y64zr7zs1hr18jbqk4lajbk77qbkazi1-clan-site-assets.drv' failed
failed checks.aarch64-darwin.clan-app-pytest 12m 38s
setup: nix-store.geninf.io:50051: no healthy upstream, retrying nix-store.geninf.io:50051: no healthy upstream, retrying nix-store.geninf.io:50051: no healthy u …
setup:
nix-store.geninf.io:50051: no healthy upstream, retrying
nix-store.geninf.io:50051: no healthy upstream, retrying
nix-store.geninf.io:50051: no healthy upstream, retrying
nix-store.geninf.io:50051: no healthy upstream, retrying
nix-store.geninf.io:50051: no healthy upstream, retrying
sjxhra2ssc7j291lk80xn2d746w29yf7-webview-nightly.drv: build04: not scheduled here: sjxhra2ssc7j291lk80xn2d746w29yf7-webview-nightly.drv, asking the scheduler again
vd9mywskvbczfazj42mp653vmrmzls66-python3-3.13.15-env.drv: no connected, non-draining worker for system 'aarch64-darwin' offers features {}, the workers offer {}
error: dependency 'knrr98lxl73lw2vagy15c79wivd3dppn-python3-3.13.15-env.drv' failed
failed checks.aarch64-darwin.clan-app-ui-lint 12m 39s
setup: /nix/store/wb0l3rqwmm1rhlah6b0xg967b4gs64vr-clan-app-ui-lint.drv warning: ignoring the client-specified setting 'store', because it is a restricted set …
setup:
  /nix/store/wb0l3rqwmm1rhlah6b0xg967b4gs64vr-clan-app-ui-lint.drv
warning: ignoring the client-specified setting 'store', because it is a restricted setting and you are not a trusted user
1aml0wfiw63lb95mcms3zml6qw3mnrn7-npm-config-hook.drv: build04: not scheduled here: 1aml0wfiw63lb95mcms3zml6qw3mnrn7-npm-config-hook.drv, asking the scheduler again
r09i2w8b2i4pan1sq7q17wbma4c3z9sr-clan-ts-api.drv: build04: not scheduled here: r09i2w8b2i4pan1sq7q17wbma4c3z9sr-clan-ts-api.drv, asking the scheduler again
8ddnhfxpj0h22m1hzzjzw3dc6g6nc94q--clan-ui-0.0.1-sources.drv: upstream connect error or disconnect/reset before headers. reset reason: connection termination, asking the scheduler again
warning: 8ddnhfxpj0h22m1hzzjzw3dc6g6nc94q--clan-ui-0.0.1-sources.drv: no connected, non-draining worker for system 'aarch64-darwin' offers features {}, the workers offer {}, waiting up to 120s for a worker
8ddnhfxpj0h22m1hzzjzw3dc6g6nc94q--clan-ui-0.0.1-sources.drv: no connected, non-draining worker for system 'aarch64-darwin' offers features {}, the workers offer {}
error: dependency '8ddnhfxpj0h22m1hzzjzw3dc6g6nc94q--clan-ui-0.0.1-sources.drv' failed
failed checks.aarch64-darwin.clan-app-ui-unit-tests 12m 38s
setup: /nix/store/jjlwnz5xzkxgql1v0dbbj611j6b4m469-zstd-1.5.7-dev warning: ignoring the client-specified setting 'store', because it is a restricted setting a …
setup:
  /nix/store/jjlwnz5xzkxgql1v0dbbj611j6b4m469-zstd-1.5.7-dev
warning: ignoring the client-specified setting 'store', because it is a restricted setting and you are not a trusted user
1aml0wfiw63lb95mcms3zml6qw3mnrn7-npm-config-hook.drv: build04: not scheduled here: 1aml0wfiw63lb95mcms3zml6qw3mnrn7-npm-config-hook.drv, asking the scheduler again
r09i2w8b2i4pan1sq7q17wbma4c3z9sr-clan-ts-api.drv: build04: not scheduled here: r09i2w8b2i4pan1sq7q17wbma4c3z9sr-clan-ts-api.drv, asking the scheduler again
8ddnhfxpj0h22m1hzzjzw3dc6g6nc94q--clan-ui-0.0.1-sources.drv: Stream removed (RST_STREAM (Received RST_STREAM with error code 2)), asking the scheduler again
warning: 8ddnhfxpj0h22m1hzzjzw3dc6g6nc94q--clan-ui-0.0.1-sources.drv: no connected, non-draining worker for system 'aarch64-darwin' offers features {}, the workers offer {}, waiting up to 120s for a worker
8ddnhfxpj0h22m1hzzjzw3dc6g6nc94q--clan-ui-0.0.1-sources.drv: no connected, non-draining worker for system 'aarch64-darwin' offers features {}, the workers offer {}
error: dependency '8ddnhfxpj0h22m1hzzjzw3dc6g6nc94q--clan-ui-0.0.1-sources.drv' failed
failed checks.aarch64-darwin.clan-deps 6m 39s
setup: nix-store.geninf.io:50051: no healthy upstream, retrying nix-store.geninf.io:50051: no healthy upstream, retrying nix-store.geninf.io:50051: no healthy u …
setup:
nix-store.geninf.io:50051: no healthy upstream, retrying
nix-store.geninf.io:50051: no healthy upstream, retrying
nix-store.geninf.io:50051: no healthy upstream, retrying
isp411ny1hwz53zamvnh3m2fkvhf6wlz-clan-deps.drv: build04: not scheduled here: isp411ny1hwz53zamvnh3m2fkvhf6wlz-clan-deps.drv, asking the scheduler again
isp411ny1hwz53zamvnh3m2fkvhf6wlz-clan-deps.drv: upstream connect error or disconnect/reset before headers. reset reason: connection termination, asking the scheduler again
warning: isp411ny1hwz53zamvnh3m2fkvhf6wlz-clan-deps.drv: no connected, non-draining worker for system 'aarch64-darwin' offers features {}, the workers offer {}, waiting up to 120s for a worker
isp411ny1hwz53zamvnh3m2fkvhf6wlz-clan-deps.drv: no connected, non-draining worker for system 'aarch64-darwin' offers features {}, the workers offer {}
error: no connected, non-draining worker for system 'aarch64-darwin' offers features {}, the workers offer {}
failed checks.aarch64-darwin.clan-pytest-with-core 15m 18s
setup: warning: iyy5v710drjvrwlrsrxwg74644fhxizg-zerotierone-1.16.0.drv: no connected, non-draining worker for system 'aarch64-darwin' offers features {}, the w …
setup:
warning: iyy5v710drjvrwlrsrxwg74644fhxizg-zerotierone-1.16.0.drv: no connected, non-draining worker for system 'aarch64-darwin' offers features {}, the workers offer {}, waiting up to 120s for a worker
kwx70917r3hamsb19vcrrk03rfx6s3q0-patchutils-0.4.2.drv: upstream connect error or disconnect/reset before headers. reset reason: connection termination, asking the scheduler again
iyy5v710drjvrwlrsrxwg74644fhxizg-zerotierone-1.16.0.drv: upstream connect error or disconnect/reset before headers. reset reason: connection termination, asking the scheduler again
warning: kwx70917r3hamsb19vcrrk03rfx6s3q0-patchutils-0.4.2.drv: no connected, non-draining worker for system 'aarch64-darwin' offers features {}, the workers offer {}, waiting up to 120s for a worker
warning: iyy5v710drjvrwlrsrxwg74644fhxizg-zerotierone-1.16.0.drv: no connected, non-draining worker for system 'aarch64-darwin' offers features {}, the workers offer {}, waiting up to 120s for a worker
iyy5v710drjvrwlrsrxwg74644fhxizg-zerotierone-1.16.0.drv: build04: not scheduled here: iyy5v710drjvrwlrsrxwg74644fhxizg-zerotierone-1.16.0.drv, asking the scheduler again
kwx70917r3hamsb19vcrrk03rfx6s3q0-patchutils-0.4.2.drv: build04: not scheduled here: kwx70917r3hamsb19vcrrk03rfx6s3q0-patchutils-0.4.2.drv, asking the scheduler again
error: dependency '366c2g6sl380mqrzlv7k1f1r7k496xxm-closure-info.drv' failed
failed checks.aarch64-darwin.clan-pytest-without-core 12m 45s
setup: nix-store.geninf.io:50051: no healthy upstream, retrying nix-store.geninf.io:50051: no healthy upstream, retrying nix-store.geninf.io:50051: no healthy u …
setup:
nix-store.geninf.io:50051: no healthy upstream, retrying
nix-store.geninf.io:50051: no healthy upstream, retrying
nix-store.geninf.io:50051: no healthy upstream, retrying
nix-store.geninf.io:50051: no healthy upstream, retrying
nix-store.geninf.io:50051: no healthy upstream, retrying
88w4npbsmv12rba7jsip5k80p1ymfl7w-closure-info.drv: build04: not scheduled here: 88w4npbsmv12rba7jsip5k80p1ymfl7w-closure-info.drv, asking the scheduler again
ykfqgv64z6b70d2kcr5y0xwvz6szrffv-python3-3.13.15-env.drv: no connected, non-draining worker for system 'aarch64-darwin' offers features {}, the workers offer {}
error: dependency 'ykfqgv64z6b70d2kcr5y0xwvz6szrffv-python3-3.13.15-env.drv' failed
failed checks.aarch64-darwin.devShell-clan-app 14m 3s
setup: 21iwi84mdzdx75j9isxcr76dbcvn5ssr-playwright-browsers.drv: no connected, non-draining worker for system 'aarch64-darwin' offers features {}, the workers o …
setup:
21iwi84mdzdx75j9isxcr76dbcvn5ssr-playwright-browsers.drv: no connected, non-draining worker for system 'aarch64-darwin' offers features {}, the workers offer {}
vd9mywskvbczfazj42mp653vmrmzls66-python3-3.13.15-env.drv: no connected, non-draining worker for system 'aarch64-darwin' offers features {}, the workers offer {}
xsk1817k9fdmalc6a7d0349migrlsd5s-python3-3.13.15-env.drv: no connected, non-draining worker for system 'aarch64-darwin' offers features {}, the workers offer {}
r09i2w8b2i4pan1sq7q17wbma4c3z9sr-clan-ts-api.drv: build04: not scheduled here: r09i2w8b2i4pan1sq7q17wbma4c3z9sr-clan-ts-api.drv, asking the scheduler again
bz1z3i36wxkr7fw1kylmbjc6xl9zzp79-sizelint.toml.drv: build04: not scheduled here: bz1z3i36wxkr7fw1kylmbjc6xl9zzp79-sizelint.toml.drv, asking the scheduler again
cc43y7b60p0jf8qb2cnjn8lnmxsjrp91-python3.13-datamodel-code-generator-0.52.1.drv: build04: not scheduled here: cc43y7b60p0jf8qb2cnjn8lnmxsjrp91-python3.13-datamodel-code-generator-0.52.1.drv, asking the scheduler again
lhz8cf7bl5wg0hsklh0gi9jgm8pxm4k4-vale.ini.drv: build04: not scheduled here: lhz8cf7bl5wg0hsklh0gi9jgm8pxm4k4-vale.ini.drv, asking the scheduler again
error: dependency '21iwi84mdzdx75j9isxcr76dbcvn5ssr-playwright-browsers.drv' failed
failed checks.aarch64-darwin.devShell-clan-site 17m 16s
setup: nix-store.geninf.io:50051: no healthy upstream, retrying nix-store.geninf.io:50051: no healthy upstream, retrying nix-store.geninf.io:50051: no healthy u …
setup:
nix-store.geninf.io:50051: no healthy upstream, retrying
nix-store.geninf.io:50051: no healthy upstream, retrying
nix-store.geninf.io:50051: no healthy upstream, retrying
nix-store.geninf.io:50051: no healthy upstream, retrying
nix-store.geninf.io:50051: no healthy upstream, retrying
nix-store.geninf.io:50051: no healthy upstream, retrying
zkz51xbwp7hbwz94iykjdx4sxb25lsmp-clan-site.drv: error: gRPC QueryValidPaths on 'nix-store.geninf.io:50051' failed: upstream connect error or disconnect/reset before headers. reset reason: connection termination
       hint: Set NIX_GRPC_DEBUG=1 for a handshake trace.
error: dependency 'zkz51xbwp7hbwz94iykjdx4sxb25lsmp-clan-site.drv' failed
failed checks.aarch64-darwin.lib-jsonschema-example-valid 6m 18s
setup: nix-store.geninf.io:50051: no healthy upstream, retrying nix-store.geninf.io:50051: no healthy upstream, retrying nix-store.geninf.io:50051: no healthy u …
setup:
nix-store.geninf.io:50051: no healthy upstream, retrying
nix-store.geninf.io:50051: no healthy upstream, retrying
nix-store.geninf.io:50051: no healthy upstream, retrying
nix-store.geninf.io:50051: no healthy upstream, retrying
nix-store.geninf.io:50051: no healthy upstream, retrying
nix-store.geninf.io:50051: no healthy upstream, retrying
nlqvn6m6cnycy5x707phagvl60nk440j-lib-jsonschema-example-valid.drv: error: gRPC QueryValidPaths on 'nix-store.geninf.io:50051' failed: upstream connect error or disconnect/reset before headers. reset reason: connection termination
       hint: Set NIX_GRPC_DEBUG=1 for a handshake trace.
error: error: gRPC QueryValidPaths on 'nix-store.geninf.io:50051' failed: upstream connect error or disconnect/reset before headers. reset reason: connection termination
              hint: Set NIX_GRPC_DEBUG=1 for a handshake trace.
failed checks.aarch64-darwin.zerotier-tools-pytest 6m 27s
setup: don't know how to build these paths: /nix/store/y0k57dwx98i4valrs472p32a4262yvn7-zerotier-tools-pytest.drv warning: ignoring the client-specified setti …
setup:
don't know how to build these paths:
  /nix/store/y0k57dwx98i4valrs472p32a4262yvn7-zerotier-tools-pytest.drv
warning: ignoring the client-specified setting 'store', because it is a restricted setting and you are not a trusted user
8ix2xqrmxsxw0493q06pmpgq9gbrcki5-python3-3.13.15-env.drv: Stream removed (RST_STREAM (Received RST_STREAM with error code 2)), asking the scheduler again
warning: 8ix2xqrmxsxw0493q06pmpgq9gbrcki5-python3-3.13.15-env.drv: no connected, non-draining worker for system 'aarch64-darwin' offers features {}, the workers offer {}, waiting up to 120s for a worker
8ix2xqrmxsxw0493q06pmpgq9gbrcki5-python3-3.13.15-env.drv: no connected, non-draining worker for system 'aarch64-darwin' offers features {}, the workers offer {}
error: dependency '8ix2xqrmxsxw0493q06pmpgq9gbrcki5-python3-3.13.15-env.drv' failed
failed checks.aarch64-linux.clan-test-iso 55m 49s
container-test-run-clan-test-iso: build01: building mj6j494fbfpx2gbl8kmzp9aw3x4c6qgh-container-test-run-clan-test-iso.drv build01: building mj6j494fbfpx2gbl8kmz …
container-test-run-clan-test-iso:
build01: building mj6j494fbfpx2gbl8kmzp9aw3x4c6qgh-container-test-run-clan-test-iso.drv
build01: building mj6j494fbfpx2gbl8kmzp9aw3x4c6qgh-container-test-run-clan-test-iso.drv
build01: building mj6j494fbfpx2gbl8kmzp9aw3x4c6qgh-container-test-run-clan-test-iso.drv
build01: building mj6j494fbfpx2gbl8kmzp9aw3x4c6qgh-container-test-run-clan-test-iso.drv
build01: building mj6j494fbfpx2gbl8kmzp9aw3x4c6qgh-container-test-run-clan-test-iso.drv
build01: building mj6j494fbfpx2gbl8kmzp9aw3x4c6qgh-container-test-run-clan-test-iso.drv
build01: building mj6j494fbfpx2gbl8kmzp9aw3x4c6qgh-container-test-run-clan-test-iso.drv
build01: building mj6j494fbfpx2gbl8kmzp9aw3x4c6qgh-container-test-run-clan-test-iso.drv
134 succeeded
succeeded attributes
status attribute duration
loading…
19 already built
skipped attributes
status attribute duration
loading…