clan/clan-core build #952 failed ← #951 #953 →
evaluation timed out after 3600 seconds
eval warnings
50 kinds
· 113 occurrences
- error …-intermediate.tmpl.drv: build01: publish failed: error: niks3 push: uploading objects: uploading build log log/…-intermediate.tmpl.drv: server returned 500: , asking the scheduler again ×2
- error …-generator-state-version.drv: build01: publish failed: error: niks3 push: uploading objects: uploading NAR nar/1l09pmw374svwzazsda2d6k5pj9i8z4lg9lvikm5a59vyahmgyxv.nar.zst: uploading NAR nar/1l09pmw374svwzazsda2d6k5pj9i8z4lg9lvikm5a59vyahmgyxv.nar.zst: server returned 500: , asking the scheduler again ×2
- error …-generator-openssh.drv: build01: publish failed: error: niks3 push: uploading objects: uploading NAR nar/07ym5nbf43kxx8h19b4a5v4nsq9yraqh563kfra73zgzi0k2di2d.nar.zst: uploading NAR nar/07ym5nbf43kxx8h19b4a5v4nsq9yraqh563kfra73zgzi0k2di2d.nar.zst: server returned 500: , asking the scheduler again ×3
- error …-root.tmpl.drv: build01: publish failed: error: niks3 push: uploading objects: uploading listing ….ls: server returned 500: , asking the scheduler again ×3
- error …-generator-step-intermediate-key.drv: build01: publish failed: error: niks3 push: uploading objects: uploading build log log/…-generator-step-intermediate-key.drv: server returned 500: , asking the scheduler again ×4
- error …-generator-root-password.drv: build01: publish failed: error: niks3 push: uploading objects: uploading build log log/…-generator-root-password.drv: server returned 500: , asking the scheduler again ×3
- error …-generator-borgbackup.drv: build01: publish failed: error: niks3 push: uploading objects: uploading build log log/…-generator-borgbackup.drv: server returned 500: , asking the scheduler again ×3
- error …-generator-data-mesher-network.drv: build01: publish failed: error: niks3 push: uploading objects: uploading NAR nar/00vv508kdms5q39hfrl2r6ifk3knslc6n0k5mf3f48xsdlcnivsw.nar.zst: uploading NAR nar/00vv508kdms5q39hfrl2r6ifk3knslc6n0k5mf3f48xsdlcnivsw.nar.zst: server returned 500: , asking the scheduler again ×1
- error …-generator-data-mesher-node-identity.drv: build01: publish failed: error: niks3 push: uploading objects: uploading build log log/…-generator-data-mesher-node-identity.drv: server returned 500: , asking the scheduler again ×3
- error …-generator-dm-dns-signing-key.drv: build01: publish failed: error: niks3 push: uploading objects: uploading NAR nar/0ajcni2fddrz75gbz9fmlvyy4gyffilaabajrip09w9zsm2vnpsj.nar.zst: uploading NAR nar/0ajcni2fddrz75gbz9fmlvyy4gyffilaabajrip09w9zsm2vnpsj.nar.zst: server returned 500: , asking the scheduler again ×4
- error …-generator-dm-dns.drv: build01: publish failed: error: niks3 push: uploading objects: uploading build log log/…-generator-dm-dns.drv: server returned 500: , asking the scheduler again ×2
- error …-generator-dyndns-namecheap-example.com.drv: build01: publish failed: error: niks3 push: uploading objects: uploading build log log/…-generator-dyndns-namecheap-example.com.drv: server returned 500: , asking the scheduler again ×2
- error …-generator-garage.drv: build01: publish failed: error: niks3 push: uploading objects: uploading build log log/…-generator-garage.drv: server returned 500: , asking the scheduler again ×2
- error …-generator-garage-shared.drv: build01: publish failed: error: niks3 push: uploading objects: uploading NAR nar/01nwfv2k4qj7jz7xd9n00740d20860v2yyjby01wr573nvm1g3yx.nar.zst: uploading NAR nar/01nwfv2k4qj7jz7xd9n00740d20860v2yyjby01wr573nvm1g3yx.nar.zst: server returned 500: , asking the scheduler again ×1
- error …-intermediate.tmpl.drv: build01: publish failed: error: niks3 push: uploading objects: uploading listing ….ls: server returned 500: , asking the scheduler again ×3
- error …-generator-machine-id.drv: build01: publish failed: error: niks3 push: uploading objects: uploading NAR nar/1cjzr7843afvpdiyfnyx8xa35aqy4223592xwss4p3hw5sym8af0.nar.zst: uploading NAR nar/1cjzr7843afvpdiyfnyx8xa35aqy4223592xwss4p3hw5sym8af0.nar.zst: server returned 500: , asking the scheduler again ×1
- error …-generator-matrix-password-someuser.drv: build01: publish failed: error: niks3 push: uploading objects: uploading build log log/…-generator-matrix-password-someuser.drv: server returned 500: , asking the scheduler again ×3
- error …-generator-matrix-synapse.drv: build01: publish failed: error: niks3 push: uploading objects: uploading build log log/…-generator-matrix-synapse.drv: server returned 500: , asking the scheduler again ×2
- error …-generator-matrix-password-admin.drv: build01: publish failed: error: niks3 push: uploading objects: uploading NAR nar/1zh2n437d7qfhlaf4ay30lbpasdf0b832hyw0ql72x1y3cpwbvy4.nar.zst: uploading NAR nar/1zh2n437d7qfhlaf4ay30lbpasdf0b832hyw0ql72x1y3cpwbvy4.nar.zst: server returned 500: , asking the scheduler again ×3
- error …-generator-mycelium.drv: build01: publish failed: error: niks3 push: uploading objects: uploading NAR nar/0gsb8jc9nr7diab0sywvjdhph6j6vinzbcjwcnvchw1fz4s2kv7s.nar.zst: uploading NAR nar/0gsb8jc9nr7diab0sywvjdhph6j6vinzbcjwcnvchw1fz4s2kv7s.nar.zst: server returned 500: , asking the scheduler again ×1
- error …-generator-ncps-ncps-test-private.drv: build01: publish failed: error: niks3 push: uploading objects: uploading build log log/…-generator-ncps-ncps-test-private.drv: server returned 500: , asking the scheduler again ×2
- error …-generator-grafana-secret.drv: build01: publish failed: error: niks3 push: uploading objects: uploading NAR nar/17a8a1v9svar1gamsx4rccw5m1bz396956j1zh46arknddv9x0y8.nar.zst: uploading NAR nar/17a8a1v9svar1gamsx4rccw5m1bz396956j1zh46arknddv9x0y8.nar.zst: server returned 500: , asking the scheduler again ×3
- error …-generator-grafana-admin.drv: build01: publish failed: error: niks3 push: uploading objects: uploading NAR nar/0kz29fsl44386jb1pkkr0j2dx8axhi4mfjz4fdf3r42l2mrpz1ck.nar.zst: uploading NAR nar/0kz29fsl44386jb1pkkr0j2dx8axhi4mfjz4fdf3r42l2mrpz1ck.nar.zst: server returned 500: , asking the scheduler again ×3
- error …-generator-state-version.drv: build01: publish failed: error: niks3 push: uploading objects: uploading build log log/…-generator-state-version.drv: server returned 500: , asking the scheduler again ×5
- error …-generator-loki-auth.drv: build01: publish failed: error: niks3 push: uploading objects: uploading build log log/…-generator-loki-auth.drv: server returned 500: , asking the scheduler again ×2
- error …-generator-ncps-ncps-test.drv: build01: publish failed: error: niks3 push: uploading objects: uploading NAR nar/14b6491nq0aj8dihm2b0vmak2jr1hjb8z39mmsz6c08s7zpxhn6s.nar.zst: uploading NAR nar/14b6491nq0aj8dihm2b0vmak2jr1hjb8z39mmsz6c08s7zpxhn6s.nar.zst: server returned 500: , asking the scheduler again ×2
- error …-generator-mimir-auth.drv: build01: publish failed: error: niks3 push: uploading objects: uploading NAR nar/1b2f25h6ih5vbsf3ccrhbw7rlssh6xn1j7gliy8n0f52blqsr77y.nar.zst: uploading NAR nar/1b2f25h6ih5vbsf3ccrhbw7rlssh6xn1j7gliy8n0f52blqsr77y.nar.zst: server returned 500: , asking the scheduler again ×3
- error …-generator-openssh.drv: build01: publish failed: error: niks3 push: uploading objects: uploading build log log/…-generator-openssh.drv: server returned 500: , asking the scheduler again ×2
- error …-generator-test-secret.drv: build01: publish failed: error: niks3 push: uploading objects: uploading build log log/…-generator-test-secret.drv: server returned 500: , asking the scheduler again ×3
- error …-generator-data-mesher-network.drv: build01: publish failed: error: niks3 push: uploading objects: uploading build log log/…-generator-data-mesher-network.drv: server returned 500: , asking the scheduler again ×4
- error …-generator-openssh-cert.drv: build01: publish failed: error: niks3 push: uploading objects: uploading build log log/…-generator-openssh-cert.drv: server returned 500: , asking the scheduler again ×1
- error …-generator-p2p-ssh-iroh-p2p-ssh-iroh-test.drv: build01: publish failed: error: niks3 push: uploading objects: uploading NAR nar/0hmhik31611nm2pncyj2awy7z8zbgdilj6gfv1yc6m17fm0kj1b2.nar.zst: uploading NAR nar/0hmhik31611nm2pncyj2awy7z8zbgdilj6gfv1yc6m17fm0kj1b2.nar.zst: server returned 500: , asking the scheduler again ×1
- error …-generator-root-password.drv: build01: publish failed: error: niks3 push: uploading objects: uploading NAR nar/1qz0msqyqn3w2pcqxg9fq5d9dn8m0zd31i9wzmg4ycayik34il6x.nar.zst: uploading NAR nar/1qz0msqyqn3w2pcqxg9fq5d9dn8m0zd31i9wzmg4ycayik34il6x.nar.zst: server returned 500: , asking the scheduler again ×1
- error …-generator-openssh-ca.drv: build01: publish failed: error: niks3 push: uploading objects: uploading build log log/…-generator-openssh-ca.drv: server returned 500: , asking the scheduler again ×3
- error …-generator-pki-root-ca.drv: build01: publish failed: error: niks3 push: uploading objects: uploading NAR nar/1nicgwjb5a6155wyl54lnr6vlf6mvh2vlpi7qrzsx17mcj0ylr9d.nar.zst: uploading NAR nar/1nicgwjb5a6155wyl54lnr6vlf6mvh2vlpi7qrzsx17mcj0ylr9d.nar.zst: server returned 500: , asking the scheduler again ×2
- error …-generator-cert-website.caddy.drv: build01: publish failed: error: niks3 push: uploading objects: uploading NAR nar/0h7hy5yjg4gmkfhbp1dqkcf7xf4mcmmwfwvvylzhjni1fwxx9q63.nar.zst: uploading NAR nar/0h7hy5yjg4gmkfhbp1dqkcf7xf4mcmmwfwvvylzhjni1fwxx9q63.nar.zst: server returned 500: , asking the scheduler again ×1
- error …-generator-cert-website.nginx.drv: build01: publish failed: error: niks3 push: uploading objects: uploading build log log/…-generator-cert-website.nginx.drv: server returned 500: , asking the scheduler again ×3
- error …-generator-data-mesher-node-identity.drv: build01: publish failed: error: niks3 push: uploading objects: uploading NAR nar/1q0vzn9wqdh58x7bxj1radiqjjzpdx5c55iac37m4k0dram2mm0z.nar.zst: uploading NAR nar/1q0vzn9wqdh58x7bxj1radiqjjzpdx5c55iac37m4k0dram2mm0z.nar.zst: server returned 500: , asking the scheduler again ×1
- error …-generator-dm-dns.drv: build01: publish failed: error: niks3 push: uploading objects: uploading NAR nar/068grbs42myf0bz30zbg918waqj88vlqcsswa4q10haxqln3srzr.nar.zst: uploading NAR nar/068grbs42myf0bz30zbg918waqj88vlqcsswa4q10haxqln3srzr.nar.zst: server returned 500: , asking the scheduler again ×2
- error …-generator-dyndns-namecheap-example.com.drv: build01: publish failed: error: niks3 push: uploading objects: uploading NAR nar/1w8q0da6xx2r4iyqnv9ai02f1qb88wvhgz6inb0xal2n8i7ja44v.nar.zst: uploading NAR nar/1w8q0da6xx2r4iyqnv9ai02f1qb88wvhgz6inb0xal2n8i7ja44v.nar.zst: server returned 500: , asking the scheduler again ×2
- error …-generator-garage.drv: build01: publish failed: error: niks3 push: uploading objects: uploading NAR nar/0sfpkh0m4q67r7dzd15xmd7mjmxa644jlzs3dika6rk22lmvzk6h.nar.zst: uploading NAR nar/0sfpkh0m4q67r7dzd15xmd7mjmxa644jlzs3dika6rk22lmvzk6h.nar.zst: server returned 500: , asking the scheduler again ×2
- error …-generator-garage-shared.drv: build01: publish failed: error: niks3 push: uploading objects: uploading build log log/…-generator-garage-shared.drv: server returned 500: , asking the scheduler again ×3
- error …-generator-machine-id.drv: build01: publish failed: error: niks3 push: uploading objects: uploading build log log/…-generator-machine-id.drv: server returned 500: , asking the scheduler again ×3
- error …-generator-matrix-synapse.drv: build01: publish failed: error: niks3 push: uploading objects: uploading NAR nar/1fif4manvp8nq8gm437kwwfr1dqkfd7cdidxwvi6f8n4kk54mirw.nar.zst: uploading NAR nar/1fif4manvp8nq8gm437kwwfr1dqkfd7cdidxwvi6f8n4kk54mirw.nar.zst: server returned 500: , asking the scheduler again ×2
- error …-generator-matrix-password-admin.drv: build01: publish failed: error: niks3 push: uploading objects: uploading build log log/…-generator-matrix-password-admin.drv: server returned 500: , asking the scheduler again ×1
- error …-generator-mycelium.drv: build01: publish failed: error: niks3 push: uploading objects: uploading build log log/…-generator-mycelium.drv: server returned 500: , asking the scheduler again ×3
- error …-generator-ncps-ncps-test-private.drv: build01: publish failed: error: niks3 push: uploading objects: uploading NAR nar/02ah3vi26djqcz66asmh45pfzj6151l258ch6ay6vxqs4dr01cxn.nar.zst: uploading NAR nar/02ah3vi26djqcz66asmh45pfzj6151l258ch6ay6vxqs4dr01cxn.nar.zst: server returned 500: , asking the scheduler again ×2
- error …-generator-grafana-secret.drv: build01: publish failed: error: niks3 push: uploading objects: uploading build log log/…-generator-grafana-secret.drv: server returned 500: , asking the scheduler again ×1
- error …-generator-loki-auth.drv: build01: publish failed: error: niks3 push: uploading objects: uploading NAR nar/1sbd5naqkcwdfdsklbidhzdf16982pvi582c8x2j471angy4z5xm.nar.zst: uploading NAR nar/1sbd5naqkcwdfdsklbidhzdf16982pvi582c8x2j471angy4z5xm.nar.zst: server returned 500: , asking the scheduler again ×1
- warn stdenv.isDarwin is deprecated, use stdenv.hostPlatform.isDarwin instead ×1
6 failed
| status | attribute | duration |
|---|---|---|
checks.aarch64-darwin.all-packages
|
6m 26s | |
setup: rv2msnap9wm2hqy8qykl5b2il5j40smc-options.json.drv: error: gRPC QueryValidPaths on 'nix-store.geninf.io:50051' failed: error: niks3 push: uploading object …setup: rv2msnap9wm2hqy8qykl5b2il5j40smc-options.json.drv: error: gRPC QueryValidPaths on 'nix-store.geninf.io:50051' failed: error: niks3 push: uploading objects: uploading NAR nar/1npg21nyzsdmh85xl56v8r9c0wwscxgiwz414zgc8s759y9z5a2x.nar.zst: uploading NAR nar/1npg21nyzsdmh85xl56v8r9c0wwscxgiwz414zgc8s759y9z5a2x.nar.zst: server returned 500: gpkgxc112hvrjq8gd8qvmwrmkcqn6im9-options.json.drv: error: gRPC QueryValidPaths on 'nix-store.geninf.io:50051' failed: error: niks3 push: uploading objects: uploading NAR nar/1aa6k5r9nnx5p1rr7mlyganyp859gsj89cychfvc0rss2zhq6y63.nar.zst: uploading NAR nar/1aa6k5r9nnx5p1rr7mlyganyp859gsj89cychfvc0rss2zhq6y63.nar.zst: server returned 500: 1ki7kcq37wzphk9y52mcq5n8raz8wsrd-zerotier-tools-0.1.0.drv: error: gRPC QueryValidPaths on 'nix-store.geninf.io:50051' failed: error: niks3 push: uploading objects: uploading NAR nar/0smcpqprmf4mhl6rgws409ais18hd281d3s0h9jj3ajxgr3arhi0.nar.zst: uploading NAR nar/0smcpqprmf4mhl6rgws409ais18hd281d3s0h9jj3ajxgr3arhi0.nar.zst: server returned 500: 0k4aa9mbc1x5p8cajyx9d5ldxpakd158-clan-ts-api.drv: error: gRPC QueryValidPaths on 'nix-store.geninf.io:50051' failed: error: niks3 push: uploading objects: uploading NAR nar/1pkdaa0jqcwwgxm7xy2alra8qz9hz08n74r8lkxa0q6z3bnp4k2k.nar.zst: uploading NAR nar/1pkdaa0jqcwwgxm7xy2alra8qz9hz08n74r8lkxa0q6z3bnp4k2k.nar.zst: server returned 500: yr31adlxsz8wk04jhgbz4l0cabrblqsv-clan-runtime.drv: error: gRPC QueryValidPaths on 'nix-store.geninf.io:50051' failed: error: niks3 push: uploading objects: uploading NAR nar/05kc78yncjsd06m21wxcfs9xbga47jbg37cy59vqgixixyjhi573.nar.zst: uploading NAR nar/05kc78yncjsd06m21wxcfs9xbga47jbg37cy59vqgixixyjhi573.nar.zst: server returned 500: 6kiwiqlm8npzf66482xngdyl4144h8d0-python3.14-datamodel-code-generator-0.52.1.drv: error: gRPC QueryValidPaths on 'nix-store.geninf.io:50051' failed: error: niks3 push: uploading objects: uploading NAR nar/13xa4bivk1g2vfhf3pykpn81s7g0rbps67knag4w8ha5lbwcw8s7.nar.zst: uploading NAR nar/13xa4bivk1g2vfhf3pykpn81s7g0rbps67knag4w8ha5lbwcw8s7.nar.zst: server returned 500: gnwa04r11zy2hcmk4yizrqii9q7w1w2x-clan-core-flake.drv: error: gRPC QueryValidPaths on 'nix-store.geninf.io:50051' failed: error: niks3 push: uploading objects: uploading NAR nar/0xcxairy95xiz38dvnza3vdj0113vdzgga83r53rlwd2zgh9arb0.nar.zst: uploading NAR nar/0xcxairy95xiz38dvnza3vdj0113vdzgga83r53rlwd2zgh9arb0.nar.zst: server returned 500: error: dependency '0ix6rsl0y1sxw4j6rcmmlki1gc88bwzr-clan-cli-docs.drv' failed |
||
checks.aarch64-darwin.clan-pytest-with-core
|
8m 31s | |
setup: naq0lhvd4d89v1h3awb2k5i9wj88lkya-patchutils-0.4.2.drv: build04: publish failed: error: niks3 push: uploading objects: uploading listing 0c0vh0q03z57mb2r2 …setup: naq0lhvd4d89v1h3awb2k5i9wj88lkya-patchutils-0.4.2.drv: build04: publish failed: error: niks3 push: uploading objects: uploading listing 0c0vh0q03z57mb2r2vsfj1562ch03qy3.ls: server returned 500: , asking the scheduler again 6d3g3bm6i3nqmf3l78mjkspa5b2p2b4k-patchutils-0.3.3.drv: build04: publish failed: error: niks3 push: uploading objects: uploading build log log/6d3g3bm6i3nqmf3l78mjkspa5b2p2b4k-patchutils-0.3.3.drv: server returned 500: , asking the scheduler again ld82mb2ylhmmiq9pza3q2c4a2mlsxi5m-make-shell-wrapper-hook.drv: build04: publish failed: error: niks3 push: uploading objects: uploading build log log/ld82mb2ylhmmiq9pza3q2c4a2mlsxi5m-make-shell-wrapper-hook.drv: server returned 500: , asking the scheduler again 97nb2m2c7b44cb4mmmkx13jyn5y95z3b-patchutils-0.3.3.drv: build04: publish failed: error: niks3 push: uploading objects: uploading NAR nar/0w5fsnif5x6ii7k7b977l0yj6nwx3qa4bsn80027cc1vfdci11dz.nar.zst: uploading NAR nar/0w5fsnif5x6ii7k7b977l0yj6nwx3qa4bsn80027cc1vfdci11dz.nar.zst: server returned 500: , asking the scheduler again whgwc6fx9whfsfgaiw4h1v221i8jmnfm-patchutils-0.3.3.drv: build04: publish failed: error: niks3 push: uploading objects: uploading listing s8d96gyfv182ysdnjg5my5p8drg1kbxi.ls: server returned 500: , asking the scheduler again naq0lhvd4d89v1h3awb2k5i9wj88lkya-patchutils-0.4.2.drv: build04: publish failed: error: niks3 push: uploading objects: uploading NAR nar/1k2yvgajgszsdgs692kg8k8xq9jcdw2s8ma386ic7dsf3j7jagrs.nar.zst: uploading NAR nar/1k2yvgajgszsdgs692kg8k8xq9jcdw2s8ma386ic7dsf3j7jagrs.nar.zst: server returned 500: , asking the scheduler again 6d3g3bm6i3nqmf3l78mjkspa5b2p2b4k-patchutils-0.3.3.drv: build04: publish failed: error: niks3 push: uploading objects: uploading listing 0c0vh0q03z57mb2r2vsfj1562ch03qy3.ls: server returned 500: , asking the scheduler again error: dependency '3qspkcd21yf6kid241jjazyvnnl7m6wd-clan-core-flake.drv' failed |
||
checks.aarch64-darwin.devShell-clan-site
|
3m 40s | |
setup: sylswa286gr8blr40qa9iqk8hk6a8rgp-options.json.drv: error: gRPC QueryValidPaths on 'nix-store.geninf.io:50051' failed: error: niks3 push: uploading object …setup: sylswa286gr8blr40qa9iqk8hk6a8rgp-options.json.drv: error: gRPC QueryValidPaths on 'nix-store.geninf.io:50051' failed: error: niks3 push: uploading objects: uploading NAR nar/0baalbgm34biylry96z3rgcrcqiwkdylqiscsjhsvm5yjc3wkhjr.nar.zst: uploading NAR nar/0baalbgm34biylry96z3rgcrcqiwkdylqiscsjhsvm5yjc3wkhjr.nar.zst: server returned 500: vw0vr3mzz2gg5kisw3n8v4nq7mzwg74h-options.json.drv: error: gRPC QueryValidPaths on 'nix-store.geninf.io:50051' failed: error: niks3 push: uploading objects: uploading NAR nar/0lw4qjp1kryh58pbzybd37wc8sp4icm1bvbhhhhhhdkz2qmi8p22.nar.zst: uploading NAR nar/0lw4qjp1kryh58pbzybd37wc8sp4icm1bvbhhhhhhdkz2qmi8p22.nar.zst: server returned 500: zx6kvmsla5213608hhrxn3ybkqjv44r9-options.json.drv: error: gRPC QueryValidPaths on 'nix-store.geninf.io:50051' failed: error: niks3 push: uploading objects: uploading NAR nar/0rxy74lwqi3kv631fvpwf1dxvkh7jwbh50mhvarh0f86ybpqyrbx.nar.zst: uploading NAR nar/0rxy74lwqi3kv631fvpwf1dxvkh7jwbh50mhvarh0f86ybpqyrbx.nar.zst: server returned 500: y77hfh8ixc0khbnvrfc8qrgyw2m3vcig-options.json.drv: error: gRPC QueryValidPaths on 'nix-store.geninf.io:50051' failed: error: niks3 push: uploading objects: uploading NAR nar/0za100wbhhixcv1v7lwd9g0693d4ncv1lz73jmk39r8xawj00q64.nar.zst: uploading NAR nar/0za100wbhhixcv1v7lwd9g0693d4ncv1lz73jmk39r8xawj00q64.nar.zst: server returned 500: z97981zll54jg54schcmxjv6afnrma1i-options.json.drv: error: gRPC QueryValidPaths on 'nix-store.geninf.io:50051' failed: error: niks3 push: uploading objects: uploading NAR nar/1cacq7bqb8vra23dayq7kk88clbrlbzs3hrv6kmk5h29pbyd9g38.nar.zst: uploading NAR nar/1cacq7bqb8vra23dayq7kk88clbrlbzs3hrv6kmk5h29pbyd9g38.nar.zst: server returned 500: gpkgxc112hvrjq8gd8qvmwrmkcqn6im9-options.json.drv: error: gRPC QueryValidPaths on 'nix-store.geninf.io:50051' failed: error: niks3 push: uploading objects: uploading NAR nar/0hzsa7df9smdh9ckydh9v6mqanx1igj6iw9bhihxg7jicjlds7w6.nar.zst: uploading NAR nar/0hzsa7df9smdh9ckydh9v6mqanx1igj6iw9bhihxg7jicjlds7w6.nar.zst: server returned 500: rv2msnap9wm2hqy8qykl5b2il5j40smc-options.json.drv: error: gRPC QueryValidPaths on 'nix-store.geninf.io:50051' failed: error: niks3 push: uploading objects: uploading NAR nar/04ha3kgn7ismr27lhqhf1vjzkcw199b9irsw6xb6lhyvw3mk9ddx.nar.zst: uploading NAR nar/04ha3kgn7ismr27lhqhf1vjzkcw199b9irsw6xb6lhyvw3mk9ddx.nar.zst: server returned 500: error: dependency 'kn07q952r0ic329b1h14jvwcd22q2x87-generated-docs.drv' failed |
||
checks.aarch64-darwin.eval-tests
|
6m 17s | |
setup: dyhnngqip590h5bdmw0sh3wf489f922w-evalCheck-eval-tests-syncthing.drv: error: gRPC QueryValidPaths on 'nix-store.geninf.io:50051' failed: error: niks3 push …setup: dyhnngqip590h5bdmw0sh3wf489f922w-evalCheck-eval-tests-syncthing.drv: error: gRPC QueryValidPaths on 'nix-store.geninf.io:50051' failed: error: niks3 push: uploading objects: uploading NAR nar/0409i5ppdh7ispv5r4xb9gnv0hszhf33smiv27nb487bh65nyjk1.nar.zst: uploading NAR nar/0409i5ppdh7ispv5r4xb9gnv0hszhf33smiv27nb487bh65nyjk1.nar.zst: server returned 500: gs5gp53grx28ds1fs7wsskq7048xiqy0-evalCheck-eval-vars-backends.drv: error: gRPC QueryValidPaths on 'nix-store.geninf.io:50051' failed: error: niks3 push: uploading objects: uploading NAR nar/1p4h1dyi8ylqc51bm0yg7pj8s6c33f225p6vgg9ap0wsvkgzf04r.nar.zst: uploading NAR nar/1p4h1dyi8ylqc51bm0yg7pj8s6c33f225p6vgg9ap0wsvkgzf04r.nar.zst: server returned 500: hh2gldyq1jzrpcmjla1f1g8vwvfvz4f5-evalCheck-eval-tests-installer.drv: error: gRPC QueryValidPaths on 'nix-store.geninf.io:50051' failed: error: niks3 push: uploading objects: uploading NAR nar/1raln2nyp09868njhkalxvawwgbysn5hbgdnj5pfx8yk5pax7hjn.nar.zst: uploading NAR nar/1raln2nyp09868njhkalxvawwgbysn5hbgdnj5pfx8yk5pax7hjn.nar.zst: server returned 500: kivwwbngzi54s5wbf3f40rx67al6l7vl-evalCheck-eval-age-source-path.drv: error: gRPC QueryValidPaths on 'nix-store.geninf.io:50051' failed: error: niks3 push: uploading objects: uploading NAR nar/102ggn1vgrjpvgkwll3icbfb5fjycv2k21c8l5h9mqnf4xyawl2n.nar.zst: uploading NAR nar/102ggn1vgrjpvgkwll3icbfb5fjycv2k21c8l5h9mqnf4xyawl2n.nar.zst: server returned 500: mgp1izjq0a5nnnr8k0220mprvn1fbjc2-evalCheck-eval-lib-exports.drv: error: gRPC QueryValidPaths on 'nix-store.geninf.io:50051' failed: error: niks3 push: uploading objects: uploading NAR nar/0za100wbhhixcv1v7lwd9g0693d4ncv1lz73jmk39r8xawj00q64.nar.zst: uploading NAR nar/0za100wbhhixcv1v7lwd9g0693d4ncv1lz73jmk39r8xawj00q64.nar.zst: server returned 500: yk403kz85kqcb8rzqsjx1aw614mhbgjc-evalCheck-eval-lib-relativeDir.drv: error: gRPC QueryValidPaths on 'nix-store.geninf.io:50051' failed: error: niks3 push: uploading objects: uploading NAR nar/1dzrrp5f8x1a0772b9mqv3q9spjkqjyfs895lxsjbi8m262634cj.nar.zst: uploading NAR nar/1dzrrp5f8x1a0772b9mqv3q9spjkqjyfs895lxsjbi8m262634cj.nar.zst: server returned 500: nkg0l7xynf7ynzcq18j204kmwfqgksb4-evalCheck-eval-lib-resolve-module.drv: error: gRPC QueryValidPaths on 'nix-store.geninf.io:50051' failed: error: niks3 push: uploading objects: uploading NAR nar/0aknrdjiv4rrkdkr6j260xjggyf2szm5mlh080806gzz7p42avzx.nar.zst: uploading NAR nar/0aknrdjiv4rrkdkr6j260xjggyf2szm5mlh080806gzz7p42avzx.nar.zst: server returned 500: error: dependency '0a0d6aymrlbixzihm1x54m2s7rci01rl-evalCheck-lib-jsonschema-unit-tests.drv' failed |
||
checks.aarch64-darwin.treefmt
|
5s | |
setup: this derivation will be built: /nix/store/jq3i7ah625b0xr9nnxv5158ngx275dn6-treefmt-check.drv these 2 paths will be fetched (4.9 MiB download, 12.6 MiB …setup: this derivation will be built: /nix/store/jq3i7ah625b0xr9nnxv5158ngx275dn6-treefmt-check.drv these 2 paths will be fetched (4.9 MiB download, 12.6 MiB unpacked): /nix/store/wzixjr3yb40a13m2q654hm3bdjn6sal3-git-lfs-3.8.0 /nix/store/9w7180x9zhy6f7acldggqra45jxgjnvc-stdenv-darwin-no-cc warning: ignoring the client-specified setting 'store', because it is a restricted setting and you are not a trusted user jq3i7ah625b0xr9nnxv5158ngx275dn6-treefmt-check.drv: error: gRPC QueryValidPaths on 'nix-store.geninf.io:50051' failed: error: niks3 push: uploading objects: uploading NAR nar/1xrzwjik2kbyp85yjihrznzmzq3x0vfpix6h720dgq14884qdf4v.nar.zst: uploading NAR nar/1xrzwjik2kbyp85yjihrznzmzq3x0vfpix6h720dgq14884qdf4v.nar.zst: server returned 500: error: error: gRPC QueryValidPaths on 'nix-store.geninf.io:50051' failed: error: niks3 push: uploading objects: uploading NAR nar/1xrzwjik2kbyp85yjihrznzmzq3x0vfpix6h720dgq14884qdf4v.nar.zst: uploading NAR nar/1xrzwjik2kbyp85yjihrznzmzq3x0vfpix6h720dgq14884qdf4v.nar.zst: server returned 500: |
||
checks.aarch64-linux.nixos-documentation
|
12s | |
setup: don't know how to build these paths: /nix/store/qkgpvmsznahf5zlmz4vgqwh14r6xcab1-nixos-system-test-documentation-26.11.20261005.aa48d34.drv warning: ig …setup: don't know how to build these paths: /nix/store/qkgpvmsznahf5zlmz4vgqwh14r6xcab1-nixos-system-test-documentation-26.11.20261005.aa48d34.drv warning: ignoring the client-specified setting 'store', because it is a restricted setting and you are not a trusted user npnhzazq5xmy1ag4wz1a9xz1sqxh50jw-options.json.drv: error: gRPC AddMultipleToStore on 'nix-store.geninf.io:50051' failed: error: niks3 push: uploading objects: uploading NAR nar/1vw55rzwqy8mwq0bpawqywq2frrh1407aj1z905in5416b6804aa.nar.zst: uploading NAR nar/1vw55rzwqy8mwq0bpawqywq2frrh1407aj1z905in5416b6804aa.nar.zst: server returned 500: error: dependency 'rnr28d50fnfqcypcq2vm2ar3aqfp743j-system-path.drv' failed |
||
8 cancelled ⚠ 1
| status | attribute | duration |
|---|---|---|
checks.aarch64-linux.all-packages
|
59m 30s | |
checks.aarch64-linux.clan-pytest-with-core
|
59m 47s | |
checks.aarch64-linux.clan-site-lint
|
59m 47s | |
checks.aarch64-linux.clan-test-iso
|
59m 30s | |
checks.aarch64-linux.devShell-clan-site
|
59m 47s | |
checks.aarch64-linux.devShell-docs
|
59m 47s | |
checks.aarch64-linux.eval-tests
|
59m 47s | |
checks.aarch64-linux.nixos-test-age-backend
|
59m 30s |
28 already built
| status | attribute | duration |
|---|---|---|
| loading… | ||