nixbot

builds

clan/clan-core build #953 failed

branch 26.05 · PR #8177 · commit 6827559e70 · · took 3h 10m · eval 12m 28s

eval warnings 22 kinds · 80 occurrences
  • error ×20
  • error Refusing to evaluate package 'pnpm-10.34.0' in /nix/store/…-source/pkgs/development/tools/pnpm/generic.nix:170 because it is marked as insecure ×10
  • error …-generator-borgbackup.drv: build-x86-01: publish failed: error: niks3 push: uploading objects: uploading build log log/…-generator-borgbackup.drv: server returned 500: , asking the scheduler again ×6
  • error …-test-vars-generated.drv: error: gRPC AddMultipleToStore on 'nix-store.geninf.io:50051' failed: error: niks3 push: uploading objects: uploading NAR nar/17yzwrscxq81667n7ll5hbr1gb7jr85w8z0hdb1fgr19ks9k8nnf.nar.zst: uploading NAR nar/17yzwrscxq81667n7ll5hbr1gb7jr85w8z0hdb1fgr19ks9k8nnf.nar.zst: server returned 500: ×2
  • error build of '/nix/store/…-merged-test-dir-certificates.drv^out' failed: error: dependency '…-test-vars-generated.drv' failed ×2
  • error …-generator-borgbackup.drv: gi-build-x86-02: publish failed: error: niks3 push: uploading objects: uploading build log log/…-generator-borgbackup.drv: server returned 500: , asking the scheduler again ×2
  • error …-generator-borgbackup.drv: gi-build-x86-02: publish failed: error: niks3 push: uploading objects: uploading NAR nar/0hz2ng2i0gjvvnw7la7abibr81mfv906ngl2rcdycj4i70cbkp4s.nar.zst: uploading NAR nar/0hz2ng2i0gjvvnw7la7abibr81mfv906ngl2rcdycj4i70cbkp4s.nar.zst: server returned 500: , asking the scheduler again ×1
  • error build of '/nix/store/…-merged-test-dir-borgbackup.drv^out' failed: error: dependency '…-test-vars-generated.drv' failed ×1
  • error …-generator-syncthing.drv: gi-build-x86-02: publish failed: error: niks3 push: uploading objects: uploading NAR nar/1kxbhz2gqw54rmbzrc5zn3zpvvn6hp3x3zq5yjdspfr15lwv0rnq.nar.zst: uploading NAR nar/1kxbhz2gqw54rmbzrc5zn3zpvvn6hp3x3zq5yjdspfr15lwv0rnq.nar.zst: server returned 500: , asking the scheduler again ×2
  • error …-test-vars-generated.drv: error: gRPC AddMultipleToStore on 'nix-store.geninf.io:50051' failed: error: niks3 push: uploading objects: uploading NAR nar/0xnxnph6h60s1253h6kjjvqmylgfbmfbnd8vs0p8bylag2hv43ka.nar.zst: uploading NAR nar/0xnxnph6h60s1253h6kjjvqmylgfbmfbnd8vs0p8bylag2hv43ka.nar.zst: server returned 500: ×1
  • error build of '/nix/store/…-merged-test-dir-wireguard.drv^out' failed: error: dependency '…-test-vars-generated.drv' failed ×2
  • error …-generator-syncthing.drv: build-x86-01: publish failed: error: niks3 push: uploading objects: uploading build log log/…-generator-syncthing.drv: server returned 500: , asking the scheduler again ×2
  • error …-test-vars-generated.drv: gi-build-x86-02: publish failed: error: niks3 push: uploading objects: uploading NAR nar/1kdgg8z7yrnn88x7h7sym9xph8qdi1973hx3bkbaiqm0h5p8x0fp.nar.zst: uploading NAR nar/1kdgg8z7yrnn88x7h7sym9xph8qdi1973hx3bkbaiqm0h5p8x0fp.nar.zst: server returned 500: , asking the scheduler again ×4
  • error …-test-vars-generated.drv: gi-build-x86-02: publish failed: error: niks3 push: uploading objects: uploading build log log/…-test-vars-generated.drv: server returned 500: , asking the scheduler again ×10
  • error gRPC QueryValidPaths on 'nix-store.geninf.io:50051' failed: error: niks3 push: uploading objects: uploading build log log/…-generator-borgbackup.drv: server returned 500: ×1
  • error …-generator-syncthing.drv: gi-build-x86-02: publish failed: error: niks3 push: uploading objects: uploading build log log/…-generator-syncthing.drv: server returned 500: , asking the scheduler again ×5
  • error build of '/nix/store/…-merged-test-dir-syncthing-service.drv^out' failed: error: dependency '…-test-vars-generated.drv' failed ×1
  • error …-test-vars-generated.drv: build-x86-01: publish failed: error: niks3 push: uploading objects: uploading build log log/…-test-vars-generated.drv: server returned 500: , asking the scheduler again ×2
  • error build of '/nix/store/…-merged-test-dir-users.drv^out' failed: error: dependency '…-test-vars-generated.drv' failed ×2
  • error gRPC QueryValidPaths on 'nix-store.geninf.io:50051' failed: error: niks3 push: uploading objects: uploading build log log/…-generator-syncthing.drv: server returned 500: ×1
  • error …-test-vars-generated.drv: build-x86-01: publish failed: error: niks3 push: uploading objects: uploading NAR nar/0i9rasmww3m4lh47w9s9w7yb02pw1gp91ckmhsaaz8252ixgnc4y.nar.zst: uploading NAR nar/0i9rasmww3m4lh47w9s9w7yb02pw1gp91ckmhsaaz8252ixgnc4y.nar.zst: server returned 500: , asking the scheduler again ×2
  • error …-test-vars-generated.drv: error: gRPC AddMultipleToStore on 'nix-store.geninf.io:50051' failed: error: niks3 push: uploading objects: uploading NAR nar/1l72b349q17n1x37hxi5zmr0c6x5hryrsd9msla1yiviw84rlm0q.nar.zst: uploading NAR nar/1l72b349q17n1x37hxi5zmr0c6x5hryrsd9msla1yiviw84rlm0q.nar.zst: server returned 500: ×1

147 failed
failed attributes
status attribute duration
failed eval checks.aarch64-darwin.all-packages —
error: … while calling the 'derivationStrict' builtin at «nix-internal»/derivation-internal.nix:37:12: 36| 37| strict = …
error:
       … while calling the 'derivationStrict' builtin
         at «nix-internal»/derivation-internal.nix:37:12:
           36|
           37|   strict = derivationStrict drvAttrs;
             |            ^
           38|

       … while evaluating derivation 'all-packages'
         whose name attribute is located at «https://releases.nixos.org/nixos/26.05/nixos-26.05.11767.7993f34ee47e/nixexprs.tar.xz?narHash=sha256-TnALPKp8o/dtUYgE243iQMbRP4183ZPhWu33FD05k/4%3D»/pkgs/stdenv/generic/make-derivation.nix:647:11

       … while evaluating attribute 'buildCommand' of derivation 'all-packages'
         at «https://releases.nixos.org/nixos/26.05/nixos-26.05.11767.7993f34ee47e/nixexprs.tar.xz?narHash=sha256-TnALPKp8o/dtUYgE243iQMbRP4183ZPhWu33FD05k/4%3D»/pkgs/build-support/trivial-builders/default.nix:81:17:
           80|         enableParallelBuilding = true;
           81|         inherit buildCommand name;
             |                 ^
           82|         passAsFile = [ "buildCommand" ] ++ (derivationArgs.passAsFile or [ ]);

       (stack trace truncated; use '--show-trace' to show the full, detailed trace)

       error: Refusing to evaluate package 'pnpm-10.34.0' in /nix/store/dqn2ddd6vpxbgx2jzparmg93hly0x1mj-source/pkgs/development/tools/pnpm/generic.nix:170 because it is marked as insecure

       Known issues:
        - CVE-2026-55487
        - CVE-2026-55698
        - CVE-2026-55180
        - CVE-2026-55697
        - CVE-2026-59194
        - CVE-2026-59195
        - CVE-2026-59196
        - CVE-2026-82392
        - CVE-2026-82393

       You can install it anyway by allowing this package, using the
       following methods:

       a) To temporarily allow all insecure packages, you can use an environment
          variable for a single invocation of the nix tools:

            $ export NIXPKGS_ALLOW_INSECURE=1

          Note: When using `nix shell`, `nix build`, `nix develop`, etc with a flake,
                then pass `--impure` in order to allow use of environment variables.

       b) for `nixos-rebuild` you can add ‘pnpm-10.34.0’ to
          `nixpkgs.config.permittedInsecurePackages` in the configuration.nix,
          like so:

            {
              nixpkgs.config.permittedInsecurePackages = [
                "pnpm-10.34.0"
              ];
            }

       c) For `nix-env`, `nix-build`, `nix-shell` or any other Nix command you can add
          ‘pnpm-10.34.0’ to `permittedInsecurePackages` in
          ~/.config/nixpkgs/config.nix, like so:

            {
              permittedInsecurePackages = [
                "pnpm-10.34.0"
              ];
            }
failed checks.aarch64-darwin.clan-app-pytest 1m 11s
setup: /nix/store/wr82xdgrbzxa546ifmvkzqn46swr220f-zstd-1.5.7-bin /nix/store/gr8mnaz86kwnw1a017hvqyx3jkgryb3q-zstd-1.5.7-dev /nix/store/0jqjvpyfiawp19ipfb …
setup:
  /nix/store/wr82xdgrbzxa546ifmvkzqn46swr220f-zstd-1.5.7-bin
  /nix/store/gr8mnaz86kwnw1a017hvqyx3jkgryb3q-zstd-1.5.7-dev
  /nix/store/0jqjvpyfiawp19ipfb51p0ssvjw62p86-zxing-cpp-2.3.0
warning: ignoring the client-specified setting 'store', because it is a restricted setting and you are not a trusted user
q1qgvwm3lcfpsk9zbl566bfa2y5ilwk5-python3-3.13.15-env.drv: error: gRPC QueryValidPaths on 'nix-store.geninf.io:50051' failed: error: niks3 push: uploading objects: uploading NAR nar/03yd1j50rq9s8m5jlfm20g2bfm86gg7sqx6zyf9jkm5gh1d37yb6.nar.zst: uploading NAR nar/03yd1j50rq9s8m5jlfm20g2bfm86gg7sqx6zyf9jkm5gh1d37yb6.nar.zst: server returned 500: 
389ik8w036xim30j0lwc4mi1qh64axm4-clan-runtime.drv: error: gRPC QueryValidPaths on 'nix-store.geninf.io:50051' failed: error: niks3 push: uploading objects: uploading NAR nar/0gha9ixkh6fzjs99i8f5qsbbj5f1swbknciacv9i4wf497k12v7q.nar.zst: uploading NAR nar/0gha9ixkh6fzjs99i8f5qsbbj5f1swbknciacv9i4wf497k12v7q.nar.zst: server returned 500: 
2vq97vcpv3x4banc8r1vpzlpf4zzlfky-webview-nightly.drv: error: gRPC QueryValidPaths on 'nix-store.geninf.io:50051' failed: error: niks3 push: uploading objects: uploading NAR nar/1lzbv11sfy065gh6hgq7359ysqwbv1is9qdg58vjm5v2y1q6k6v2.nar.zst: uploading NAR nar/1lzbv11sfy065gh6hgq7359ysqwbv1is9qdg58vjm5v2y1q6k6v2.nar.zst: server returned 500: 
error: dependency 'v4c4mb593a3dz4vy31ng4svkg9wm18s6-python3-3.13.15-env.drv' failed
failed checks.aarch64-darwin.clan-app-ui-lint 1m 13s
setup: /nix/store/wr82xdgrbzxa546ifmvkzqn46swr220f-zstd-1.5.7-bin /nix/store/gr8mnaz86kwnw1a017hvqyx3jkgryb3q-zstd-1.5.7-dev warning: ignoring the client-sp …
setup:
  /nix/store/wr82xdgrbzxa546ifmvkzqn46swr220f-zstd-1.5.7-bin
  /nix/store/gr8mnaz86kwnw1a017hvqyx3jkgryb3q-zstd-1.5.7-dev
warning: ignoring the client-specified setting 'store', because it is a restricted setting and you are not a trusted user
v7cfvzx59d42d7insb9qfcdbyalw64zx-npm-config-hook.drv: error: gRPC QueryValidPaths on 'nix-store.geninf.io:50051' failed: error: niks3 push: uploading objects: uploading NAR nar/0gj9q1sv0bkzjym7afgx167mx1g4yja6i3rkg1mihjd46agx0ij8.nar.zst: uploading NAR nar/0gj9q1sv0bkzjym7afgx167mx1g4yja6i3rkg1mihjd46agx0ij8.nar.zst: server returned 500: 
p4b96a9l12zifk49k0l49cadqyxfj945-clan-ts-api.drv: error: gRPC QueryValidPaths on 'nix-store.geninf.io:50051' failed: error: niks3 push: uploading objects: uploading NAR nar/07qlkkjz47ap1vvxz4zgcy6l817k4skn2fj7fzv4lp16pp2g7yff.nar.zst: uploading NAR nar/07qlkkjz47ap1vvxz4zgcy6l817k4skn2fj7fzv4lp16pp2g7yff.nar.zst: server returned 500: 
kzdw7zw5nv08894mwk1v82wk3rbp36y5-unknown.drv: error: gRPC QueryValidPaths on 'nix-store.geninf.io:50051' failed: error: niks3 push: uploading objects: uploading NAR nar/1pqqr5hwmq2zbrry6i5yff852sa94jvlpv21qw99811br7xwa536.nar.zst: uploading NAR nar/1pqqr5hwmq2zbrry6i5yff852sa94jvlpv21qw99811br7xwa536.nar.zst: server returned 500: 
3dp020c98sm3y9b9iz9jbifrgfqjrkp1--clan-ui-0.0.1-sources.drv: error: gRPC QueryValidPaths on 'nix-store.geninf.io:50051' failed: error: niks3 push: uploading objects: uploading NAR nar/1h6s91xbph49lrw900yv9r9d8xrxqffcv84ds51rfphkizyawsfc.nar.zst: uploading NAR nar/1h6s91xbph49lrw900yv9r9d8xrxqffcv84ds51rfphkizyawsfc.nar.zst: server returned 500: 
error: dependency 'v7cfvzx59d42d7insb9qfcdbyalw64zx-npm-config-hook.drv' failed
failed checks.aarch64-darwin.clan-app-ui-unit-tests 1m 27s
setup: don't know how to build these paths: /nix/store/a6gcbw8dc12pa52fscqi92nxrq9s4g9s-clan-app-ui-unit-tests.drv warning: ignoring the client-specified sett …
setup:
don't know how to build these paths:
  /nix/store/a6gcbw8dc12pa52fscqi92nxrq9s4g9s-clan-app-ui-unit-tests.drv
warning: ignoring the client-specified setting 'store', because it is a restricted setting and you are not a trusted user
kzdw7zw5nv08894mwk1v82wk3rbp36y5-unknown.drv: error: gRPC AddMultipleToStore on 'nix-store.geninf.io:50051' failed: error: niks3 push: uploading objects: uploading NAR nar/01jlfhc2m556g3z9xpc6xllhsiizvk4kzx53anghd3qzvih4bc95.nar.zst: uploading NAR nar/01jlfhc2m556g3z9xpc6xllhsiizvk4kzx53anghd3qzvih4bc95.nar.zst: server returned 500: 
3dp020c98sm3y9b9iz9jbifrgfqjrkp1--clan-ui-0.0.1-sources.drv: error: gRPC QueryValidPaths on 'nix-store.geninf.io:50051' failed: error: niks3 push: uploading objects: uploading NAR nar/03yd1j50rq9s8m5jlfm20g2bfm86gg7sqx6zyf9jkm5gh1d37yb6.nar.zst: uploading NAR nar/03yd1j50rq9s8m5jlfm20g2bfm86gg7sqx6zyf9jkm5gh1d37yb6.nar.zst: server returned 500: 
v7cfvzx59d42d7insb9qfcdbyalw64zx-npm-config-hook.drv: error: gRPC QueryValidPaths on 'nix-store.geninf.io:50051' failed: error: niks3 push: uploading objects: uploading NAR nar/07vcshiy8ialrn0xnkjs7yk2lv1xi2yshg9qnnqpyr4sniqsvqph.nar.zst: uploading NAR nar/07vcshiy8ialrn0xnkjs7yk2lv1xi2yshg9qnnqpyr4sniqsvqph.nar.zst: server returned 500: 
p4b96a9l12zifk49k0l49cadqyxfj945-clan-ts-api.drv: error: gRPC QueryValidPaths on 'nix-store.geninf.io:50051' failed: error: niks3 push: uploading objects: uploading NAR nar/14rlkksxm941rw3kzx9r8zmvazfj53jb5cp879kwk8w3h3rwa33y.nar.zst: uploading NAR nar/14rlkksxm941rw3kzx9r8zmvazfj53jb5cp879kwk8w3h3rwa33y.nar.zst: server returned 500: 
error: dependency 'kzdw7zw5nv08894mwk1v82wk3rbp36y5-unknown.drv' failed
failed checks.aarch64-darwin.clan-deps 41s
setup: don't know how to build these paths: /nix/store/rzch3gyc5991ya2gvyazmglkwb47bnjm-clan-deps.drv warning: ignoring the client-specified setting 'store', …
setup:
don't know how to build these paths:
  /nix/store/rzch3gyc5991ya2gvyazmglkwb47bnjm-clan-deps.drv
warning: ignoring the client-specified setting 'store', because it is a restricted setting and you are not a trusted user
rzch3gyc5991ya2gvyazmglkwb47bnjm-clan-deps.drv: error: gRPC QueryValidPaths on 'nix-store.geninf.io:50051' failed: error: niks3 push: uploading objects: uploading NAR nar/1pqqr5hwmq2zbrry6i5yff852sa94jvlpv21qw99811br7xwa536.nar.zst: uploading NAR nar/1pqqr5hwmq2zbrry6i5yff852sa94jvlpv21qw99811br7xwa536.nar.zst: server returned 500: 
error: error: gRPC QueryValidPaths on 'nix-store.geninf.io:50051' failed: error: niks3 push: uploading objects: uploading NAR nar/1pqqr5hwmq2zbrry6i5yff852sa94jvlpv21qw99811br7xwa536.nar.zst: uploading NAR nar/1pqqr5hwmq2zbrry6i5yff852sa94jvlpv21qw99811br7xwa536.nar.zst: server returned 500: 
failed checks.aarch64-darwin.clan-pytest-with-core 13m 46s
setup: warning: ja8kd0llic371w0a9ml9far25ijwn03d-patchutils-0.3.3.drv: no connected, non-draining worker for system 'aarch64-darwin' offers features {}, the wor …
setup:
warning: ja8kd0llic371w0a9ml9far25ijwn03d-patchutils-0.3.3.drv: no connected, non-draining worker for system 'aarch64-darwin' offers features {}, the workers offer {}, waiting up to 120s for a worker
nd5x367gqbb50pwy7l55ibp5xsnmsmbb-cpio-2.15.drv: no connected, non-draining worker for system 'aarch64-darwin' offers features {}, the workers offer {}
x7klj309fq3zi8g1db1s0yi5ck9sb0bk-patchutils-0.4.2.drv: no connected, non-draining worker for system 'aarch64-darwin' offers features {}, the workers offer {}
815ljqvb1k1zwpg4wlcgs1b2vqc15rci-pbzx-1.0.2.drv: no connected, non-draining worker for system 'aarch64-darwin' offers features {}, the workers offer {}
xm5kr64jkq2xbjyp01ihzm23yasdkxy9-patchutils-0.3.3.drv: no connected, non-draining worker for system 'aarch64-darwin' offers features {}, the workers offer {}
zc333mghfnrzxk5l9k0gx5cvd93aa5l7-make-shell-wrapper-hook.drv: no connected, non-draining worker for system 'aarch64-darwin' offers features {}, the workers offer {}
ja8kd0llic371w0a9ml9far25ijwn03d-patchutils-0.3.3.drv: no connected, non-draining worker for system 'aarch64-darwin' offers features {}, the workers offer {}
error: dependency 'jqrxhvyg0k8cbjz403bn61l5inga61n5-clan-cli-source.drv' failed
failed checks.aarch64-darwin.clan-pytest-without-core 1m 11s
setup: don't know how to build these paths: /nix/store/qv8c29pzpcl3lx7g9h3md8sfgwzyadm4-clan-pytest-without-core.drv warning: ignoring the client-specified se …
setup:
don't know how to build these paths:
  /nix/store/qv8c29pzpcl3lx7g9h3md8sfgwzyadm4-clan-pytest-without-core.drv
warning: ignoring the client-specified setting 'store', because it is a restricted setting and you are not a trusted user
389ik8w036xim30j0lwc4mi1qh64axm4-clan-runtime.drv: error: gRPC QueryValidPaths on 'nix-store.geninf.io:50051' failed: error: niks3 push: uploading objects: uploading NAR nar/045wd3gvf08s6gpxx70cmrlclwa1c3nk56w7acdj078ii78xd6k6.nar.zst: uploading NAR nar/045wd3gvf08s6gpxx70cmrlclwa1c3nk56w7acdj078ii78xd6k6.nar.zst: server returned 500: 
ym0w3fjav52jbam294jqn8zvbpndrjc9-python3-3.13.15-env.drv: error: gRPC QueryValidPaths on 'nix-store.geninf.io:50051' failed: error: niks3 push: uploading objects: uploading NAR nar/1lzbv11sfy065gh6hgq7359ysqwbv1is9qdg58vjm5v2y1q6k6v2.nar.zst: uploading NAR nar/1lzbv11sfy065gh6hgq7359ysqwbv1is9qdg58vjm5v2y1q6k6v2.nar.zst: server returned 500: 
pav0ikgjyv0ci86riqpsrlpk5mpwqcr6-closure-info.drv: error: gRPC QueryValidPaths on 'nix-store.geninf.io:50051' failed: error: niks3 push: uploading objects: uploading NAR nar/1zxq7dd1xdxxsj37n730zg4kxlhnpj5lddxr4y1fiv3rl0d067zr.nar.zst: uploading NAR nar/1zxq7dd1xdxxsj37n730zg4kxlhnpj5lddxr4y1fiv3rl0d067zr.nar.zst: server returned 500: 
error: dependency 'jqrxhvyg0k8cbjz403bn61l5inga61n5-clan-cli-source.drv' failed
failed checks.aarch64-darwin.darwin-test-darwin-machine 7m 0s
setup: 5q0h66jqvnhnmm8d7y1m8dp6vr6qbb7z-etc-sudo_local.drv: error: gRPC QueryValidPaths on 'nix-store.geninf.io:50051' failed: error: niks3 push: uploading obje …
setup:
5q0h66jqvnhnmm8d7y1m8dp6vr6qbb7z-etc-sudo_local.drv: error: gRPC QueryValidPaths on 'nix-store.geninf.io:50051' failed: error: niks3 push: uploading objects: uploading NAR nar/0dznddgj692hz9fjz8bwvi6cwfqqa8nzilmcg8mamcv8yjwdr35a.nar.zst: uploading NAR nar/0dznddgj692hz9fjz8bwvi6cwfqqa8nzilmcg8mamcv8yjwdr35a.nar.zst: server returned 500: 
a2zn5rmbqzkwd54m0jkkmkl7wg4jb122-etc-zprofile.drv: error: gRPC QueryValidPaths on 'nix-store.geninf.io:50051' failed: error: niks3 push: uploading objects: uploading NAR nar/119wphk9zkjrnx8s4shfbq28hmx4hfm4ga21wyy855jr932igy45.nar.zst: uploading NAR nar/119wphk9zkjrnx8s4shfbq28hmx4hfm4ga21wyy855jr932igy45.nar.zst: server returned 500: 
daxrmfdmr79v27lv487bkpninrz2i4w9-nix.conf.drv: error: gRPC QueryValidPaths on 'nix-store.geninf.io:50051' failed: error: niks3 push: uploading objects: uploading NAR nar/1mwk8i11accp9an8bfxi09dzaabyw7q0fzj94l1yi7c9c5nd4wsp.nar.zst: uploading NAR nar/1mwk8i11accp9an8bfxi09dzaabyw7q0fzj94l1yi7c9c5nd4wsp.nar.zst: server returned 500: 
ifqs0rpkk821igh43cs3956g7vb657zm-ca-certificates.crt.drv: error: gRPC QueryValidPaths on 'nix-store.geninf.io:50051' failed: error: niks3 push: uploading objects: uploading NAR nar/1pr31vxjixbz5l2vindng8lgbbx3qw4qhl2j2nf7y8w7p5qjf1s8.nar.zst: uploading NAR nar/1pr31vxjixbz5l2vindng8lgbbx3qw4qhl2j2nf7y8w7p5qjf1s8.nar.zst: server returned 500: 
if3g4ljrvbwd3h91i7871q5dgmr7x4mi-etc-100-nix-darwin.conf.drv: error: gRPC QueryValidPaths on 'nix-store.geninf.io:50051' failed: error: niks3 push: uploading objects: uploading NAR nar/1qbv0b21yrwl1whdvixyqxgx3i4p5lidwfwzl0sanb2rizdy0pdq.nar.zst: uploading NAR nar/1qbv0b21yrwl1whdvixyqxgx3i4p5lidwfwzl0sanb2rizdy0pdq.nar.zst: server returned 500: 
y5f294bglikn7b7gcnlchbaj9j1qmfjf-etc-099-host-keys.conf.drv: error: gRPC QueryValidPaths on 'nix-store.geninf.io:50051' failed: error: niks3 push: uploading objects: uploading NAR nar/0864qrx8laywdgp02d1abvb22w85sa16l23r81jcf0701gxamxkm.nar.zst: uploading NAR nar/0864qrx8laywdgp02d1abvb22w85sa16l23r81jcf0701gxamxkm.nar.zst: server returned 500: 
8d3ilb98ih6zmfkrji3ar9lmh2ncqckh-darwin-version.json.drv: error: gRPC QueryValidPaths on 'nix-store.geninf.io:50051' failed: error: niks3 push: uploading objects: uploading NAR nar/0dznddgj692hz9fjz8bwvi6cwfqqa8nzilmcg8mamcv8yjwdr35a.nar.zst: uploading NAR nar/0dznddgj692hz9fjz8bwvi6cwfqqa8nzilmcg8mamcv8yjwdr35a.nar.zst: server returned 500: 
error: dependency 'q52zn986wach507sllk5f15iya7z5rgg-fonts.drv' failed
dependency failed checks.aarch64-darwin.devshell —
failed checks.aarch64-darwin.devShell-clan-app 12m 52s
setup: kzdw7zw5nv08894mwk1v82wk3rbp36y5-unknown.drv: build04: publish failed: error: niks3 push: uploading objects: uploading listing q0dxv4qf2h3sirh78xywm66qrs …
setup:
kzdw7zw5nv08894mwk1v82wk3rbp36y5-unknown.drv: build04: publish failed: error: niks3 push: uploading objects: uploading listing q0dxv4qf2h3sirh78xywm66qrs4ai7v9.ls: server returned 500: , asking the scheduler again
kzdw7zw5nv08894mwk1v82wk3rbp36y5-unknown.drv: build04: publish failed: error: niks3 push: uploading objects: uploading listing q0dxv4qf2h3sirh78xywm66qrs4ai7v9.ls: server returned 500: , asking the scheduler again
kzdw7zw5nv08894mwk1v82wk3rbp36y5-unknown.drv: build04: publish failed: error: niks3 push: uploading objects: uploading listing q0dxv4qf2h3sirh78xywm66qrs4ai7v9.ls: server returned 500: , asking the scheduler again
kzdw7zw5nv08894mwk1v82wk3rbp36y5-unknown.drv: build04: publish failed: error: niks3 push: uploading objects: uploading listing q0dxv4qf2h3sirh78xywm66qrs4ai7v9.ls: server returned 500: , asking the scheduler again
kzdw7zw5nv08894mwk1v82wk3rbp36y5-unknown.drv: build04: publish failed: error: niks3 push: uploading objects: uploading build log log/kzdw7zw5nv08894mwk1v82wk3rbp36y5-unknown.drv: server returned 500: , asking the scheduler again
kzdw7zw5nv08894mwk1v82wk3rbp36y5-unknown.drv: build04: publish failed: error: niks3 push: uploading objects: uploading build log log/kzdw7zw5nv08894mwk1v82wk3rbp36y5-unknown.drv: server returned 500: , asking the scheduler again
kzdw7zw5nv08894mwk1v82wk3rbp36y5-unknown.drv: Stream removed (RST_STREAM (Received RST_STREAM with error code 2)), asking the scheduler again
error: dependency '0ykazazjmyvz80j2bf9zsnzafi7hfvk3-clan-types.drv' failed
failed checks.aarch64-darwin.devShell-clan-cli 8m 2s
setup: 9bm3fnyv1px2rcxyb7bjdfibg5vd3nj3-fmt-nix-codeblocks.drv: error: gRPC QueryValidPaths on 'nix-store.geninf.io:50051' failed: error: niks3 push: uploading …
setup:
9bm3fnyv1px2rcxyb7bjdfibg5vd3nj3-fmt-nix-codeblocks.drv: error: gRPC QueryValidPaths on 'nix-store.geninf.io:50051' failed: error: niks3 push: uploading objects: uploading NAR nar/1986ry0gx3pligds6cd9cza786qk9h7ihzw1c6npvv0cnxcirvs5.nar.zst: uploading NAR nar/1986ry0gx3pligds6cd9cza786qk9h7ihzw1c6npvv0cnxcirvs5.nar.zst: server returned 500: 
zbapc0x7k24x20sq2k0m2zcpdxzlzgnp-sizelint.toml.drv: error: gRPC QueryValidPaths on 'nix-store.geninf.io:50051' failed: error: niks3 push: uploading objects: uploading NAR nar/1hd5za05irmscqzrkiymdnlr1fssycxmwfbfz74mbxwkf47mv72i.nar.zst: uploading NAR nar/1hd5za05irmscqzrkiymdnlr1fssycxmwfbfz74mbxwkf47mv72i.nar.zst: server returned 500: 
4g5fqmp8imdqzfgnymq2kbwdci9yfy17-pythoncheck.sh.drv: error: gRPC QueryValidPaths on 'nix-store.geninf.io:50051' failed: error: niks3 push: uploading objects: uploading NAR nar/1zzhrdxjfc50j1m3j4gqnplixpq2imh32ai9apbc882wx5xbbsfr.nar.zst: uploading NAR nar/1zzhrdxjfc50j1m3j4gqnplixpq2imh32ai9apbc882wx5xbbsfr.nar.zst: server returned 500: 
bhkky2n1rlsxfqqljlkzw9285vhw14xv-tea-create-pr.drv: error: gRPC QueryValidPaths on 'nix-store.geninf.io:50051' failed: error: niks3 push: uploading objects: uploading NAR nar/1hd5za05irmscqzrkiymdnlr1fssycxmwfbfz74mbxwkf47mv72i.nar.zst: uploading NAR nar/1hd5za05irmscqzrkiymdnlr1fssycxmwfbfz74mbxwkf47mv72i.nar.zst: server returned 500: 
8z7nmdfqg7alvl7dvfpf350xi7lqksfg-pending-reviews.drv: error: gRPC QueryValidPaths on 'nix-store.geninf.io:50051' failed: error: niks3 push: uploading objects: uploading NAR nar/1arxl4r1s90kr5kafd1j6b5my5v9xz1yza0ad83ki7nwngqz5fjh.nar.zst: uploading NAR nar/1arxl4r1s90kr5kafd1j6b5my5v9xz1yza0ad83ki7nwngqz5fjh.nar.zst: server returned 500: 
7kdjqwgnmaar115ay7ci29nhqrx9jr3h-python3-3.13.15-env.drv: error: gRPC QueryValidPaths on 'nix-store.geninf.io:50051' failed: error: niks3 push: uploading objects: uploading NAR nar/078p83j69vipns8zm9362r46drpxwqkbl324ccmkzdblx93ddlh0.nar.zst: uploading NAR nar/078p83j69vipns8zm9362r46drpxwqkbl324ccmkzdblx93ddlh0.nar.zst: server returned 500: 
389ik8w036xim30j0lwc4mi1qh64axm4-clan-runtime.drv: error: gRPC QueryValidPaths on 'nix-store.geninf.io:50051' failed: error: niks3 push: uploading objects: uploading NAR nar/0bi4dgpjjxqmpmdwzwmbx23ph3bjagkbw7jf8kz8x7inv6n3i4dp.nar.zst: uploading NAR nar/0bi4dgpjjxqmpmdwzwmbx23ph3bjagkbw7jf8kz8x7inv6n3i4dp.nar.zst: server returned 500: 
error: dependency '0ykazazjmyvz80j2bf9zsnzafi7hfvk3-clan-types.drv' failed
failed eval checks.aarch64-darwin.devShell-clan-site —
error: … while calling the 'derivationStrict' builtin at «nix-internal»/derivation-internal.nix:37:12: 36| 37| strict = …
error:
       … while calling the 'derivationStrict' builtin
         at «nix-internal»/derivation-internal.nix:37:12:
           36|
           37|   strict = derivationStrict drvAttrs;
             |            ^
           38|

       … while evaluating derivation 'nix-shell'
         whose name attribute is located at «https://releases.nixos.org/nixos/26.05/nixos-26.05.11767.7993f34ee47e/nixexprs.tar.xz?narHash=sha256-TnALPKp8o/dtUYgE243iQMbRP4183ZPhWu33FD05k/4%3D»/pkgs/stdenv/generic/make-derivation.nix:647:11

       … while evaluating attribute '__impureHostDeps' of derivation 'nix-shell'
         at «https://releases.nixos.org/nixos/26.05/nixos-26.05.11767.7993f34ee47e/nixexprs.tar.xz?narHash=sha256-TnALPKp8o/dtUYgE243iQMbRP4183ZPhWu33FD05k/4%3D»/pkgs/stdenv/generic/make-derivation.nix:816:11:
          815|             unique (computedPropagatedSandboxProfile ++ [ propagatedSandboxProfile ]);
          816|           ${if buildIsDarwin then "__impureHostDeps" else null} =
             |           ^
          817|             let

       (stack trace truncated; use '--show-trace' to show the full, detailed trace)

       error: Refusing to evaluate package 'pnpm-10.34.0' in /nix/store/dqn2ddd6vpxbgx2jzparmg93hly0x1mj-source/pkgs/development/tools/pnpm/generic.nix:170 because it is marked as insecure

       Known issues:
        - CVE-2026-55487
        - CVE-2026-55698
        - CVE-2026-55180
        - CVE-2026-55697
        - CVE-2026-59194
        - CVE-2026-59195
        - CVE-2026-59196
        - CVE-2026-82392
        - CVE-2026-82393

       You can install it anyway by allowing this package, using the
       following methods:

       a) To temporarily allow all insecure packages, you can use an environment
          variable for a single invocation of the nix tools:

            $ export NIXPKGS_ALLOW_INSECURE=1

          Note: When using `nix shell`, `nix build`, `nix develop`, etc with a flake,
                then pass `--impure` in order to allow use of environment variables.

       b) for `nixos-rebuild` you can add ‘pnpm-10.34.0’ to
          `nixpkgs.config.permittedInsecurePackages` in the configuration.nix,
          like so:

            {
              nixpkgs.config.permittedInsecurePackages = [
                "pnpm-10.34.0"
              ];
            }

       c) For `nix-env`, `nix-build`, `nix-shell` or any other Nix command you can add
          ‘pnpm-10.34.0’ to `permittedInsecurePackages` in
          ~/.config/nixpkgs/config.nix, like so:

            {
              permittedInsecurePackages = [
                "pnpm-10.34.0"
              ];
            }
failed checks.aarch64-darwin.devShell-default 7m 53s
setup: 9bm3fnyv1px2rcxyb7bjdfibg5vd3nj3-fmt-nix-codeblocks.drv: error: gRPC QueryValidPaths on 'nix-store.geninf.io:50051' failed: error: niks3 push: uploading …
setup:
9bm3fnyv1px2rcxyb7bjdfibg5vd3nj3-fmt-nix-codeblocks.drv: error: gRPC QueryValidPaths on 'nix-store.geninf.io:50051' failed: error: niks3 push: uploading objects: uploading NAR nar/0his8qc26dpmfnsisk0bj9711gxv0yla5w9yva2gyk1vmij4l44f.nar.zst: uploading NAR nar/0his8qc26dpmfnsisk0bj9711gxv0yla5w9yva2gyk1vmij4l44f.nar.zst: server returned 500: 
qgyz1jxvkphwlgf9kz6bh68r8p8ywgk5-lint-cross-compat.drv: error: gRPC QueryValidPaths on 'nix-store.geninf.io:50051' failed: error: niks3 push: uploading objects: uploading NAR nar/1lj41jnqw6zshmwgv1c4iv4ya005mh4bjg6m75kk6ilk8x0lx8v1.nar.zst: uploading NAR nar/1lj41jnqw6zshmwgv1c4iv4ya005mh4bjg6m75kk6ilk8x0lx8v1.nar.zst: server returned 500: 
zbapc0x7k24x20sq2k0m2zcpdxzlzgnp-sizelint.toml.drv: error: gRPC QueryValidPaths on 'nix-store.geninf.io:50051' failed: error: niks3 push: uploading objects: uploading NAR nar/0i50y1hsybcj6c6scfj9ni4lnqn4hkb33czdw6v6b8m6fk4zz1kq.nar.zst: uploading NAR nar/0i50y1hsybcj6c6scfj9ni4lnqn4hkb33czdw6v6b8m6fk4zz1kq.nar.zst: server returned 500: 
4g5fqmp8imdqzfgnymq2kbwdci9yfy17-pythoncheck.sh.drv: error: gRPC QueryValidPaths on 'nix-store.geninf.io:50051' failed: error: niks3 push: uploading objects: uploading NAR nar/0kr3f8sar371ad329x9birkl23kx16q98yvg1xl6v5ygbyah6vk6.nar.zst: uploading NAR nar/0kr3f8sar371ad329x9birkl23kx16q98yvg1xl6v5ygbyah6vk6.nar.zst: server returned 500: 
bhkky2n1rlsxfqqljlkzw9285vhw14xv-tea-create-pr.drv: error: gRPC QueryValidPaths on 'nix-store.geninf.io:50051' failed: error: niks3 push: uploading objects: uploading NAR nar/14jgb0g5npz8wxqr7ha2gr32fragd8jddb7d5ccp6ylnl8fnqrx3.nar.zst: uploading NAR nar/14jgb0g5npz8wxqr7ha2gr32fragd8jddb7d5ccp6ylnl8fnqrx3.nar.zst: server returned 500: 
8z7nmdfqg7alvl7dvfpf350xi7lqksfg-pending-reviews.drv: error: gRPC QueryValidPaths on 'nix-store.geninf.io:50051' failed: error: niks3 push: uploading objects: uploading NAR nar/0y0xg39p8gm457sfy6aw56nfxyciah8djjny89s19zbmf1qv9gyw.nar.zst: uploading NAR nar/0y0xg39p8gm457sfy6aw56nfxyciah8djjny89s19zbmf1qv9gyw.nar.zst: server returned 500: 
389ik8w036xim30j0lwc4mi1qh64axm4-clan-runtime.drv: error: gRPC QueryValidPaths on 'nix-store.geninf.io:50051' failed: error: niks3 push: uploading objects: uploading NAR nar/11x73hxfd41k6ql6xjl29p0v54m4a55d0nr7ykhx38gwv32b04ri.nar.zst: uploading NAR nar/11x73hxfd41k6ql6xjl29p0v54m4a55d0nr7ykhx38gwv32b04ri.nar.zst: server returned 500: 
error: dependency '0ykazazjmyvz80j2bf9zsnzafi7hfvk3-clan-types.drv' failed
failed checks.aarch64-darwin.devShell-inventory-schema 5m 2s
setup: 0a2plmf8sq4rii1i3qxdmyiwnfqzfhqy-flake-edit.toml.drv: error: gRPC QueryValidPaths on 'nix-store.geninf.io:50051' failed: error: niks3 push: uploading obj …
setup:
0a2plmf8sq4rii1i3qxdmyiwnfqzfhqy-flake-edit.toml.drv: error: gRPC QueryValidPaths on 'nix-store.geninf.io:50051' failed: error: niks3 push: uploading objects: uploading NAR nar/02v5za3wwf3balppf3skllnsjvdq7jf098yh6ira77spdwcy3dyc.nar.zst: uploading NAR nar/02v5za3wwf3balppf3skllnsjvdq7jf098yh6ira77spdwcy3dyc.nar.zst: server returned 500: 
qgyz1jxvkphwlgf9kz6bh68r8p8ywgk5-lint-cross-compat.drv: error: gRPC QueryValidPaths on 'nix-store.geninf.io:50051' failed: error: niks3 push: uploading objects: uploading NAR nar/10a8913g0rc8wjsvqhnyg1px0avngk7856kl0lr9lifydrq520ca.nar.zst: uploading NAR nar/10a8913g0rc8wjsvqhnyg1px0avngk7856kl0lr9lifydrq520ca.nar.zst: server returned 500: 
9bm3fnyv1px2rcxyb7bjdfibg5vd3nj3-fmt-nix-codeblocks.drv: error: gRPC QueryValidPaths on 'nix-store.geninf.io:50051' failed: error: niks3 push: uploading objects: uploading NAR nar/0n4lbaj8jmbn20h3zn3d1200al12sdg5l611v750hngmgw36i079.nar.zst: uploading NAR nar/0n4lbaj8jmbn20h3zn3d1200al12sdg5l611v750hngmgw36i079.nar.zst: server returned 500: 
zbapc0x7k24x20sq2k0m2zcpdxzlzgnp-sizelint.toml.drv: error: gRPC QueryValidPaths on 'nix-store.geninf.io:50051' failed: error: niks3 push: uploading objects: uploading NAR nar/14hdi5qhdy0jcnih6d5c6d2vin6539pw9cabmy9vqbql1396ljjm.nar.zst: uploading NAR nar/14hdi5qhdy0jcnih6d5c6d2vin6539pw9cabmy9vqbql1396ljjm.nar.zst: server returned 500: 
4g5fqmp8imdqzfgnymq2kbwdci9yfy17-pythoncheck.sh.drv: error: gRPC QueryValidPaths on 'nix-store.geninf.io:50051' failed: error: niks3 push: uploading objects: uploading NAR nar/1h21jvhr2kvj6r66409vgqv00i1iv02njfb8pgv7s0kj7yb276c0.nar.zst: uploading NAR nar/1h21jvhr2kvj6r66409vgqv00i1iv02njfb8pgv7s0kj7yb276c0.nar.zst: server returned 500: 
bhkky2n1rlsxfqqljlkzw9285vhw14xv-tea-create-pr.drv: error: gRPC QueryValidPaths on 'nix-store.geninf.io:50051' failed: error: niks3 push: uploading objects: uploading NAR nar/01jlfhc2m556g3z9xpc6xllhsiizvk4kzx53anghd3qzvih4bc95.nar.zst: uploading NAR nar/01jlfhc2m556g3z9xpc6xllhsiizvk4kzx53anghd3qzvih4bc95.nar.zst: server returned 500: 
8z7nmdfqg7alvl7dvfpf350xi7lqksfg-pending-reviews.drv: error: gRPC QueryValidPaths on 'nix-store.geninf.io:50051' failed: error: niks3 push: uploading objects: uploading NAR nar/0rbix17kql051plqp4y4mzip6kqw99l0ccldarhy8plddizl2c44.nar.zst: uploading NAR nar/0rbix17kql051plqp4y4mzip6kqw99l0ccldarhy8plddizl2c44.nar.zst: server returned 500: 
error: dependency '389ik8w036xim30j0lwc4mi1qh64axm4-clan-runtime.drv' failed
failed checks.aarch64-darwin.eval-tests 8m 2s
setup: q7fl6arab3jnii6llgvckfv0sxb9x9c3-evalCheck-eval-tests-zerotier.drv: error: gRPC QueryValidPaths on 'nix-store.geninf.io:50051' failed: error: niks3 push: …
setup:
q7fl6arab3jnii6llgvckfv0sxb9x9c3-evalCheck-eval-tests-zerotier.drv: error: gRPC QueryValidPaths on 'nix-store.geninf.io:50051' failed: error: niks3 push: uploading objects: uploading NAR nar/0znp9hliir263s8whpj6dby0s6v9k0wn08h9af9lx82h072zwqyj.nar.zst: uploading NAR nar/0znp9hliir263s8whpj6dby0s6v9k0wn08h9af9lx82h072zwqyj.nar.zst: server returned 500: 
x8fbzmqyhvvyrzyynxd5jri4hp53idmk-evalCheck-eval-tests-types.drv: error: gRPC QueryValidPaths on 'nix-store.geninf.io:50051' failed: error: niks3 push: uploading objects: uploading NAR nar/0wvdgndzgd9mhmm30f1ba1nyfj3szl2n74m9m8dchjf0k06nfl4a.nar.zst: uploading NAR nar/0wvdgndzgd9mhmm30f1ba1nyfj3szl2n74m9m8dchjf0k06nfl4a.nar.zst: server returned 500: 
xayfh8mw0rjxcasw4l6y1ygf5dqwpdj0-evalCheck-eval-tests-hello-world.drv: error: gRPC QueryValidPaths on 'nix-store.geninf.io:50051' failed: error: niks3 push: uploading objects: uploading NAR nar/0n4lbaj8jmbn20h3zn3d1200al12sdg5l611v750hngmgw36i079.nar.zst: uploading NAR nar/0n4lbaj8jmbn20h3zn3d1200al12sdg5l611v750hngmgw36i079.nar.zst: server returned 500: 
yf33ii5qdmw2wnlf27a4r26r88mqwf9a-evalCheck-eval-lib-build-clan.drv: error: gRPC QueryValidPaths on 'nix-store.geninf.io:50051' failed: error: niks3 push: uploading objects: uploading NAR nar/00yzdi8x181xhcz20000fvq3dijns2f57samr7n9ayblq5zqx7p4.nar.zst: uploading NAR nar/00yzdi8x181xhcz20000fvq3dijns2f57samr7n9ayblq5zqx7p4.nar.zst: server returned 500: 
y3kpq1wxd517dm3m1m8aq4dqjhg5cpnl-evalCheck-eval-lib-relativeDir.drv: error: gRPC QueryValidPaths on 'nix-store.geninf.io:50051' failed: error: niks3 push: uploading objects: uploading NAR nar/186ic3nnxxfx7xddcrz04zhbrsqr8v48blsa02b2ds5py8hfn9ff.nar.zst: uploading NAR nar/186ic3nnxxfx7xddcrz04zhbrsqr8v48blsa02b2ds5py8hfn9ff.nar.zst: server returned 500: 
z97lng2b4zrbhfmfvqv3vl1craphv8wa-evalCheck-eval-vars-backends.drv: error: gRPC QueryValidPaths on 'nix-store.geninf.io:50051' failed: error: niks3 push: uploading objects: uploading NAR nar/0vc46g1jyrnj8rmabwvqizr17521lwpj0n09mafvcg1pcpx6zpm6.nar.zst: uploading NAR nar/0vc46g1jyrnj8rmabwvqizr17521lwpj0n09mafvcg1pcpx6zpm6.nar.zst: server returned 500: 
zc8jgp3gjryi1rpdgn7kr4by57azpbkj-evalCheck-eval-lib-resolve-module.drv: error: gRPC QueryValidPaths on 'nix-store.geninf.io:50051' failed: error: niks3 push: uploading objects: uploading NAR nar/0pjq7s9d0x2m9zf9jw553nij9k0j360pkm67qmd0nh9jllqml1mh.nar.zst: uploading NAR nar/0pjq7s9d0x2m9zf9jw553nij9k0j360pkm67qmd0nh9jllqml1mh.nar.zst: server returned 500: 
error: dependency '2mpivjz401ph1a4kryndv7l7nk38ihaj-evalCheck-lib-jsonschema-unit-tests.drv' failed
failed checks.aarch64-darwin.inventory-classes-up-to-date 1m 39s
setup: don't know how to build these paths: /nix/store/ywi1iw62h9q4lvd9860kvpjki218ri65-inventory-classes-up-to-date.drv warning: ignoring the client-specifie …
setup:
don't know how to build these paths:
  /nix/store/ywi1iw62h9q4lvd9860kvpjki218ri65-inventory-classes-up-to-date.drv
warning: ignoring the client-specified setting 'store', because it is a restricted setting and you are not a trusted user
ydjg695g7gkgpfk0bdyrks5150irm1sm-python3.13-datamodel-code-generator-0.52.1.drv: error: gRPC QueryValidPaths on 'nix-store.geninf.io:50051' failed: error: niks3 push: uploading objects: uploading NAR nar/0y8zaxklhk41g8phkjjdnrabvnp5gcwzr38ccll6261vxwk0a2wd.nar.zst: uploading NAR nar/0y8zaxklhk41g8phkjjdnrabvnp5gcwzr38ccll6261vxwk0a2wd.nar.zst: server returned 500: 
error: dependency '0ykazazjmyvz80j2bf9zsnzafi7hfvk3-clan-types.drv' failed
failed checks.aarch64-darwin.lib-jsonschema-example-valid 7m 13s
setup: don't know how to build these paths: /nix/store/d9265m4xh8l704k9vwjv1q3hflpwq4jr-lib-jsonschema-example-valid.drv warning: ignoring the client-specifie …
setup:
don't know how to build these paths:
  /nix/store/d9265m4xh8l704k9vwjv1q3hflpwq4jr-lib-jsonschema-example-valid.drv
warning: ignoring the client-specified setting 'store', because it is a restricted setting and you are not a trusted user
d9265m4xh8l704k9vwjv1q3hflpwq4jr-lib-jsonschema-example-valid.drv: error: gRPC QueryValidPaths on 'nix-store.geninf.io:50051' failed: error: niks3 push: uploading objects: uploading NAR nar/18y4fkgzxvhs7zbywz3l33mdih5aq3av9b364cxj2y5d9f4gp2qm.nar.zst: uploading NAR nar/18y4fkgzxvhs7zbywz3l33mdih5aq3av9b364cxj2y5d9f4gp2qm.nar.zst: server returned 500: 
error: error: gRPC QueryValidPaths on 'nix-store.geninf.io:50051' failed: error: niks3 push: uploading objects: uploading NAR nar/18y4fkgzxvhs7zbywz3l33mdih5aq3av9b364cxj2y5d9f4gp2qm.nar.zst: uploading NAR nar/18y4fkgzxvhs7zbywz3l33mdih5aq3av9b364cxj2y5d9f4gp2qm.nar.zst: server returned 500: 
failed checks.aarch64-darwin.nixos-flash-installer 6m 27s
setup: 6lc9nfw3fkn744md97gqpwr66jppq6r1-linux-7.2.10-modules.drv: gi-build-x86-02: publish failed: error: niks3 push: uploading objects: uploading build log log …
setup:
6lc9nfw3fkn744md97gqpwr66jppq6r1-linux-7.2.10-modules.drv: gi-build-x86-02: publish failed: error: niks3 push: uploading objects: uploading build log log/6lc9nfw3fkn744md97gqpwr66jppq6r1-linux-7.2.10-modules.drv: server returned 500: , asking the scheduler again
vms9scp713fp8cjdfv0b90msxb8crd83-command-not-found.drv: build-x86-01: the build this call attached to did not finish, retry, asking the scheduler again
hxkcgamv3mkq0zbd7qrh866kzyazilnb-etc-os-release.drv: build-x86-01: publish failed: error: niks3 push: uploading objects: uploading NAR nar/1z8jb5crfij10d85r0m3pdyw978jwyyzyx37vqidali4qygm4qzy.nar.zst: uploading NAR nar/1z8jb5crfij10d85r0m3pdyw978jwyyzyx37vqidali4qygm4qzy.nar.zst: server returned 500: , asking the scheduler again
vms9scp713fp8cjdfv0b90msxb8crd83-command-not-found.drv: error: gRPC QueryValidPaths on 'nix-store.geninf.io:50051' failed: error: niks3 push: uploading objects: uploading NAR nar/16gn0s86xk3mcndb85az02xp84sbnk80m6w848nky2acjj1jrpgg.nar.zst: uploading NAR nar/16gn0s86xk3mcndb85az02xp84sbnk80m6w848nky2acjj1jrpgg.nar.zst: server returned 500: 
pp54afhyvwirdsb82s5v7hf42yi8cp23-issue.drv: error: gRPC AddMultipleToStore on 'nix-store.geninf.io:50051' failed: error: niks3 push: uploading objects: uploading NAR nar/1s4b3a4z4nxv23drfss132f913zihrs8kfjyx40cypd8zv4r4dim.nar.zst: uploading NAR nar/1s4b3a4z4nxv23drfss132f913zihrs8kfjyx40cypd8zv4r4dim.nar.zst: server returned 500: 
hxkcgamv3mkq0zbd7qrh866kzyazilnb-etc-os-release.drv: build-x86-01: publish failed: error: niks3 push: uploading objects: uploading NAR nar/1z8jb5crfij10d85r0m3pdyw978jwyyzyx37vqidali4qygm4qzy.nar.zst: uploading NAR nar/1z8jb5crfij10d85r0m3pdyw978jwyyzyx37vqidali4qygm4qzy.nar.zst: server returned 500: , asking the scheduler again
hxkcgamv3mkq0zbd7qrh866kzyazilnb-etc-os-release.drv: error: gRPC AddMultipleToStore on 'nix-store.geninf.io:50051' failed: error: niks3 push: uploading objects: uploading NAR nar/1f7rxs8r5z4j8ayfsb64zfzy9z8cfs2gy0fzjp8crhhz5mhwp7lb.nar.zst: uploading NAR nar/1f7rxs8r5z4j8ayfsb64zfzy9z8cfs2gy0fzjp8crhhz5mhwp7lb.nar.zst: server returned 500: 
error: dependency '6lc9nfw3fkn744md97gqpwr66jppq6r1-linux-7.2.10-modules.drv' failed
failed checks.aarch64-darwin.treefmt 3m 0s
setup: /nix/store/12230i8fjvl0b1p89aaykk4kb3fspl6f-treefmt-check.drv warning: ignoring the client-specified setting 'store', because it is a restricted settin …
setup:
  /nix/store/12230i8fjvl0b1p89aaykk4kb3fspl6f-treefmt-check.drv
warning: ignoring the client-specified setting 'store', because it is a restricted setting and you are not a trusted user
rx5pxikcvm5z95kx61w8wa6m06zrqb4w-Terms.yml.drv: error: gRPC QueryValidPaths on 'nix-store.geninf.io:50051' failed: error: niks3 push: uploading objects: uploading NAR nar/1zzhrdxjfc50j1m3j4gqnplixpq2imh32ai9apbc882wx5xbbsfr.nar.zst: uploading NAR nar/1zzhrdxjfc50j1m3j4gqnplixpq2imh32ai9apbc882wx5xbbsfr.nar.zst: server returned 500: 
0a2plmf8sq4rii1i3qxdmyiwnfqzfhqy-flake-edit.toml.drv: error: gRPC QueryValidPaths on 'nix-store.geninf.io:50051' failed: error: niks3 push: uploading objects: uploading NAR nar/0530l1k4r8pymvpd8kzipcyf68zx5cacqmqqscxhs5jbg93cck2d.nar.zst: uploading NAR nar/0530l1k4r8pymvpd8kzipcyf68zx5cacqmqqscxhs5jbg93cck2d.nar.zst: server returned 500: 
qgyz1jxvkphwlgf9kz6bh68r8p8ywgk5-lint-cross-compat.drv: error: gRPC QueryValidPaths on 'nix-store.geninf.io:50051' failed: error: niks3 push: uploading objects: uploading NAR nar/1nfp9idn3zz6vaqk5wl9kml9s4dr0d478jrvari65apsc619sd5f.nar.zst: uploading NAR nar/1nfp9idn3zz6vaqk5wl9kml9s4dr0d478jrvari65apsc619sd5f.nar.zst: server returned 500: 
9bm3fnyv1px2rcxyb7bjdfibg5vd3nj3-fmt-nix-codeblocks.drv: error: gRPC QueryValidPaths on 'nix-store.geninf.io:50051' failed: error: niks3 push: uploading objects: uploading NAR nar/07qlkkjz47ap1vvxz4zgcy6l817k4skn2fj7fzv4lp16pp2g7yff.nar.zst: uploading NAR nar/07qlkkjz47ap1vvxz4zgcy6l817k4skn2fj7fzv4lp16pp2g7yff.nar.zst: server returned 500: 
zbapc0x7k24x20sq2k0m2zcpdxzlzgnp-sizelint.toml.drv: error: gRPC QueryValidPaths on 'nix-store.geninf.io:50051' failed: error: niks3 push: uploading objects: uploading NAR nar/03j7rb326xa847pc1w31fvwml5w20glk33r53fikmhyq297rvh5g.nar.zst: uploading NAR nar/03j7rb326xa847pc1w31fvwml5w20glk33r53fikmhyq297rvh5g.nar.zst: server returned 500: 
error: dependency 'wmkf0r8khl01wq6c7gcnpwylhwx8yfz1-treefmt.drv' failed
failed checks.aarch64-darwin.zerotier-tools-pytest 3m 26s
setup: /nix/store/5bsr4dk1mz5wfpic9hazs9cmz1dcyi8m-xcbuild-0.1.1-unstable-2019-11-20 /nix/store/cwzgjjrrhm0zyyhj4c9zygfqix11w3a8-xcbuild-0.1.1-unstable-2019 …
setup:
  /nix/store/5bsr4dk1mz5wfpic9hazs9cmz1dcyi8m-xcbuild-0.1.1-unstable-2019-11-20
  /nix/store/cwzgjjrrhm0zyyhj4c9zygfqix11w3a8-xcbuild-0.1.1-unstable-2019-11-20-xcrun
  /nix/store/dynkb6aqcn4k9nx8ypx85fjyh8c9mllq-xz-5.8.4
  /nix/store/nchabhn8hccnrfbp6mxx2620rfknp153-xz-5.8.4-bin
  /nix/store/s67lc4scj1i2gnjkjr2b567a1gmdlfj5-zlib-1.3.2
warning: ignoring the client-specified setting 'store', because it is a restricted setting and you are not a trusted user
ghshv97idlargpf015rbsgvdmk4p9chp-python3-3.13.15-env.drv: error: gRPC QueryValidPaths on 'nix-store.geninf.io:50051' failed: error: niks3 push: uploading objects: uploading NAR nar/1hxg9lhxxpmhhlpx1znk0p1yhkpycg6g158bwbf6jx9y0nwv71zz.nar.zst: uploading NAR nar/1hxg9lhxxpmhhlpx1znk0p1yhkpycg6g158bwbf6jx9y0nwv71zz.nar.zst: server returned 500: 
error: dependency 'ghshv97idlargpf015rbsgvdmk4p9chp-python3-3.13.15-env.drv' failed
failed checks.aarch64-linux.admin 2h 26m
setup: s5lvsbqnadxd04d5pm17cc3f5sqvzpg0-unit-systemd-networkd-wait-online.service-disabled.drv: build01: the build this call attached to did not finish, retry, …
setup:
s5lvsbqnadxd04d5pm17cc3f5sqvzpg0-unit-systemd-networkd-wait-online.service-disabled.drv: build01: the build this call attached to did not finish, retry, asking the scheduler again
sf07wpdpr877dczi0h9pa338v4dlppc4-nix.conf.drv: build01: the build this call attached to did not finish, retry, asking the scheduler again
6s2dw8311a4g1n1jcxg12p4ms8l46wb8-perl-5.42.3-env.drv: build01: the build this call attached to did not finish, retry, asking the scheduler again
ylhcqjzai8ic8sijv6n02fx31dlzchj7-mount-secret-fs.drv: build01: the build this call attached to did not finish, retry, asking the scheduler again
s5lvsbqnadxd04d5pm17cc3f5sqvzpg0-unit-systemd-networkd-wait-online.service-disabled.drv: build01: the build this call attached to did not finish, retry, asking the scheduler again
sf07wpdpr877dczi0h9pa338v4dlppc4-nix.conf.drv: build01: the build this call attached to did not finish, retry, asking the scheduler again
6s2dw8311a4g1n1jcxg12p4ms8l46wb8-perl-5.42.3-env.drv: build01: the build this call attached to did not finish, retry, asking the scheduler again
error: dependency 'lvn617vspy9s97nb3cbbnxks9010hp5i-nixos-test-driver-admin.drv' failed
failed eval checks.aarch64-linux.all-packages —
error: … while calling the 'derivationStrict' builtin at «nix-internal»/derivation-internal.nix:37:12: 36| 37| strict = …
error:
       … while calling the 'derivationStrict' builtin
         at «nix-internal»/derivation-internal.nix:37:12:
           36|
           37|   strict = derivationStrict drvAttrs;
             |            ^
           38|

       … while evaluating derivation 'all-packages'
         whose name attribute is located at «https://releases.nixos.org/nixos/26.05/nixos-26.05.11767.7993f34ee47e/nixexprs.tar.xz?narHash=sha256-TnALPKp8o/dtUYgE243iQMbRP4183ZPhWu33FD05k/4%3D»/pkgs/stdenv/generic/make-derivation.nix:647:11

       … while evaluating attribute 'buildCommand' of derivation 'all-packages'
         at «https://releases.nixos.org/nixos/26.05/nixos-26.05.11767.7993f34ee47e/nixexprs.tar.xz?narHash=sha256-TnALPKp8o/dtUYgE243iQMbRP4183ZPhWu33FD05k/4%3D»/pkgs/build-support/trivial-builders/default.nix:81:17:
           80|         enableParallelBuilding = true;
           81|         inherit buildCommand name;
             |                 ^
           82|         passAsFile = [ "buildCommand" ] ++ (derivationArgs.passAsFile or [ ]);

       (stack trace truncated; use '--show-trace' to show the full, detailed trace)

       error: Refusing to evaluate package 'pnpm-10.34.0' in /nix/store/dqn2ddd6vpxbgx2jzparmg93hly0x1mj-source/pkgs/development/tools/pnpm/generic.nix:170 because it is marked as insecure

       Known issues:
        - CVE-2026-55487
        - CVE-2026-55698
        - CVE-2026-55180
        - CVE-2026-55697
        - CVE-2026-59194
        - CVE-2026-59195
        - CVE-2026-59196
        - CVE-2026-82392
        - CVE-2026-82393

       You can install it anyway by allowing this package, using the
       following methods:

       a) To temporarily allow all insecure packages, you can use an environment
          variable for a single invocation of the nix tools:

            $ export NIXPKGS_ALLOW_INSECURE=1

          Note: When using `nix shell`, `nix build`, `nix develop`, etc with a flake,
                then pass `--impure` in order to allow use of environment variables.

       b) for `nixos-rebuild` you can add ‘pnpm-10.34.0’ to
          `nixpkgs.config.permittedInsecurePackages` in the configuration.nix,
          like so:

            {
              nixpkgs.config.permittedInsecurePackages = [
                "pnpm-10.34.0"
              ];
            }

       c) For `nix-env`, `nix-build`, `nix-shell` or any other Nix command you can add
          ‘pnpm-10.34.0’ to `permittedInsecurePackages` in
          ~/.config/nixpkgs/config.nix, like so:

            {
              permittedInsecurePackages = [
                "pnpm-10.34.0"
              ];
            }
failed eval checks.aarch64-linux.borgbackup —
error: … while evaluating the attribute 'drvPath' at «https://releases.nixos.org/nixos/26.05/nixos-26.05.11767.7993f34ee47e/nixexprs.tar.xz?narH …
error:
       … while evaluating the attribute 'drvPath'
         at «https://releases.nixos.org/nixos/26.05/nixos-26.05.11767.7993f34ee47e/nixexprs.tar.xz?narHash=sha256-TnALPKp8o/dtUYgE243iQMbRP4183ZPhWu33FD05k/4%3D»/lib/customisation.nix:427:7:
          426|     // {
          427|       drvPath =
             |       ^
          428|         assert condition;

       … while calling the 'derivationStrict' builtin
         at «nix-internal»/derivation-internal.nix:37:12:
           36|
           37|   strict = derivationStrict drvAttrs;
             |            ^
           38|

       … while evaluating the option `nodes.clientone.networking.interfaces':

       … while evaluating definitions from `/nix/store/dqn2ddd6vpxbgx2jzparmg93hly0x1mj-source/nixos/modules/hardware/facter/networking':

       … while evaluating the option `nodes.clientone.hardware.facter.enable':

       … while evaluating the option `nodes.clientone.hardware.facter.report':

       … while evaluating the option `nodes.clientone.hardware.facter.reportPath':

       … while evaluating definitions from `/nix/store/11yjkn22440chz70j833a2krkf96anz1-source/nixosModules/clanCore/nixos-facter.nix':

       (stack trace truncated; use '--show-trace' to show the full, detailed trace)

       error: build of '/nix/store/iymk7adx6w7kdzk12m8yl90s7n15qava-merged-test-dir-borgbackup.drv^out' failed: error: dependency 'rw9mqf8gxkj6y74cxxaxs837fwc44sj3-test-vars-generated.drv' failed
failed eval checks.aarch64-linux.certificates —
error: … while evaluating the attribute 'drvPath' at «https://releases.nixos.org/nixos/26.05/nixos-26.05.11767.7993f34ee47e/nixexprs.tar.xz?narH …
error:
       … while evaluating the attribute 'drvPath'
         at «https://releases.nixos.org/nixos/26.05/nixos-26.05.11767.7993f34ee47e/nixexprs.tar.xz?narHash=sha256-TnALPKp8o/dtUYgE243iQMbRP4183ZPhWu33FD05k/4%3D»/lib/customisation.nix:427:7:
          426|     // {
          427|       drvPath =
             |       ^
          428|         assert condition;

       … while calling the 'derivationStrict' builtin
         at «nix-internal»/derivation-internal.nix:37:12:
           36|
           37|   strict = derivationStrict drvAttrs;
             |            ^
           38|

       … while evaluating the option `nodes.ca.networking.interfaces':

       … while evaluating definitions from `/nix/store/dqn2ddd6vpxbgx2jzparmg93hly0x1mj-source/nixos/modules/hardware/facter/networking':

       … while evaluating the option `nodes.ca.hardware.facter.enable':

       … while evaluating the option `nodes.ca.hardware.facter.report':

       … while evaluating the option `nodes.ca.hardware.facter.reportPath':

       … while evaluating definitions from `/nix/store/11yjkn22440chz70j833a2krkf96anz1-source/nixosModules/clanCore/nixos-facter.nix':

       (stack trace truncated; use '--show-trace' to show the full, detailed trace)

       error: build of '/nix/store/4l0b6fay94iqq24kqzjr0340hb8isk8v-merged-test-dir-certificates.drv^out' failed: error: dependency 'dcprywyx49335g99k4zk2zypa1zwazh8-test-vars-generated.drv' failed
failed checks.aarch64-linux.clan-app-pytest 3m 28s
setup: don't know how to build these paths: /nix/store/vcpbdp5sq3q65xypifsgl36b654dh8x9-clan-app-pytest.drv warning: ignoring the client-specified setting 'st …
setup:
don't know how to build these paths:
  /nix/store/vcpbdp5sq3q65xypifsgl36b654dh8x9-clan-app-pytest.drv
warning: ignoring the client-specified setting 'store', because it is a restricted setting and you are not a trusted user
vmrm3hnyiyv8fjck62wcw86k7vdxlq98-clan-runtime.drv: error: gRPC AddMultipleToStore on 'nix-store.geninf.io:50051' failed: error: niks3 push: uploading objects: uploading NAR nar/14j04ly5a4vk2nvldm008dddhghhgkliw0vb39p7iswva6yv5cbs.nar.zst: uploading NAR nar/14j04ly5a4vk2nvldm008dddhghhgkliw0vb39p7iswva6yv5cbs.nar.zst: server returned 500: 
error: dependency 'gxwy1xiiqh8nkn8dnd0iwlhjcwpw4r43-python3-3.13.15-env.drv' failed
failed checks.aarch64-linux.clan-pytest-with-core 5m 1s
setup: /nix/store/rqi7rmxjbd501ynrpans0yxnbmlk2i7j-zlib-ng-2.3.3 /nix/store/y8cj7zhl1wps5qymih0x16h74337scs7-zstd-1.5.7 /nix/store/2km4yjrryshf26is4pzmaqd …
setup:
  /nix/store/rqi7rmxjbd501ynrpans0yxnbmlk2i7j-zlib-ng-2.3.3
  /nix/store/y8cj7zhl1wps5qymih0x16h74337scs7-zstd-1.5.7
  /nix/store/2km4yjrryshf26is4pzmaqdgy74rakdl-zvbi-0.2.45
  /nix/store/2gc6y76ngaff2d3zix6bgszj69vkxbqk-zxing-cpp-2.3.0
warning: ignoring the client-specified setting 'store', because it is a restricted setting and you are not a trusted user
vmrm3hnyiyv8fjck62wcw86k7vdxlq98-clan-runtime.drv: error: gRPC AddMultipleToStore on 'nix-store.geninf.io:50051' failed: error: niks3 push: uploading objects: uploading NAR nar/14j04ly5a4vk2nvldm008dddhghhgkliw0vb39p7iswva6yv5cbs.nar.zst: uploading NAR nar/14j04ly5a4vk2nvldm008dddhghhgkliw0vb39p7iswva6yv5cbs.nar.zst: server returned 500: 
45q1kw7j0yb6crwqa2w3afqhybc35bj1-clan-core-flake.drv: error: gRPC AddMultipleToStore on 'nix-store.geninf.io:50051' failed: error: niks3 push: uploading objects: uploading NAR nar/086rvv1il1kar09jgjxacwkpac0q55w3viagk4amrq7qdxl7d9n5.nar.zst: uploading NAR nar/086rvv1il1kar09jgjxacwkpac0q55w3viagk4amrq7qdxl7d9n5.nar.zst: server returned 500: 
error: dependency 'j0k0y5gcxkhx0jlqmr0c98288lrpwy8k-closure-info.drv' failed
failed checks.aarch64-linux.clan-pytest-without-core 2m 48s
setup: don't know how to build these paths: /nix/store/jw4hxs2g104j3qiiv5qsr5wavi1qngkk-clan-pytest-without-core.drv warning: ignoring the client-specified se …
setup:
don't know how to build these paths:
  /nix/store/jw4hxs2g104j3qiiv5qsr5wavi1qngkk-clan-pytest-without-core.drv
warning: ignoring the client-specified setting 'store', because it is a restricted setting and you are not a trusted user
vmrm3hnyiyv8fjck62wcw86k7vdxlq98-clan-runtime.drv: error: gRPC AddMultipleToStore on 'nix-store.geninf.io:50051' failed: error: niks3 push: uploading objects: uploading NAR nar/14j04ly5a4vk2nvldm008dddhghhgkliw0vb39p7iswva6yv5cbs.nar.zst: uploading NAR nar/14j04ly5a4vk2nvldm008dddhghhgkliw0vb39p7iswva6yv5cbs.nar.zst: server returned 500: 
error: dependency 'qxh1wa6pxpb84qr98d55qjlxbnplf1h9-clan-cli-source.drv' failed
failed eval checks.aarch64-linux.clan-site-lint —
error: … while calling the 'derivationStrict' builtin at «nix-internal»/derivation-internal.nix:37:12: 36| 37| strict = …
error:
       … while calling the 'derivationStrict' builtin
         at «nix-internal»/derivation-internal.nix:37:12:
           36|
           37|   strict = derivationStrict drvAttrs;
             |            ^
           38|

       … while evaluating derivation 'clan-site-lint'
         whose name attribute is located at «https://releases.nixos.org/nixos/26.05/nixos-26.05.11767.7993f34ee47e/nixexprs.tar.xz?narHash=sha256-TnALPKp8o/dtUYgE243iQMbRP4183ZPhWu33FD05k/4%3D»/pkgs/stdenv/generic/make-derivation.nix:647:11

       … while evaluating attribute 'nativeBuildInputs' of derivation 'clan-site-lint'
         at «https://releases.nixos.org/nixos/26.05/nixos-26.05.11767.7993f34ee47e/nixexprs.tar.xz?narHash=sha256-TnALPKp8o/dtUYgE243iQMbRP4183ZPhWu33FD05k/4%3D»/pkgs/stdenv/generic/make-derivation.nix:715:11:
          714|           depsBuildBuild = buildBuildOutputs;
          715|           nativeBuildInputs = buildHostOutputs;
             |           ^
          716|           depsBuildTarget = buildTargetOutputs;

       (stack trace truncated; use '--show-trace' to show the full, detailed trace)

       error: Refusing to evaluate package 'pnpm-10.34.0' in /nix/store/dqn2ddd6vpxbgx2jzparmg93hly0x1mj-source/pkgs/development/tools/pnpm/generic.nix:170 because it is marked as insecure

       Known issues:
        - CVE-2026-55487
        - CVE-2026-55698
        - CVE-2026-55180
        - CVE-2026-55697
        - CVE-2026-59194
        - CVE-2026-59195
        - CVE-2026-59196
        - CVE-2026-82392
        - CVE-2026-82393

       You can install it anyway by allowing this package, using the
       following methods:

       a) To temporarily allow all insecure packages, you can use an environment
          variable for a single invocation of the nix tools:

            $ export NIXPKGS_ALLOW_INSECURE=1

          Note: When using `nix shell`, `nix build`, `nix develop`, etc with a flake,
                then pass `--impure` in order to allow use of environment variables.

       b) for `nixos-rebuild` you can add ‘pnpm-10.34.0’ to
          `nixpkgs.config.permittedInsecurePackages` in the configuration.nix,
          like so:

            {
              nixpkgs.config.permittedInsecurePackages = [
                "pnpm-10.34.0"
              ];
            }

       c) For `nix-env`, `nix-build`, `nix-shell` or any other Nix command you can add
          ‘pnpm-10.34.0’ to `permittedInsecurePackages` in
          ~/.config/nixpkgs/config.nix, like so:

            {
              permittedInsecurePackages = [
                "pnpm-10.34.0"
              ];
            }
failed checks.aarch64-linux.clan-test-iso 2h 26m
setup: 6s2dw8311a4g1n1jcxg12p4ms8l46wb8-perl-5.42.3-env.drv: build01: the build this call attached to did not finish, retry, asking the scheduler again h30mdzcw …
setup:
6s2dw8311a4g1n1jcxg12p4ms8l46wb8-perl-5.42.3-env.drv: build01: the build this call attached to did not finish, retry, asking the scheduler again
h30mdzcw08lj8x31s611s0hhkl5qlgjr-unit-99-wireless-client-dhcp.network.drv: build01: the build this call attached to did not finish, retry, asking the scheduler again
6s2dw8311a4g1n1jcxg12p4ms8l46wb8-perl-5.42.3-env.drv: build01: the build this call attached to did not finish, retry, asking the scheduler again
h30mdzcw08lj8x31s611s0hhkl5qlgjr-unit-99-wireless-client-dhcp.network.drv: build01: the build this call attached to did not finish, retry, asking the scheduler again
6s2dw8311a4g1n1jcxg12p4ms8l46wb8-perl-5.42.3-env.drv: build01: the build this call attached to did not finish, retry, asking the scheduler again
h30mdzcw08lj8x31s611s0hhkl5qlgjr-unit-99-wireless-client-dhcp.network.drv: build01: the build this call attached to did not finish, retry, asking the scheduler again
6s2dw8311a4g1n1jcxg12p4ms8l46wb8-perl-5.42.3-env.drv: build01: the build this call attached to did not finish, retry, asking the scheduler again
error: dependency 'qq957ffs06006081hq3gx0p32mnff9n1-nixos-test-driver-clan-test-iso.drv' failed
failed checks.aarch64-linux.darwin-test-darwin-machine 7m 3s
setup: 5q0h66jqvnhnmm8d7y1m8dp6vr6qbb7z-etc-sudo_local.drv: error: gRPC QueryValidPaths on 'nix-store.geninf.io:50051' failed: error: niks3 push: uploading obje …
setup:
5q0h66jqvnhnmm8d7y1m8dp6vr6qbb7z-etc-sudo_local.drv: error: gRPC QueryValidPaths on 'nix-store.geninf.io:50051' failed: error: niks3 push: uploading objects: uploading NAR nar/17g1kgrg0hf3rh821xydx1sb0bb1dd22dy2rjajzhfamjw6brqg3.nar.zst: uploading NAR nar/17g1kgrg0hf3rh821xydx1sb0bb1dd22dy2rjajzhfamjw6brqg3.nar.zst: server returned 500: 
a2zn5rmbqzkwd54m0jkkmkl7wg4jb122-etc-zprofile.drv: error: gRPC QueryValidPaths on 'nix-store.geninf.io:50051' failed: error: niks3 push: uploading objects: uploading NAR nar/08m82djr5y1i99pvhmcs3qxhb4rfr3m00pr2366073v5zcnwf6cf.nar.zst: uploading NAR nar/08m82djr5y1i99pvhmcs3qxhb4rfr3m00pr2366073v5zcnwf6cf.nar.zst: server returned 500: 
daxrmfdmr79v27lv487bkpninrz2i4w9-nix.conf.drv: error: gRPC QueryValidPaths on 'nix-store.geninf.io:50051' failed: error: niks3 push: uploading objects: uploading NAR nar/0cygi4qjd8widwwv0z7yhzzxgifdkzk83d9gfw34mk2gc5i6qiiz.nar.zst: uploading NAR nar/0cygi4qjd8widwwv0z7yhzzxgifdkzk83d9gfw34mk2gc5i6qiiz.nar.zst: server returned 500: 
if3g4ljrvbwd3h91i7871q5dgmr7x4mi-etc-100-nix-darwin.conf.drv: error: gRPC QueryValidPaths on 'nix-store.geninf.io:50051' failed: error: niks3 push: uploading objects: uploading NAR nar/1nzzxpfa1c4dw6y504n5rdq1z5vyavfk54n4bx25grsp6h429g6k.nar.zst: uploading NAR nar/1nzzxpfa1c4dw6y504n5rdq1z5vyavfk54n4bx25grsp6h429g6k.nar.zst: server returned 500: 
ifqs0rpkk821igh43cs3956g7vb657zm-ca-certificates.crt.drv: error: gRPC QueryValidPaths on 'nix-store.geninf.io:50051' failed: error: niks3 push: uploading objects: uploading NAR nar/1xswf0qd88wv4jb5k4rdq3kaq54jgsyr0z17h2g42yzrn2m1y9l5.nar.zst: uploading NAR nar/1xswf0qd88wv4jb5k4rdq3kaq54jgsyr0z17h2g42yzrn2m1y9l5.nar.zst: server returned 500: 
y5f294bglikn7b7gcnlchbaj9j1qmfjf-etc-099-host-keys.conf.drv: error: gRPC QueryValidPaths on 'nix-store.geninf.io:50051' failed: error: niks3 push: uploading objects: uploading NAR nar/12sg4y65ickqzxj4s6gg8zx3q9qp519sl6dfmx8q7v7b49p9i04q.nar.zst: uploading NAR nar/12sg4y65ickqzxj4s6gg8zx3q9qp519sl6dfmx8q7v7b49p9i04q.nar.zst: server returned 500: 
8d3ilb98ih6zmfkrji3ar9lmh2ncqckh-darwin-version.json.drv: error: gRPC QueryValidPaths on 'nix-store.geninf.io:50051' failed: error: niks3 push: uploading objects: uploading NAR nar/0l0p7fl0zf5qv9km3hdx3c822pfxm9ars4cp119n435ngsn3vk7l.nar.zst: uploading NAR nar/0l0p7fl0zf5qv9km3hdx3c822pfxm9ars4cp119n435ngsn3vk7l.nar.zst: server returned 500: 
error: dependency 'q52zn986wach507sllk5f15iya7z5rgg-fonts.drv' failed
failed checks.aarch64-linux.data-mesher 2h 26m
setup: ylhcqjzai8ic8sijv6n02fx31dlzchj7-mount-secret-fs.drv: build01: the build this call attached to did not finish, retry, asking the scheduler again xk3c06jd …
setup:
ylhcqjzai8ic8sijv6n02fx31dlzchj7-mount-secret-fs.drv: build01: the build this call attached to did not finish, retry, asking the scheduler again
xk3c06jd3s80zzvrq8ww191chabb9dc0-etc-os-release.drv: build01: the build this call attached to did not finish, retry, asking the scheduler again
s5lvsbqnadxd04d5pm17cc3f5sqvzpg0-unit-systemd-networkd-wait-online.service-disabled.drv: build01: the build this call attached to did not finish, retry, asking the scheduler again
sf07wpdpr877dczi0h9pa338v4dlppc4-nix.conf.drv: build01: the build this call attached to did not finish, retry, asking the scheduler again
55zpgzcisvcb2r7177nms09c4vrkwyyx-nixos-version.drv: build01: the build this call attached to did not finish, retry, asking the scheduler again
zywrfchlkmlhnl7vm5bj33dv40hxvv32-generator-state-version.drv: build01: the build this call attached to did not finish, retry, asking the scheduler again
6s2dw8311a4g1n1jcxg12p4ms8l46wb8-perl-5.42.3-env.drv: build01: the build this call attached to did not finish, retry, asking the scheduler again
error: dependency '7sc3zflmgm39vrda3cvrl3iivd0sndll-nixos-test-driver-data-mesher.drv' failed
dependency failed checks.aarch64-linux.devshell —
failed checks.aarch64-linux.devShell-clan-app 3m 31s
setup: /nix/store/y8cj7zhl1wps5qymih0x16h74337scs7-zstd-1.5.7 /nix/store/s76d99f5jhvf275a937vya1ick29ydhd-zstd-1.5.7-bin /nix/store/rkxp9732fw2bpaav295g3v …
setup:
  /nix/store/y8cj7zhl1wps5qymih0x16h74337scs7-zstd-1.5.7
  /nix/store/s76d99f5jhvf275a937vya1ick29ydhd-zstd-1.5.7-bin
  /nix/store/rkxp9732fw2bpaav295g3vbccjqha4kk-zstd-1.5.7-dev
  /nix/store/2km4yjrryshf26is4pzmaqdgy74rakdl-zvbi-0.2.45
  /nix/store/2gc6y76ngaff2d3zix6bgszj69vkxbqk-zxing-cpp-2.3.0
warning: ignoring the client-specified setting 'store', because it is a restricted setting and you are not a trusted user
vmrm3hnyiyv8fjck62wcw86k7vdxlq98-clan-runtime.drv: error: gRPC AddMultipleToStore on 'nix-store.geninf.io:50051' failed: error: niks3 push: uploading objects: uploading NAR nar/14j04ly5a4vk2nvldm008dddhghhgkliw0vb39p7iswva6yv5cbs.nar.zst: uploading NAR nar/14j04ly5a4vk2nvldm008dddhghhgkliw0vb39p7iswva6yv5cbs.nar.zst: server returned 500: 
error: dependency 'vmrm3hnyiyv8fjck62wcw86k7vdxlq98-clan-runtime.drv' failed
failed checks.aarch64-linux.devShell-clan-cli 2m 42s
setup: don't know how to build these paths: /nix/store/aqb2m0irgk93bgv135jqm9lnvmwhvlba-clan-cli.drv warning: ignoring the client-specified setting 'store', b …
setup:
don't know how to build these paths:
  /nix/store/aqb2m0irgk93bgv135jqm9lnvmwhvlba-clan-cli.drv
warning: ignoring the client-specified setting 'store', because it is a restricted setting and you are not a trusted user
vmrm3hnyiyv8fjck62wcw86k7vdxlq98-clan-runtime.drv: error: gRPC AddMultipleToStore on 'nix-store.geninf.io:50051' failed: error: niks3 push: uploading objects: uploading NAR nar/14j04ly5a4vk2nvldm008dddhghhgkliw0vb39p7iswva6yv5cbs.nar.zst: uploading NAR nar/14j04ly5a4vk2nvldm008dddhghhgkliw0vb39p7iswva6yv5cbs.nar.zst: server returned 500: 
error: dependency 'vmrm3hnyiyv8fjck62wcw86k7vdxlq98-clan-runtime.drv' failed
failed eval checks.aarch64-linux.devShell-clan-site —
error: … while calling the 'derivationStrict' builtin at «nix-internal»/derivation-internal.nix:37:12: 36| 37| strict = …
error:
       … while calling the 'derivationStrict' builtin
         at «nix-internal»/derivation-internal.nix:37:12:
           36|
           37|   strict = derivationStrict drvAttrs;
             |            ^
           38|

       … while evaluating derivation 'nix-shell'
         whose name attribute is located at «https://releases.nixos.org/nixos/26.05/nixos-26.05.11767.7993f34ee47e/nixexprs.tar.xz?narHash=sha256-TnALPKp8o/dtUYgE243iQMbRP4183ZPhWu33FD05k/4%3D»/pkgs/stdenv/generic/make-derivation.nix:647:11

       … while evaluating attribute 'nativeBuildInputs' of derivation 'nix-shell'
         at «https://releases.nixos.org/nixos/26.05/nixos-26.05.11767.7993f34ee47e/nixexprs.tar.xz?narHash=sha256-TnALPKp8o/dtUYgE243iQMbRP4183ZPhWu33FD05k/4%3D»/pkgs/stdenv/generic/make-derivation.nix:715:11:
          714|           depsBuildBuild = buildBuildOutputs;
          715|           nativeBuildInputs = buildHostOutputs;
             |           ^
          716|           depsBuildTarget = buildTargetOutputs;

       (stack trace truncated; use '--show-trace' to show the full, detailed trace)

       error: Refusing to evaluate package 'pnpm-10.34.0' in /nix/store/dqn2ddd6vpxbgx2jzparmg93hly0x1mj-source/pkgs/development/tools/pnpm/generic.nix:170 because it is marked as insecure

       Known issues:
        - CVE-2026-55487
        - CVE-2026-55698
        - CVE-2026-55180
        - CVE-2026-55697
        - CVE-2026-59194
        - CVE-2026-59195
        - CVE-2026-59196
        - CVE-2026-82392
        - CVE-2026-82393

       You can install it anyway by allowing this package, using the
       following methods:

       a) To temporarily allow all insecure packages, you can use an environment
          variable for a single invocation of the nix tools:

            $ export NIXPKGS_ALLOW_INSECURE=1

          Note: When using `nix shell`, `nix build`, `nix develop`, etc with a flake,
                then pass `--impure` in order to allow use of environment variables.

       b) for `nixos-rebuild` you can add ‘pnpm-10.34.0’ to
          `nixpkgs.config.permittedInsecurePackages` in the configuration.nix,
          like so:

            {
              nixpkgs.config.permittedInsecurePackages = [
                "pnpm-10.34.0"
              ];
            }

       c) For `nix-env`, `nix-build`, `nix-shell` or any other Nix command you can add
          ‘pnpm-10.34.0’ to `permittedInsecurePackages` in
          ~/.config/nixpkgs/config.nix, like so:

            {
              permittedInsecurePackages = [
                "pnpm-10.34.0"
              ];
            }
failed checks.aarch64-linux.devShell-default 2m 38s
setup: don't know how to build these paths: /nix/store/42vicsrm62clwrsy0yrp329gixpb4nli-clan.drv warning: ignoring the client-specified setting 'store', becau …
setup:
don't know how to build these paths:
  /nix/store/42vicsrm62clwrsy0yrp329gixpb4nli-clan.drv
warning: ignoring the client-specified setting 'store', because it is a restricted setting and you are not a trusted user
vmrm3hnyiyv8fjck62wcw86k7vdxlq98-clan-runtime.drv: error: gRPC AddMultipleToStore on 'nix-store.geninf.io:50051' failed: error: niks3 push: uploading objects: uploading NAR nar/14j04ly5a4vk2nvldm008dddhghhgkliw0vb39p7iswva6yv5cbs.nar.zst: uploading NAR nar/14j04ly5a4vk2nvldm008dddhghhgkliw0vb39p7iswva6yv5cbs.nar.zst: server returned 500: 
error: dependency 'vmrm3hnyiyv8fjck62wcw86k7vdxlq98-clan-runtime.drv' failed
failed eval checks.aarch64-linux.devShell-docs —
error: … while calling the 'derivationStrict' builtin at «nix-internal»/derivation-internal.nix:37:12: 36| 37| strict = …
error:
       … while calling the 'derivationStrict' builtin
         at «nix-internal»/derivation-internal.nix:37:12:
           36|
           37|   strict = derivationStrict drvAttrs;
             |            ^
           38|

       … while evaluating derivation 'nix-shell'
         whose name attribute is located at «https://releases.nixos.org/nixos/26.05/nixos-26.05.11767.7993f34ee47e/nixexprs.tar.xz?narHash=sha256-TnALPKp8o/dtUYgE243iQMbRP4183ZPhWu33FD05k/4%3D»/pkgs/stdenv/generic/make-derivation.nix:647:11

       … while evaluating attribute 'nativeBuildInputs' of derivation 'nix-shell'
         at «https://releases.nixos.org/nixos/26.05/nixos-26.05.11767.7993f34ee47e/nixexprs.tar.xz?narHash=sha256-TnALPKp8o/dtUYgE243iQMbRP4183ZPhWu33FD05k/4%3D»/pkgs/stdenv/generic/make-derivation.nix:715:11:
          714|           depsBuildBuild = buildBuildOutputs;
          715|           nativeBuildInputs = buildHostOutputs;
             |           ^
          716|           depsBuildTarget = buildTargetOutputs;

       (stack trace truncated; use '--show-trace' to show the full, detailed trace)

       error: Refusing to evaluate package 'pnpm-10.34.0' in /nix/store/dqn2ddd6vpxbgx2jzparmg93hly0x1mj-source/pkgs/development/tools/pnpm/generic.nix:170 because it is marked as insecure

       Known issues:
        - CVE-2026-55487
        - CVE-2026-55698
        - CVE-2026-55180
        - CVE-2026-55697
        - CVE-2026-59194
        - CVE-2026-59195
        - CVE-2026-59196
        - CVE-2026-82392
        - CVE-2026-82393

       You can install it anyway by allowing this package, using the
       following methods:

       a) To temporarily allow all insecure packages, you can use an environment
          variable for a single invocation of the nix tools:

            $ export NIXPKGS_ALLOW_INSECURE=1

          Note: When using `nix shell`, `nix build`, `nix develop`, etc with a flake,
                then pass `--impure` in order to allow use of environment variables.

       b) for `nixos-rebuild` you can add ‘pnpm-10.34.0’ to
          `nixpkgs.config.permittedInsecurePackages` in the configuration.nix,
          like so:

            {
              nixpkgs.config.permittedInsecurePackages = [
                "pnpm-10.34.0"
              ];
            }

       c) For `nix-env`, `nix-build`, `nix-shell` or any other Nix command you can add
          ‘pnpm-10.34.0’ to `permittedInsecurePackages` in
          ~/.config/nixpkgs/config.nix, like so:

            {
              permittedInsecurePackages = [
                "pnpm-10.34.0"
              ];
            }
failed checks.aarch64-linux.devShell-inventory-schema 1m 44s
setup: don't know how to build these paths: /nix/store/r5yhxv3x4m04i8qclb3bvcj1443nkkh4-clan-inventory-schema.drv warning: ignoring the client-specified setti …
setup:
don't know how to build these paths:
  /nix/store/r5yhxv3x4m04i8qclb3bvcj1443nkkh4-clan-inventory-schema.drv
warning: ignoring the client-specified setting 'store', because it is a restricted setting and you are not a trusted user
vmrm3hnyiyv8fjck62wcw86k7vdxlq98-clan-runtime.drv: error: gRPC AddMultipleToStore on 'nix-store.geninf.io:50051' failed: error: niks3 push: uploading objects: uploading NAR nar/14j04ly5a4vk2nvldm008dddhghhgkliw0vb39p7iswva6yv5cbs.nar.zst: uploading NAR nar/14j04ly5a4vk2nvldm008dddhghhgkliw0vb39p7iswva6yv5cbs.nar.zst: server returned 500: 
error: dependency 'vmrm3hnyiyv8fjck62wcw86k7vdxlq98-clan-runtime.drv' failed
failed checks.aarch64-linux.dm-dns 2h 26m
setup: ylhcqjzai8ic8sijv6n02fx31dlzchj7-mount-secret-fs.drv: build01: publish failed: error: niks3 push: uploading objects: uploading build log log/ylhcqjzai8ic …
setup:
ylhcqjzai8ic8sijv6n02fx31dlzchj7-mount-secret-fs.drv: build01: publish failed: error: niks3 push: uploading objects: uploading build log log/ylhcqjzai8ic8sijv6n02fx31dlzchj7-mount-secret-fs.drv: server returned 500: , asking the scheduler again
xk3c06jd3s80zzvrq8ww191chabb9dc0-etc-os-release.drv: build01: the build this call attached to did not finish, retry, asking the scheduler again
s5lvsbqnadxd04d5pm17cc3f5sqvzpg0-unit-systemd-networkd-wait-online.service-disabled.drv: build01: the build this call attached to did not finish, retry, asking the scheduler again
sf07wpdpr877dczi0h9pa338v4dlppc4-nix.conf.drv: build01: publish failed: error: niks3 push: uploading objects: uploading build log log/sf07wpdpr877dczi0h9pa338v4dlppc4-nix.conf.drv: server returned 500: , asking the scheduler again
55zpgzcisvcb2r7177nms09c4vrkwyyx-nixos-version.drv: build01: the build this call attached to did not finish, retry, asking the scheduler again
zywrfchlkmlhnl7vm5bj33dv40hxvv32-generator-state-version.drv: build01: the build this call attached to did not finish, retry, asking the scheduler again
6s2dw8311a4g1n1jcxg12p4ms8l46wb8-perl-5.42.3-env.drv: build01: the build this call attached to did not finish, retry, asking the scheduler again
error: dependency '9y6mw1pascrh7qg7bi7j8637pqrxw3nm-nixos-test-driver-dm-dns.drv' failed
failed checks.aarch64-linux.dyndns 2h 26m
setup: sf07wpdpr877dczi0h9pa338v4dlppc4-nix.conf.drv: build01: the build this call attached to did not finish, retry, asking the scheduler again 55zpgzcisvcb2r7 …
setup:
sf07wpdpr877dczi0h9pa338v4dlppc4-nix.conf.drv: build01: the build this call attached to did not finish, retry, asking the scheduler again
55zpgzcisvcb2r7177nms09c4vrkwyyx-nixos-version.drv: build01: the build this call attached to did not finish, retry, asking the scheduler again
6s2dw8311a4g1n1jcxg12p4ms8l46wb8-perl-5.42.3-env.drv: build01: the build this call attached to did not finish, retry, asking the scheduler again
ylhcqjzai8ic8sijv6n02fx31dlzchj7-mount-secret-fs.drv: build01: the build this call attached to did not finish, retry, asking the scheduler again
sf07wpdpr877dczi0h9pa338v4dlppc4-nix.conf.drv: build01: the build this call attached to did not finish, retry, asking the scheduler again
55zpgzcisvcb2r7177nms09c4vrkwyyx-nixos-version.drv: build01: publish failed: error: niks3 push: uploading objects: uploading build log log/55zpgzcisvcb2r7177nms09c4vrkwyyx-nixos-version.drv: server returned 500: , asking the scheduler again
6s2dw8311a4g1n1jcxg12p4ms8l46wb8-perl-5.42.3-env.drv: build01: the build this call attached to did not finish, retry, asking the scheduler again
error: dependency '9kajv2jxp5hv88j9r1ccsyq64db2wi2y-nixos-test-driver-dyndns.drv' failed
failed checks.aarch64-linux.eval-tests 1h 22m
setup: lvcfvp2qnmka0hfph852jjvkq3j4sf3b-evalCheck-eval-lib-distributedServices.drv: error: gRPC AddMultipleToStore on 'nix-store.geninf.io:50051' failed: error: …
setup:
lvcfvp2qnmka0hfph852jjvkq3j4sf3b-evalCheck-eval-lib-distributedServices.drv: error: gRPC AddMultipleToStore on 'nix-store.geninf.io:50051' failed: error: niks3 push: uploading objects: uploading NAR nar/1941r9xarrm04vqf6d4ymxl12f2jy5jnx5gb36wfza0df1knla27.nar.zst: uploading NAR nar/1941r9xarrm04vqf6d4ymxl12f2jy5jnx5gb36wfza0df1knla27.nar.zst: server returned 500: 
46kw2x3r4qqasc46sjkd0png6kv29qn8-evalCheck-eval-tests-zerotier.drv: error: gRPC AddMultipleToStore on 'nix-store.geninf.io:50051' failed: error: niks3 push: uploading objects: uploading NAR nar/058n1d5mjg6brv5dl7qpddc2apgc0s9f435h1f1yj7kf060qdg00.nar.zst: uploading NAR nar/058n1d5mjg6brv5dl7qpddc2apgc0s9f435h1f1yj7kf060qdg00.nar.zst: server returned 500: 
x37m4mx0iwly0xy7i6bbw6xnr6bmgpmg-evalCheck-eval-vars-backends.drv: error: gRPC AddMultipleToStore on 'nix-store.geninf.io:50051' failed: error: niks3 push: uploading objects: uploading NAR nar/1hkvx39haj7g49g1hyc12vlng34c328wik1zyr6kz62nrn4ww4dm.nar.zst: uploading NAR nar/1hkvx39haj7g49g1hyc12vlng34c328wik1zyr6kz62nrn4ww4dm.nar.zst: server returned 500: 
lxrsdj2709j2i7m4vikxvvxhx1mcz7cl-evalCheck-eval-module-clan-vars.drv: error: gRPC AddMultipleToStore on 'nix-store.geninf.io:50051' failed: error: niks3 push: uploading objects: uploading NAR nar/14ms0r6msj60v6acrglz4jphd9b0dy80sgb0ww84ard5kilwzd0d.nar.zst: uploading NAR nar/14ms0r6msj60v6acrglz4jphd9b0dy80sgb0ww84ard5kilwzd0d.nar.zst: server returned 500: 
i1l6n5dz3w9scvb4pzrns8gicwbr0rrl-evalCheck-eval-tests-syncthing.drv: error: gRPC AddMultipleToStore on 'nix-store.geninf.io:50051' failed: error: niks3 push: uploading objects: uploading NAR nar/0bvjwqba6wda0xjxv4m7nkckginav5244qgi51k25qpyv2jvwx2s.nar.zst: uploading NAR nar/0bvjwqba6wda0xjxv4m7nkckginav5244qgi51k25qpyv2jvwx2s.nar.zst: server returned 500: 
zmy6vljdgrw5sab031lvcwp5pxrm9n3f-evalCheck-eval-tests-hello-world.drv: error: gRPC AddMultipleToStore on 'nix-store.geninf.io:50051' failed: error: niks3 push: uploading objects: uploading NAR nar/1q4fpgsf9k98xdd860rbfzapsmfscn2mc3808smcrsvvisa543dg.nar.zst: uploading NAR nar/1q4fpgsf9k98xdd860rbfzapsmfscn2mc3808smcrsvvisa543dg.nar.zst: server returned 500: 
bg0nqkhdq6w6kk231rmv7rwiwv5gxgny-evalCheck-eval-tests-types.drv: error: gRPC AddMultipleToStore on 'nix-store.geninf.io:50051' failed: error: niks3 push: uploading objects: uploading NAR nar/0bfc4drmwkidgbhrkij0gpad4ymj4zhzb79yw76hvrsjy45zbllj.nar.zst: uploading NAR nar/0bfc4drmwkidgbhrkij0gpad4ymj4zhzb79yw76hvrsjy45zbllj.nar.zst: server returned 500: 
error: dependency 'qx6z4k0ppl0zh082dg8799nksnm7m56b-evalCheck-eval-lib-relativeDir.drv' failed
failed checks.aarch64-linux.garage 2h 26m
setup: ylhcqjzai8ic8sijv6n02fx31dlzchj7-mount-secret-fs.drv: build01: the build this call attached to did not finish, retry, asking the scheduler again xk3c06jd …
setup:
ylhcqjzai8ic8sijv6n02fx31dlzchj7-mount-secret-fs.drv: build01: the build this call attached to did not finish, retry, asking the scheduler again
xk3c06jd3s80zzvrq8ww191chabb9dc0-etc-os-release.drv: build01: the build this call attached to did not finish, retry, asking the scheduler again
s5lvsbqnadxd04d5pm17cc3f5sqvzpg0-unit-systemd-networkd-wait-online.service-disabled.drv: build01: the build this call attached to did not finish, retry, asking the scheduler again
sf07wpdpr877dczi0h9pa338v4dlppc4-nix.conf.drv: build01: the build this call attached to did not finish, retry, asking the scheduler again
55zpgzcisvcb2r7177nms09c4vrkwyyx-nixos-version.drv: build01: the build this call attached to did not finish, retry, asking the scheduler again
zywrfchlkmlhnl7vm5bj33dv40hxvv32-generator-state-version.drv: build01: publish failed: error: niks3 push: uploading objects: uploading build log log/zywrfchlkmlhnl7vm5bj33dv40hxvv32-generator-state-version.drv: server returned 500: , asking the scheduler again
6s2dw8311a4g1n1jcxg12p4ms8l46wb8-perl-5.42.3-env.drv: build01: the build this call attached to did not finish, retry, asking the scheduler again
error: dependency 'gn7m9q0x0r9d2lksrj86lqs9rpyb6da8-nixos-test-driver-garage.drv' failed
failed checks.aarch64-linux.hello-service 2h 48m
setup: q81la62jls0xps5wrxsz899bip677nxl-unit-NetworkManager-wait-online.service-disabled.drv: build01: the build this call attached to did not finish, retry, as …
setup:
q81la62jls0xps5wrxsz899bip677nxl-unit-NetworkManager-wait-online.service-disabled.drv: build01: the build this call attached to did not finish, retry, asking the scheduler again
ylhcqjzai8ic8sijv6n02fx31dlzchj7-mount-secret-fs.drv: build01: the build this call attached to did not finish, retry, asking the scheduler again
xk3c06jd3s80zzvrq8ww191chabb9dc0-etc-os-release.drv: build01: the build this call attached to did not finish, retry, asking the scheduler again
s5lvsbqnadxd04d5pm17cc3f5sqvzpg0-unit-systemd-networkd-wait-online.service-disabled.drv: build01: the build this call attached to did not finish, retry, asking the scheduler again
sf07wpdpr877dczi0h9pa338v4dlppc4-nix.conf.drv: build01: publish failed: error: niks3 push: uploading objects: uploading listing 9d7gg64nc7x6cp7p8baznwr3agibzmfr.ls: server returned 500: , asking the scheduler again
55zpgzcisvcb2r7177nms09c4vrkwyyx-nixos-version.drv: build01: the build this call attached to did not finish, retry, asking the scheduler again
zywrfchlkmlhnl7vm5bj33dv40hxvv32-generator-state-version.drv: build01: the build this call attached to did not finish, retry, asking the scheduler again
error: dependency '5xlsg0sxxa42drz37dpgk1bl2rrxjs6k-nixos-test-driver-hello-service.drv' failed
failed checks.aarch64-linux.inventory-classes-up-to-date 8s
setup: /nix/store/b6vm0prra0d57wc0ckw8rw13mpc278fk-update-autotools-gnu-config-scripts-hook /nix/store/8706ximl3mqxvm84mbvnfwrnlkh18lc9-xgcc-15.3.0-libgcc …
setup:
  /nix/store/b6vm0prra0d57wc0ckw8rw13mpc278fk-update-autotools-gnu-config-scripts-hook
  /nix/store/8706ximl3mqxvm84mbvnfwrnlkh18lc9-xgcc-15.3.0-libgcc
  /nix/store/0vaay23s063jqncj8abyf1gxqqz24cw6-xz-5.8.4
  /nix/store/zxnm3z1pi8bivmcnv31jcghs09h1if75-xz-5.8.4-bin
  /nix/store/wfc7fszkgqbdp58mc41zzzq3hf0i3p5d-zlib-1.3.2
warning: ignoring the client-specified setting 'store', because it is a restricted setting and you are not a trusted user
1iswahhxzav31qdc565jchpp7b361sq0-inventory-classes-up-to-date.drv: error: gRPC AddMultipleToStore on 'nix-store.geninf.io:50051' failed: error: niks3 push: uploading objects: uploading NAR nar/1s8ay40grb3arshnjwdxbh300smh8820v9gcykwfw10l14j4w400.nar.zst: uploading NAR nar/1s8ay40grb3arshnjwdxbh300smh8820v9gcykwfw10l14j4w400.nar.zst: server returned 500: 
error: error: gRPC AddMultipleToStore on 'nix-store.geninf.io:50051' failed: error: niks3 push: uploading objects: uploading NAR nar/1s8ay40grb3arshnjwdxbh300smh8820v9gcykwfw10l14j4w400.nar.zst: uploading NAR nar/1s8ay40grb3arshnjwdxbh300smh8820v9gcykwfw10l14j4w400.nar.zst: server returned 500: 
failed checks.aarch64-linux.kde 2h 26m
setup: ylhcqjzai8ic8sijv6n02fx31dlzchj7-mount-secret-fs.drv: build01: the build this call attached to did not finish, retry, asking the scheduler again xk3c06jd …
setup:
ylhcqjzai8ic8sijv6n02fx31dlzchj7-mount-secret-fs.drv: build01: the build this call attached to did not finish, retry, asking the scheduler again
xk3c06jd3s80zzvrq8ww191chabb9dc0-etc-os-release.drv: build01: the build this call attached to did not finish, retry, asking the scheduler again
s5lvsbqnadxd04d5pm17cc3f5sqvzpg0-unit-systemd-networkd-wait-online.service-disabled.drv: build01: the build this call attached to did not finish, retry, asking the scheduler again
sf07wpdpr877dczi0h9pa338v4dlppc4-nix.conf.drv: build01: the build this call attached to did not finish, retry, asking the scheduler again
55zpgzcisvcb2r7177nms09c4vrkwyyx-nixos-version.drv: build01: the build this call attached to did not finish, retry, asking the scheduler again
zywrfchlkmlhnl7vm5bj33dv40hxvv32-generator-state-version.drv: build01: the build this call attached to did not finish, retry, asking the scheduler again
6s2dw8311a4g1n1jcxg12p4ms8l46wb8-perl-5.42.3-env.drv: build01: the build this call attached to did not finish, retry, asking the scheduler again
error: dependency '7gcaacww817figjhl7y84469sbiwc447-nixos-test-driver-kde.drv' failed
failed checks.aarch64-linux.localbackup 2h 26m
setup: 6s2dw8311a4g1n1jcxg12p4ms8l46wb8-perl-5.42.3-env.drv: build01: the build this call attached to did not finish, retry, asking the scheduler again q81la62j …
setup:
6s2dw8311a4g1n1jcxg12p4ms8l46wb8-perl-5.42.3-env.drv: build01: the build this call attached to did not finish, retry, asking the scheduler again
q81la62jls0xps5wrxsz899bip677nxl-unit-NetworkManager-wait-online.service-disabled.drv: build01: the build this call attached to did not finish, retry, asking the scheduler again
ylhcqjzai8ic8sijv6n02fx31dlzchj7-mount-secret-fs.drv: build01: the build this call attached to did not finish, retry, asking the scheduler again
xk3c06jd3s80zzvrq8ww191chabb9dc0-etc-os-release.drv: build01: publish failed: error: niks3 push: uploading objects: uploading listing xgyfrbrvlxryqrlgd18rn6rpfzzv2awz.ls: server returned 500: , asking the scheduler again
sf07wpdpr877dczi0h9pa338v4dlppc4-nix.conf.drv: build01: the build this call attached to did not finish, retry, asking the scheduler again
55zpgzcisvcb2r7177nms09c4vrkwyyx-nixos-version.drv: build01: the build this call attached to did not finish, retry, asking the scheduler again
6s2dw8311a4g1n1jcxg12p4ms8l46wb8-perl-5.42.3-env.drv: build01: the build this call attached to did not finish, retry, asking the scheduler again
error: dependency '9ijmjnmf167jsj61m213w7m0fbn7zmnj-nixos-test-driver-localbackup.drv' failed
failed checks.aarch64-linux.machine-id 2h 48m
setup: ylhcqjzai8ic8sijv6n02fx31dlzchj7-mount-secret-fs.drv: build01: the build this call attached to did not finish, retry, asking the scheduler again xk3c06jd …
setup:
ylhcqjzai8ic8sijv6n02fx31dlzchj7-mount-secret-fs.drv: build01: the build this call attached to did not finish, retry, asking the scheduler again
xk3c06jd3s80zzvrq8ww191chabb9dc0-etc-os-release.drv: build01: the build this call attached to did not finish, retry, asking the scheduler again
s5lvsbqnadxd04d5pm17cc3f5sqvzpg0-unit-systemd-networkd-wait-online.service-disabled.drv: build01: the build this call attached to did not finish, retry, asking the scheduler again
sf07wpdpr877dczi0h9pa338v4dlppc4-nix.conf.drv: build01: the build this call attached to did not finish, retry, asking the scheduler again
55zpgzcisvcb2r7177nms09c4vrkwyyx-nixos-version.drv: build01: the build this call attached to did not finish, retry, asking the scheduler again
zywrfchlkmlhnl7vm5bj33dv40hxvv32-generator-state-version.drv: build01: the build this call attached to did not finish, retry, asking the scheduler again
6s2dw8311a4g1n1jcxg12p4ms8l46wb8-perl-5.42.3-env.drv: build01: the build this call attached to did not finish, retry, asking the scheduler again
error: dependency '5afwnx9b7p5372w6m8j01l3pckzg7rmr-nixos-test-driver-service-machine-id.drv' failed
failed checks.aarch64-linux.matrix-synapse 2h 26m
setup: ylhcqjzai8ic8sijv6n02fx31dlzchj7-mount-secret-fs.drv: build01: the build this call attached to did not finish, retry, asking the scheduler again xk3c06jd …
setup:
ylhcqjzai8ic8sijv6n02fx31dlzchj7-mount-secret-fs.drv: build01: the build this call attached to did not finish, retry, asking the scheduler again
xk3c06jd3s80zzvrq8ww191chabb9dc0-etc-os-release.drv: build01: the build this call attached to did not finish, retry, asking the scheduler again
s5lvsbqnadxd04d5pm17cc3f5sqvzpg0-unit-systemd-networkd-wait-online.service-disabled.drv: build01: the build this call attached to did not finish, retry, asking the scheduler again
sf07wpdpr877dczi0h9pa338v4dlppc4-nix.conf.drv: build01: the build this call attached to did not finish, retry, asking the scheduler again
55zpgzcisvcb2r7177nms09c4vrkwyyx-nixos-version.drv: build01: the build this call attached to did not finish, retry, asking the scheduler again
zywrfchlkmlhnl7vm5bj33dv40hxvv32-generator-state-version.drv: build01: the build this call attached to did not finish, retry, asking the scheduler again
6s2dw8311a4g1n1jcxg12p4ms8l46wb8-perl-5.42.3-env.drv: build01: the build this call attached to did not finish, retry, asking the scheduler again
error: dependency 'l2akmarlg72d37nlibhk9p1g43yizk3w-nixos-test-driver-matrix-synapse.drv' failed
failed checks.aarch64-linux.monitoring 2h 26m
setup: ylhcqjzai8ic8sijv6n02fx31dlzchj7-mount-secret-fs.drv: build01: the build this call attached to did not finish, retry, asking the scheduler again xk3c06jd …
setup:
ylhcqjzai8ic8sijv6n02fx31dlzchj7-mount-secret-fs.drv: build01: the build this call attached to did not finish, retry, asking the scheduler again
xk3c06jd3s80zzvrq8ww191chabb9dc0-etc-os-release.drv: build01: the build this call attached to did not finish, retry, asking the scheduler again
s5lvsbqnadxd04d5pm17cc3f5sqvzpg0-unit-systemd-networkd-wait-online.service-disabled.drv: build01: the build this call attached to did not finish, retry, asking the scheduler again
sf07wpdpr877dczi0h9pa338v4dlppc4-nix.conf.drv: build01: the build this call attached to did not finish, retry, asking the scheduler again
55zpgzcisvcb2r7177nms09c4vrkwyyx-nixos-version.drv: build01: the build this call attached to did not finish, retry, asking the scheduler again
zywrfchlkmlhnl7vm5bj33dv40hxvv32-generator-state-version.drv: build01: the build this call attached to did not finish, retry, asking the scheduler again
6s2dw8311a4g1n1jcxg12p4ms8l46wb8-perl-5.42.3-env.drv: build01: the build this call attached to did not finish, retry, asking the scheduler again
error: dependency '512fi80s6sgr31pygwkczi6wfb1zwivj-nixos-test-driver-monitoring.drv' failed
failed checks.aarch64-linux.mycelium 2h 26m
setup: xk3c06jd3s80zzvrq8ww191chabb9dc0-etc-os-release.drv: build01: the build this call attached to did not finish, retry, asking the scheduler again s5lvsbqna …
setup:
xk3c06jd3s80zzvrq8ww191chabb9dc0-etc-os-release.drv: build01: the build this call attached to did not finish, retry, asking the scheduler again
s5lvsbqnadxd04d5pm17cc3f5sqvzpg0-unit-systemd-networkd-wait-online.service-disabled.drv: build01: the build this call attached to did not finish, retry, asking the scheduler again
sf07wpdpr877dczi0h9pa338v4dlppc4-nix.conf.drv: build01: the build this call attached to did not finish, retry, asking the scheduler again
h30mdzcw08lj8x31s611s0hhkl5qlgjr-unit-99-wireless-client-dhcp.network.drv: build01: publish failed: error: niks3 push: uploading objects: uploading build log log/h30mdzcw08lj8x31s611s0hhkl5qlgjr-unit-99-wireless-client-dhcp.network.drv: server returned 500: , asking the scheduler again
55zpgzcisvcb2r7177nms09c4vrkwyyx-nixos-version.drv: build01: the build this call attached to did not finish, retry, asking the scheduler again
zywrfchlkmlhnl7vm5bj33dv40hxvv32-generator-state-version.drv: build01: the build this call attached to did not finish, retry, asking the scheduler again
6s2dw8311a4g1n1jcxg12p4ms8l46wb8-perl-5.42.3-env.drv: build01: the build this call attached to did not finish, retry, asking the scheduler again
error: dependency '5qc4dcz7ggzbbm5vh3dc0vx6lsp9h8an-nixos-test-driver-mycelium.drv' failed
failed checks.aarch64-linux.ncps 2h 26m
setup: ylhcqjzai8ic8sijv6n02fx31dlzchj7-mount-secret-fs.drv: build01: the build this call attached to did not finish, retry, asking the scheduler again xk3c06jd …
setup:
ylhcqjzai8ic8sijv6n02fx31dlzchj7-mount-secret-fs.drv: build01: the build this call attached to did not finish, retry, asking the scheduler again
xk3c06jd3s80zzvrq8ww191chabb9dc0-etc-os-release.drv: build01: the build this call attached to did not finish, retry, asking the scheduler again
s5lvsbqnadxd04d5pm17cc3f5sqvzpg0-unit-systemd-networkd-wait-online.service-disabled.drv: build01: the build this call attached to did not finish, retry, asking the scheduler again
sf07wpdpr877dczi0h9pa338v4dlppc4-nix.conf.drv: build01: the build this call attached to did not finish, retry, asking the scheduler again
55zpgzcisvcb2r7177nms09c4vrkwyyx-nixos-version.drv: build01: the build this call attached to did not finish, retry, asking the scheduler again
zywrfchlkmlhnl7vm5bj33dv40hxvv32-generator-state-version.drv: build01: the build this call attached to did not finish, retry, asking the scheduler again
6s2dw8311a4g1n1jcxg12p4ms8l46wb8-perl-5.42.3-env.drv: build01: the build this call attached to did not finish, retry, asking the scheduler again
error: dependency 'ak2lxr6b7hafxwsw13m5f8pl89z5v4gi-nixos-test-driver-ncps.drv' failed
failed checks.aarch64-linux.nixos-documentation 8m 24s
setup: cg9f0if688w7gkm0f85kf62lfigb2cdz-nixos-version.drv: gi-build-x86-02: publish failed: error: niks3 push: uploading objects: uploading build log log/cg9f0i …
setup:
cg9f0if688w7gkm0f85kf62lfigb2cdz-nixos-version.drv: gi-build-x86-02: publish failed: error: niks3 push: uploading objects: uploading build log log/cg9f0if688w7gkm0f85kf62lfigb2cdz-nixos-version.drv: server returned 500: , asking the scheduler again
cg9f0if688w7gkm0f85kf62lfigb2cdz-nixos-version.drv: build-x86-01: publish failed: error: niks3 push: uploading objects: uploading build log log/cg9f0if688w7gkm0f85kf62lfigb2cdz-nixos-version.drv: server returned 500: , asking the scheduler again
vms9scp713fp8cjdfv0b90msxb8crd83-command-not-found.drv: gi-build-x86-02: publish failed: error: niks3 push: uploading objects: uploading NAR nar/0qmrbzrb6wdc2vd3ac5dk9zps78lf9pksbvbw5v8q84p6b3fmcwc.nar.zst: uploading NAR nar/0qmrbzrb6wdc2vd3ac5dk9zps78lf9pksbvbw5v8q84p6b3fmcwc.nar.zst: server returned 500: , asking the scheduler again
vms9scp713fp8cjdfv0b90msxb8crd83-command-not-found.drv: build-x86-01: the build this call attached to did not finish, retry, asking the scheduler again
cg9f0if688w7gkm0f85kf62lfigb2cdz-nixos-version.drv: gi-build-x86-02: publish failed: error: niks3 push: uploading objects: uploading NAR nar/1m1hgdfl2rxypg3w8m7hac2vvq9diivapvpsqbzkgvjgq8w5hhjl.nar.zst: uploading NAR nar/1m1hgdfl2rxypg3w8m7hac2vvq9diivapvpsqbzkgvjgq8w5hhjl.nar.zst: server returned 500: , asking the scheduler again
vms9scp713fp8cjdfv0b90msxb8crd83-command-not-found.drv: gi-build-x86-02: publish failed: error: niks3 push: uploading objects: uploading build log log/vms9scp713fp8cjdfv0b90msxb8crd83-command-not-found.drv: server returned 500: , asking the scheduler again
cg9f0if688w7gkm0f85kf62lfigb2cdz-nixos-version.drv: gi-build-x86-02: publish failed: error: niks3 push: uploading objects: uploading NAR nar/1m1hgdfl2rxypg3w8m7hac2vvq9diivapvpsqbzkgvjgq8w5hhjl.nar.zst: uploading NAR nar/1m1hgdfl2rxypg3w8m7hac2vvq9diivapvpsqbzkgvjgq8w5hhjl.nar.zst: server returned 500: , asking the scheduler again
error: dependency '0zpxyxxkrwf6zh2xlmij2q4ayw7xsxc1-initrd-linux-6.18.56.drv' failed
failed checks.aarch64-linux.nixos-flash-installer 1m 54s
setup: warning: ignoring the client-specified setting 'store', because it is a restricted setting and you are not a trusted user hxkcgamv3mkq0zbd7qrh866kzyaziln …
setup:
warning: ignoring the client-specified setting 'store', because it is a restricted setting and you are not a trusted user
hxkcgamv3mkq0zbd7qrh866kzyazilnb-etc-os-release.drv: error: gRPC AddMultipleToStore on 'nix-store.geninf.io:50051' failed: error: niks3 push: uploading objects: uploading NAR nar/1f7rxs8r5z4j8ayfsb64zfzy9z8cfs2gy0fzjp8crhhz5mhwp7lb.nar.zst: uploading NAR nar/1f7rxs8r5z4j8ayfsb64zfzy9z8cfs2gy0fzjp8crhhz5mhwp7lb.nar.zst: server returned 500: 
vms9scp713fp8cjdfv0b90msxb8crd83-command-not-found.drv: error: gRPC AddMultipleToStore on 'nix-store.geninf.io:50051' failed: error: niks3 push: uploading objects: uploading NAR nar/16gn0s86xk3mcndb85az02xp84sbnk80m6w848nky2acjj1jrpgg.nar.zst: uploading NAR nar/16gn0s86xk3mcndb85az02xp84sbnk80m6w848nky2acjj1jrpgg.nar.zst: server returned 500: 
cg9f0if688w7gkm0f85kf62lfigb2cdz-nixos-version.drv: error: gRPC AddMultipleToStore on 'nix-store.geninf.io:50051' failed: error: niks3 push: uploading objects: uploading NAR nar/1npbd6dszylgz1ywz8rwnkivbwlqznwz2866cvapndrdmsqc7lv9.nar.zst: uploading NAR nar/1npbd6dszylgz1ywz8rwnkivbwlqznwz2866cvapndrdmsqc7lv9.nar.zst: server returned 500: 
pp54afhyvwirdsb82s5v7hf42yi8cp23-issue.drv: error: gRPC AddMultipleToStore on 'nix-store.geninf.io:50051' failed: error: niks3 push: uploading objects: uploading NAR nar/1s4b3a4z4nxv23drfss132f913zihrs8kfjyx40cypd8zv4r4dim.nar.zst: uploading NAR nar/1s4b3a4z4nxv23drfss132f913zihrs8kfjyx40cypd8zv4r4dim.nar.zst: server returned 500: 
6lc9nfw3fkn744md97gqpwr66jppq6r1-linux-7.2.10-modules.drv: error: gRPC AddMultipleToStore on 'nix-store.geninf.io:50051' failed: error: niks3 push: uploading objects: uploading NAR nar/1zynr94qhh7qqr185yp92x11dm4ylcq2h3345lrgbpmhk84x0qw8.nar.zst: uploading NAR nar/1zynr94qhh7qqr185yp92x11dm4ylcq2h3345lrgbpmhk84x0qw8.nar.zst: server returned 500: 
hrckpmk4dwbxpzc48wyvn5wja8g7kibx-nixos-26.05.20261012.7993f34.drv: error: gRPC AddMultipleToStore on 'nix-store.geninf.io:50051' failed: error: niks3 push: uploading objects: uploading NAR nar/0mgcm92mil8yf0vd71qdkx63s02yygvz6fwy3d8zjn3mmbjaqj11.nar.zst: uploading NAR nar/0mgcm92mil8yf0vd71qdkx63s02yygvz6fwy3d8zjn3mmbjaqj11.nar.zst: server returned 500: 
error: dependency '102bb9r74xmwb8jb9jf1j0n1v3f0q5md-system-path.drv' failed
failed checks.aarch64-linux.nixos-systemd-abstraction 2h 26m
setup: 6s2dw8311a4g1n1jcxg12p4ms8l46wb8-perl-5.42.3-env.drv: build01: the build this call attached to did not finish, retry, asking the scheduler again xk3c06jd …
setup:
6s2dw8311a4g1n1jcxg12p4ms8l46wb8-perl-5.42.3-env.drv: build01: the build this call attached to did not finish, retry, asking the scheduler again
xk3c06jd3s80zzvrq8ww191chabb9dc0-etc-os-release.drv: build01: the build this call attached to did not finish, retry, asking the scheduler again
55zpgzcisvcb2r7177nms09c4vrkwyyx-nixos-version.drv: build01: the build this call attached to did not finish, retry, asking the scheduler again
6s2dw8311a4g1n1jcxg12p4ms8l46wb8-perl-5.42.3-env.drv: build01: the build this call attached to did not finish, retry, asking the scheduler again
xk3c06jd3s80zzvrq8ww191chabb9dc0-etc-os-release.drv: build01: the build this call attached to did not finish, retry, asking the scheduler again
55zpgzcisvcb2r7177nms09c4vrkwyyx-nixos-version.drv: build01: the build this call attached to did not finish, retry, asking the scheduler again
6s2dw8311a4g1n1jcxg12p4ms8l46wb8-perl-5.42.3-env.drv: build01: the build this call attached to did not finish, retry, asking the scheduler again
error: dependency '3zl489gq97gns5kq40nv0yiqw32fry77-nixos-test-driver-systemd-abstraction.drv' failed
failed checks.aarch64-linux.nixos-test-age-backend 3h 0m
setup: ylhcqjzai8ic8sijv6n02fx31dlzchj7-mount-secret-fs.drv: build01: the build this call attached to did not finish, retry, asking the scheduler again xk3c06jd …
setup:
ylhcqjzai8ic8sijv6n02fx31dlzchj7-mount-secret-fs.drv: build01: the build this call attached to did not finish, retry, asking the scheduler again
xk3c06jd3s80zzvrq8ww191chabb9dc0-etc-os-release.drv: build01: publish failed: error: niks3 push: uploading objects: uploading build log log/xk3c06jd3s80zzvrq8ww191chabb9dc0-etc-os-release.drv: server returned 500: , asking the scheduler again
s5lvsbqnadxd04d5pm17cc3f5sqvzpg0-unit-systemd-networkd-wait-online.service-disabled.drv: build01: the build this call attached to did not finish, retry, asking the scheduler again
sf07wpdpr877dczi0h9pa338v4dlppc4-nix.conf.drv: build01: the build this call attached to did not finish, retry, asking the scheduler again
h30mdzcw08lj8x31s611s0hhkl5qlgjr-unit-99-wireless-client-dhcp.network.drv: build01: the build this call attached to did not finish, retry, asking the scheduler again
55zpgzcisvcb2r7177nms09c4vrkwyyx-nixos-version.drv: build01: the build this call attached to did not finish, retry, asking the scheduler again
zywrfchlkmlhnl7vm5bj33dv40hxvv32-generator-state-version.drv: build01: the build this call attached to did not finish, retry, asking the scheduler again
6s2dw8311a4g1n1jcxg12p4ms8l46wb8-perl-5.42.3-env.drv: build01: the build this call attached to did not finish, retry, asking the scheduler again
failed checks.aarch64-linux.nixos-test-container 2h 26m
setup: 6s2dw8311a4g1n1jcxg12p4ms8l46wb8-perl-5.42.3-env.drv: build01: the build this call attached to did not finish, retry, asking the scheduler again xk3c06jd …
setup:
6s2dw8311a4g1n1jcxg12p4ms8l46wb8-perl-5.42.3-env.drv: build01: the build this call attached to did not finish, retry, asking the scheduler again
xk3c06jd3s80zzvrq8ww191chabb9dc0-etc-os-release.drv: build01: the build this call attached to did not finish, retry, asking the scheduler again
55zpgzcisvcb2r7177nms09c4vrkwyyx-nixos-version.drv: build01: the build this call attached to did not finish, retry, asking the scheduler again
6s2dw8311a4g1n1jcxg12p4ms8l46wb8-perl-5.42.3-env.drv: build01: the build this call attached to did not finish, retry, asking the scheduler again
xk3c06jd3s80zzvrq8ww191chabb9dc0-etc-os-release.drv: build01: the build this call attached to did not finish, retry, asking the scheduler again
55zpgzcisvcb2r7177nms09c4vrkwyyx-nixos-version.drv: build01: the build this call attached to did not finish, retry, asking the scheduler again
6s2dw8311a4g1n1jcxg12p4ms8l46wb8-perl-5.42.3-env.drv: build01: the build this call attached to did not finish, retry, asking the scheduler again
error: dependency 'z48qrlakc2wfpk8zw9x3lh5jjrx7j67b-nixos-test-driver-container.drv' failed
failed checks.aarch64-linux.nixos-test-extra-python-packages 2h 47m
setup: xk3c06jd3s80zzvrq8ww191chabb9dc0-etc-os-release.drv: build01: the build this call attached to did not finish, retry, asking the scheduler again 55zpgzcis …
setup:
xk3c06jd3s80zzvrq8ww191chabb9dc0-etc-os-release.drv: build01: the build this call attached to did not finish, retry, asking the scheduler again
55zpgzcisvcb2r7177nms09c4vrkwyyx-nixos-version.drv: build01: the build this call attached to did not finish, retry, asking the scheduler again
6s2dw8311a4g1n1jcxg12p4ms8l46wb8-perl-5.42.3-env.drv: build01: the build this call attached to did not finish, retry, asking the scheduler again
xk3c06jd3s80zzvrq8ww191chabb9dc0-etc-os-release.drv: build01: the build this call attached to did not finish, retry, asking the scheduler again
55zpgzcisvcb2r7177nms09c4vrkwyyx-nixos-version.drv: build01: the build this call attached to did not finish, retry, asking the scheduler again
6s2dw8311a4g1n1jcxg12p4ms8l46wb8-perl-5.42.3-env.drv: build01: the build this call attached to did not finish, retry, asking the scheduler again
xk3c06jd3s80zzvrq8ww191chabb9dc0-etc-os-release.drv: build01: the build this call attached to did not finish, retry, asking the scheduler again
error: dependency '7q3gfndxkizrb4lnbibd6kaalzlwnvad-nixos-test-driver-test-extra-python-packages.drv' failed
failed checks.aarch64-linux.nixos-test-password-store-mounts 2h 36m
setup: s5lvsbqnadxd04d5pm17cc3f5sqvzpg0-unit-systemd-networkd-wait-online.service-disabled.drv: build01: the build this call attached to did not finish, retry, …
setup:
s5lvsbqnadxd04d5pm17cc3f5sqvzpg0-unit-systemd-networkd-wait-online.service-disabled.drv: build01: the build this call attached to did not finish, retry, asking the scheduler again
sf07wpdpr877dczi0h9pa338v4dlppc4-nix.conf.drv: build01: the build this call attached to did not finish, retry, asking the scheduler again
h30mdzcw08lj8x31s611s0hhkl5qlgjr-unit-99-wireless-client-dhcp.network.drv: build01: the build this call attached to did not finish, retry, asking the scheduler again
55zpgzcisvcb2r7177nms09c4vrkwyyx-nixos-version.drv: build01: the build this call attached to did not finish, retry, asking the scheduler again
zywrfchlkmlhnl7vm5bj33dv40hxvv32-generator-state-version.drv: build01: the build this call attached to did not finish, retry, asking the scheduler again
6s2dw8311a4g1n1jcxg12p4ms8l46wb8-perl-5.42.3-env.drv: build01: the build this call attached to did not finish, retry, asking the scheduler again
40qlk24y0pq5f4581j8w472f24b8l9pp-unit-99-ethernet-default-dhcp.network.drv: build01: the build this call attached to did not finish, retry, asking the scheduler again
error: dependency 'xid5lpqm9bybf7zi07zhsmrkx20cgs6x-nixos-test-driver-nixos-test-password-store-mounts.drv' failed
failed checks.aarch64-linux.nixos-test-secrets 2h 58m
setup: xk3c06jd3s80zzvrq8ww191chabb9dc0-etc-os-release.drv: build01: the build this call attached to did not finish, retry, asking the scheduler again s5lvsbqna …
setup:
xk3c06jd3s80zzvrq8ww191chabb9dc0-etc-os-release.drv: build01: the build this call attached to did not finish, retry, asking the scheduler again
s5lvsbqnadxd04d5pm17cc3f5sqvzpg0-unit-systemd-networkd-wait-online.service-disabled.drv: build01: the build this call attached to did not finish, retry, asking the scheduler again
sf07wpdpr877dczi0h9pa338v4dlppc4-nix.conf.drv: build01: the build this call attached to did not finish, retry, asking the scheduler again
h30mdzcw08lj8x31s611s0hhkl5qlgjr-unit-99-wireless-client-dhcp.network.drv: build01: the build this call attached to did not finish, retry, asking the scheduler again
55zpgzcisvcb2r7177nms09c4vrkwyyx-nixos-version.drv: build01: the build this call attached to did not finish, retry, asking the scheduler again
6s2dw8311a4g1n1jcxg12p4ms8l46wb8-perl-5.42.3-env.drv: build01: the build this call attached to did not finish, retry, asking the scheduler again
44s2gfqd5mnwq8qw5d3mfafn8pw75xx5-initrd-linux-6.18.56.drv: build01: the build this call attached to did not finish, retry, asking the scheduler again
error: dependency '2bdg2jgq12h72xl58m7nd77wfj1iwxya-nixos-test-driver-secrets.drv' failed
failed checks.aarch64-linux.nixos-test-user-firewall-iptables 2h 36m
setup: xk3c06jd3s80zzvrq8ww191chabb9dc0-etc-os-release.drv: build01: the build this call attached to did not finish, retry, asking the scheduler again 55zpgzcis …
setup:
xk3c06jd3s80zzvrq8ww191chabb9dc0-etc-os-release.drv: build01: the build this call attached to did not finish, retry, asking the scheduler again
55zpgzcisvcb2r7177nms09c4vrkwyyx-nixos-version.drv: build01: the build this call attached to did not finish, retry, asking the scheduler again
6s2dw8311a4g1n1jcxg12p4ms8l46wb8-perl-5.42.3-env.drv: build01: the build this call attached to did not finish, retry, asking the scheduler again
xk3c06jd3s80zzvrq8ww191chabb9dc0-etc-os-release.drv: build01: the build this call attached to did not finish, retry, asking the scheduler again
55zpgzcisvcb2r7177nms09c4vrkwyyx-nixos-version.drv: build01: the build this call attached to did not finish, retry, asking the scheduler again
6s2dw8311a4g1n1jcxg12p4ms8l46wb8-perl-5.42.3-env.drv: build01: the build this call attached to did not finish, retry, asking the scheduler again
xk3c06jd3s80zzvrq8ww191chabb9dc0-etc-os-release.drv: build01: the build this call attached to did not finish, retry, asking the scheduler again
error: dependency '6w49jg7lirdgzz6jv009h8cmc6sz6jr3-nixos-test-driver-user-firewall-iptables.drv' failed
failed checks.aarch64-linux.nixos-test-user-firewall-nftables 2h 26m
setup: 6s2dw8311a4g1n1jcxg12p4ms8l46wb8-perl-5.42.3-env.drv: build01: the build this call attached to did not finish, retry, asking the scheduler again xk3c06jd …
setup:
6s2dw8311a4g1n1jcxg12p4ms8l46wb8-perl-5.42.3-env.drv: build01: the build this call attached to did not finish, retry, asking the scheduler again
xk3c06jd3s80zzvrq8ww191chabb9dc0-etc-os-release.drv: build01: the build this call attached to did not finish, retry, asking the scheduler again
55zpgzcisvcb2r7177nms09c4vrkwyyx-nixos-version.drv: build01: the build this call attached to did not finish, retry, asking the scheduler again
6s2dw8311a4g1n1jcxg12p4ms8l46wb8-perl-5.42.3-env.drv: build01: the build this call attached to did not finish, retry, asking the scheduler again
xk3c06jd3s80zzvrq8ww191chabb9dc0-etc-os-release.drv: build01: the build this call attached to did not finish, retry, asking the scheduler again
55zpgzcisvcb2r7177nms09c4vrkwyyx-nixos-version.drv: build01: the build this call attached to did not finish, retry, asking the scheduler again
6s2dw8311a4g1n1jcxg12p4ms8l46wb8-perl-5.42.3-env.drv: build01: the build this call attached to did not finish, retry, asking the scheduler again
error: dependency '9xjm5k8i06kkvfkikiczbv15pb8qmrkh-nixos-test-driver-user-firewall-nftables.drv' failed
failed checks.aarch64-linux.nixos-test-wayland-proxy-virtwl 3h 0m
setup: 40qlk24y0pq5f4581j8w472f24b8l9pp-unit-99-ethernet-default-dhcp.network.drv: build01: the build this call attached to did not finish, retry, asking the sc …
setup:
40qlk24y0pq5f4581j8w472f24b8l9pp-unit-99-ethernet-default-dhcp.network.drv: build01: the build this call attached to did not finish, retry, asking the scheduler again
q81la62jls0xps5wrxsz899bip677nxl-unit-NetworkManager-wait-online.service-disabled.drv: build01: the build this call attached to did not finish, retry, asking the scheduler again
xk3c06jd3s80zzvrq8ww191chabb9dc0-etc-os-release.drv: build01: the build this call attached to did not finish, retry, asking the scheduler again
s5lvsbqnadxd04d5pm17cc3f5sqvzpg0-unit-systemd-networkd-wait-online.service-disabled.drv: build01: the build this call attached to did not finish, retry, asking the scheduler again
sf07wpdpr877dczi0h9pa338v4dlppc4-nix.conf.drv: build01: the build this call attached to did not finish, retry, asking the scheduler again
h30mdzcw08lj8x31s611s0hhkl5qlgjr-unit-99-wireless-client-dhcp.network.drv: build01: the build this call attached to did not finish, retry, asking the scheduler again
55zpgzcisvcb2r7177nms09c4vrkwyyx-nixos-version.drv: build01: the build this call attached to did not finish, retry, asking the scheduler again
6s2dw8311a4g1n1jcxg12p4ms8l46wb8-perl-5.42.3-env.drv: build01: the build this call attached to did not finish, retry, asking the scheduler again
failed checks.aarch64-linux.p2p-ssh-iroh 2h 36m
setup: s5lvsbqnadxd04d5pm17cc3f5sqvzpg0-unit-systemd-networkd-wait-online.service-disabled.drv: build01: the build this call attached to did not finish, retry, …
setup:
s5lvsbqnadxd04d5pm17cc3f5sqvzpg0-unit-systemd-networkd-wait-online.service-disabled.drv: build01: the build this call attached to did not finish, retry, asking the scheduler again
sf07wpdpr877dczi0h9pa338v4dlppc4-nix.conf.drv: build01: the build this call attached to did not finish, retry, asking the scheduler again
55zpgzcisvcb2r7177nms09c4vrkwyyx-nixos-version.drv: build01: the build this call attached to did not finish, retry, asking the scheduler again
zywrfchlkmlhnl7vm5bj33dv40hxvv32-generator-state-version.drv: build01: the build this call attached to did not finish, retry, asking the scheduler again
6s2dw8311a4g1n1jcxg12p4ms8l46wb8-perl-5.42.3-env.drv: build01: the build this call attached to did not finish, retry, asking the scheduler again
q81la62jls0xps5wrxsz899bip677nxl-unit-NetworkManager-wait-online.service-disabled.drv: build01: the build this call attached to did not finish, retry, asking the scheduler again
ylhcqjzai8ic8sijv6n02fx31dlzchj7-mount-secret-fs.drv: build01: the build this call attached to did not finish, retry, asking the scheduler again
error: dependency 'gavjpsxwcy40dg9sd9a0agjs1c6n3y55-nixos-test-driver-clan-test-p2p-ssh-iroh.drv' failed
failed checks.aarch64-linux.packages 2h 36m
setup: sf07wpdpr877dczi0h9pa338v4dlppc4-nix.conf.drv: build01: the build this call attached to did not finish, retry, asking the scheduler again 55zpgzcisvcb2r7 …
setup:
sf07wpdpr877dczi0h9pa338v4dlppc4-nix.conf.drv: build01: the build this call attached to did not finish, retry, asking the scheduler again
55zpgzcisvcb2r7177nms09c4vrkwyyx-nixos-version.drv: build01: the build this call attached to did not finish, retry, asking the scheduler again
zywrfchlkmlhnl7vm5bj33dv40hxvv32-generator-state-version.drv: build01: the build this call attached to did not finish, retry, asking the scheduler again
6s2dw8311a4g1n1jcxg12p4ms8l46wb8-perl-5.42.3-env.drv: build01: the build this call attached to did not finish, retry, asking the scheduler again
q81la62jls0xps5wrxsz899bip677nxl-unit-NetworkManager-wait-online.service-disabled.drv: build01: the build this call attached to did not finish, retry, asking the scheduler again
ylhcqjzai8ic8sijv6n02fx31dlzchj7-mount-secret-fs.drv: build01: the build this call attached to did not finish, retry, asking the scheduler again
xk3c06jd3s80zzvrq8ww191chabb9dc0-etc-os-release.drv: build01: the build this call attached to did not finish, retry, asking the scheduler again
error: dependency '70zv4sqx3b3bqbiqbzlazw59vgi5mzrw-nixos-test-driver-packages.drv' failed
failed checks.aarch64-linux.pki 3h 0m
setup: ylhcqjzai8ic8sijv6n02fx31dlzchj7-mount-secret-fs.drv: build01: the build this call attached to did not finish, retry, asking the scheduler again xk3c06jd …
setup:
ylhcqjzai8ic8sijv6n02fx31dlzchj7-mount-secret-fs.drv: build01: the build this call attached to did not finish, retry, asking the scheduler again
xk3c06jd3s80zzvrq8ww191chabb9dc0-etc-os-release.drv: build01: the build this call attached to did not finish, retry, asking the scheduler again
s5lvsbqnadxd04d5pm17cc3f5sqvzpg0-unit-systemd-networkd-wait-online.service-disabled.drv: build01: the build this call attached to did not finish, retry, asking the scheduler again
sf07wpdpr877dczi0h9pa338v4dlppc4-nix.conf.drv: build01: the build this call attached to did not finish, retry, asking the scheduler again
h30mdzcw08lj8x31s611s0hhkl5qlgjr-unit-99-wireless-client-dhcp.network.drv: build01: publish failed: error: niks3 push: uploading objects: uploading build log log/h30mdzcw08lj8x31s611s0hhkl5qlgjr-unit-99-wireless-client-dhcp.network.drv: server returned 500: , asking the scheduler again
55zpgzcisvcb2r7177nms09c4vrkwyyx-nixos-version.drv: build01: the build this call attached to did not finish, retry, asking the scheduler again
zywrfchlkmlhnl7vm5bj33dv40hxvv32-generator-state-version.drv: build01: publish failed: error: niks3 push: uploading objects: uploading build log log/zywrfchlkmlhnl7vm5bj33dv40hxvv32-generator-state-version.drv: server returned 500: , asking the scheduler again
6s2dw8311a4g1n1jcxg12p4ms8l46wb8-perl-5.42.3-env.drv: build01: the build this call attached to did not finish, retry, asking the scheduler again
failed checks.aarch64-linux.postgresql 2h 26m
setup: ylhcqjzai8ic8sijv6n02fx31dlzchj7-mount-secret-fs.drv: build01: the build this call attached to did not finish, retry, asking the scheduler again xk3c06jd …
setup:
ylhcqjzai8ic8sijv6n02fx31dlzchj7-mount-secret-fs.drv: build01: the build this call attached to did not finish, retry, asking the scheduler again
xk3c06jd3s80zzvrq8ww191chabb9dc0-etc-os-release.drv: build01: the build this call attached to did not finish, retry, asking the scheduler again
s5lvsbqnadxd04d5pm17cc3f5sqvzpg0-unit-systemd-networkd-wait-online.service-disabled.drv: build01: the build this call attached to did not finish, retry, asking the scheduler again
sf07wpdpr877dczi0h9pa338v4dlppc4-nix.conf.drv: build01: the build this call attached to did not finish, retry, asking the scheduler again
55zpgzcisvcb2r7177nms09c4vrkwyyx-nixos-version.drv: build01: the build this call attached to did not finish, retry, asking the scheduler again
zywrfchlkmlhnl7vm5bj33dv40hxvv32-generator-state-version.drv: build01: the build this call attached to did not finish, retry, asking the scheduler again
6s2dw8311a4g1n1jcxg12p4ms8l46wb8-perl-5.42.3-env.drv: build01: the build this call attached to did not finish, retry, asking the scheduler again
error: dependency 'd96599gif7fk6hv64aam7bgw4zdaw797-nixos-test-driver-service-postgresql.drv' failed
failed checks.aarch64-linux.service-dummy-test 2h 36m
setup: 55zpgzcisvcb2r7177nms09c4vrkwyyx-nixos-version.drv: build01: the build this call attached to did not finish, retry, asking the scheduler again zywrfchlkm …
setup:
55zpgzcisvcb2r7177nms09c4vrkwyyx-nixos-version.drv: build01: the build this call attached to did not finish, retry, asking the scheduler again
zywrfchlkmlhnl7vm5bj33dv40hxvv32-generator-state-version.drv: build01: the build this call attached to did not finish, retry, asking the scheduler again
6s2dw8311a4g1n1jcxg12p4ms8l46wb8-perl-5.42.3-env.drv: build01: the build this call attached to did not finish, retry, asking the scheduler again
q81la62jls0xps5wrxsz899bip677nxl-unit-NetworkManager-wait-online.service-disabled.drv: build01: the build this call attached to did not finish, retry, asking the scheduler again
ylhcqjzai8ic8sijv6n02fx31dlzchj7-mount-secret-fs.drv: build01: the build this call attached to did not finish, retry, asking the scheduler again
xk3c06jd3s80zzvrq8ww191chabb9dc0-etc-os-release.drv: build01: the build this call attached to did not finish, retry, asking the scheduler again
s5lvsbqnadxd04d5pm17cc3f5sqvzpg0-unit-systemd-networkd-wait-online.service-disabled.drv: build01: the build this call attached to did not finish, retry, asking the scheduler again
error: dependency 'yv2h9cy7irjc97abh9fs7a0975rcz4kn-nixos-test-driver-service-dummy-test.drv' failed
failed checks.aarch64-linux.service-dummy-test-from-flake 2h 52m
setup: xk3c06jd3s80zzvrq8ww191chabb9dc0-etc-os-release.drv: build01: the build this call attached to did not finish, retry, asking the scheduler again s5lvsbqna …
setup:
xk3c06jd3s80zzvrq8ww191chabb9dc0-etc-os-release.drv: build01: the build this call attached to did not finish, retry, asking the scheduler again
s5lvsbqnadxd04d5pm17cc3f5sqvzpg0-unit-systemd-networkd-wait-online.service-disabled.drv: build01: the build this call attached to did not finish, retry, asking the scheduler again
sf07wpdpr877dczi0h9pa338v4dlppc4-nix.conf.drv: build01: the build this call attached to did not finish, retry, asking the scheduler again
55zpgzcisvcb2r7177nms09c4vrkwyyx-nixos-version.drv: build01: the build this call attached to did not finish, retry, asking the scheduler again
zywrfchlkmlhnl7vm5bj33dv40hxvv32-generator-state-version.drv: build01: the build this call attached to did not finish, retry, asking the scheduler again
6s2dw8311a4g1n1jcxg12p4ms8l46wb8-perl-5.42.3-env.drv: build01: the build this call attached to did not finish, retry, asking the scheduler again
vmrm3hnyiyv8fjck62wcw86k7vdxlq98-clan-runtime.drv: build01: publish failed: error: niks3 push: uploading objects: uploading build log log/vmrm3hnyiyv8fjck62wcw86k7vdxlq98-clan-runtime.drv: server returned 500: , asking the scheduler again
error: dependency '51m7jzb3prci1af6q81936kaybqvdlcw-nixos-test-driver-service-dummy-test-from-flake.drv' failed
failed checks.aarch64-linux.sshd 3h 0m
setup: q81la62jls0xps5wrxsz899bip677nxl-unit-NetworkManager-wait-online.service-disabled.drv: build01: the build this call attached to did not finish, retry, as …
setup:
q81la62jls0xps5wrxsz899bip677nxl-unit-NetworkManager-wait-online.service-disabled.drv: build01: the build this call attached to did not finish, retry, asking the scheduler again
ylhcqjzai8ic8sijv6n02fx31dlzchj7-mount-secret-fs.drv: build01: the build this call attached to did not finish, retry, asking the scheduler again
xk3c06jd3s80zzvrq8ww191chabb9dc0-etc-os-release.drv: build01: the build this call attached to did not finish, retry, asking the scheduler again
s5lvsbqnadxd04d5pm17cc3f5sqvzpg0-unit-systemd-networkd-wait-online.service-disabled.drv: build01: the build this call attached to did not finish, retry, asking the scheduler again
sf07wpdpr877dczi0h9pa338v4dlppc4-nix.conf.drv: build01: the build this call attached to did not finish, retry, asking the scheduler again
55zpgzcisvcb2r7177nms09c4vrkwyyx-nixos-version.drv: build01: the build this call attached to did not finish, retry, asking the scheduler again
zywrfchlkmlhnl7vm5bj33dv40hxvv32-generator-state-version.drv: build01: the build this call attached to did not finish, retry, asking the scheduler again
6s2dw8311a4g1n1jcxg12p4ms8l46wb8-perl-5.42.3-env.drv: build01: the build this call attached to did not finish, retry, asking the scheduler again
failed checks.aarch64-linux.sshd-no-ca 3h 0m
setup: q81la62jls0xps5wrxsz899bip677nxl-unit-NetworkManager-wait-online.service-disabled.drv: build01: the build this call attached to did not finish, retry, as …
setup:
q81la62jls0xps5wrxsz899bip677nxl-unit-NetworkManager-wait-online.service-disabled.drv: build01: the build this call attached to did not finish, retry, asking the scheduler again
ylhcqjzai8ic8sijv6n02fx31dlzchj7-mount-secret-fs.drv: build01: the build this call attached to did not finish, retry, asking the scheduler again
xk3c06jd3s80zzvrq8ww191chabb9dc0-etc-os-release.drv: build01: the build this call attached to did not finish, retry, asking the scheduler again
s5lvsbqnadxd04d5pm17cc3f5sqvzpg0-unit-systemd-networkd-wait-online.service-disabled.drv: build01: the build this call attached to did not finish, retry, asking the scheduler again
sf07wpdpr877dczi0h9pa338v4dlppc4-nix.conf.drv: build01: publish failed: error: niks3 push: uploading objects: uploading listing 9d7gg64nc7x6cp7p8baznwr3agibzmfr.ls: server returned 500: , asking the scheduler again
55zpgzcisvcb2r7177nms09c4vrkwyyx-nixos-version.drv: build01: the build this call attached to did not finish, retry, asking the scheduler again
zywrfchlkmlhnl7vm5bj33dv40hxvv32-generator-state-version.drv: build01: the build this call attached to did not finish, retry, asking the scheduler again
6s2dw8311a4g1n1jcxg12p4ms8l46wb8-perl-5.42.3-env.drv: build01: the build this call attached to did not finish, retry, asking the scheduler again
failed checks.aarch64-linux.state-version 3h 0m
setup: q81la62jls0xps5wrxsz899bip677nxl-unit-NetworkManager-wait-online.service-disabled.drv: build01: the build this call attached to did not finish, retry, as …
setup:
q81la62jls0xps5wrxsz899bip677nxl-unit-NetworkManager-wait-online.service-disabled.drv: build01: the build this call attached to did not finish, retry, asking the scheduler again
ylhcqjzai8ic8sijv6n02fx31dlzchj7-mount-secret-fs.drv: build01: the build this call attached to did not finish, retry, asking the scheduler again
xk3c06jd3s80zzvrq8ww191chabb9dc0-etc-os-release.drv: build01: the build this call attached to did not finish, retry, asking the scheduler again
s5lvsbqnadxd04d5pm17cc3f5sqvzpg0-unit-systemd-networkd-wait-online.service-disabled.drv: build01: the build this call attached to did not finish, retry, asking the scheduler again
sf07wpdpr877dczi0h9pa338v4dlppc4-nix.conf.drv: build01: the build this call attached to did not finish, retry, asking the scheduler again
55zpgzcisvcb2r7177nms09c4vrkwyyx-nixos-version.drv: build01: the build this call attached to did not finish, retry, asking the scheduler again
zywrfchlkmlhnl7vm5bj33dv40hxvv32-generator-state-version.drv: build01: the build this call attached to did not finish, retry, asking the scheduler again
6s2dw8311a4g1n1jcxg12p4ms8l46wb8-perl-5.42.3-env.drv: build01: the build this call attached to did not finish, retry, asking the scheduler again
failed eval checks.aarch64-linux.syncthing-service —
error: … while evaluating the attribute 'drvPath' at «https://releases.nixos.org/nixos/26.05/nixos-26.05.11767.7993f34ee47e/nixexprs.tar.xz?narH …
error:
       … while evaluating the attribute 'drvPath'
         at «https://releases.nixos.org/nixos/26.05/nixos-26.05.11767.7993f34ee47e/nixexprs.tar.xz?narHash=sha256-TnALPKp8o/dtUYgE243iQMbRP4183ZPhWu33FD05k/4%3D»/lib/customisation.nix:427:7:
          426|     // {
          427|       drvPath =
             |       ^
          428|         assert condition;

       … while calling the 'derivationStrict' builtin
         at «nix-internal»/derivation-internal.nix:37:12:
           36|
           37|   strict = derivationStrict drvAttrs;
             |            ^
           38|

       … while evaluating the option `nodes.machine1.networking.interfaces':

       … while evaluating definitions from `/nix/store/dqn2ddd6vpxbgx2jzparmg93hly0x1mj-source/nixos/modules/hardware/facter/networking':

       … while evaluating the option `nodes.machine1.hardware.facter.enable':

       … while evaluating the option `nodes.machine1.hardware.facter.report':

       … while evaluating the option `nodes.machine1.hardware.facter.reportPath':

       … while evaluating definitions from `/nix/store/11yjkn22440chz70j833a2krkf96anz1-source/nixosModules/clanCore/nixos-facter.nix':

       (stack trace truncated; use '--show-trace' to show the full, detailed trace)

       error: build of '/nix/store/s0ffyljja91iyibg12pivpxdj7ipj3lh-merged-test-dir-syncthing-service.drv^out' failed: error: dependency '7vkn2zdz7xyjn8fjyl4n5928q5pjbwks-test-vars-generated.drv' failed
failed checks.aarch64-linux.treefmt 1m 13s
setup: /nix/store/z6fnyq8fmq3p4fy2yacmdcrkr6qq0czw-zlib-1.3.2-static /nix/store/rqi7rmxjbd501ynrpans0yxnbmlk2i7j-zlib-ng-2.3.3 /nix/store/y8cj7zhl1wps5qym …
setup:
  /nix/store/z6fnyq8fmq3p4fy2yacmdcrkr6qq0czw-zlib-1.3.2-static
  /nix/store/rqi7rmxjbd501ynrpans0yxnbmlk2i7j-zlib-ng-2.3.3
  /nix/store/y8cj7zhl1wps5qymih0x16h74337scs7-zstd-1.5.7
  /nix/store/s76d99f5jhvf275a937vya1ick29ydhd-zstd-1.5.7-bin
  /nix/store/rkxp9732fw2bpaav295g3vbccjqha4kk-zstd-1.5.7-dev
warning: ignoring the client-specified setting 'store', because it is a restricted setting and you are not a trusted user
qzfgbrsvwy97bf8xjjx0hx3l3hhgd3sv-treefmt-check.drv: error: gRPC AddMultipleToStore on 'nix-store.geninf.io:50051' failed: error: niks3 push: uploading objects: uploading NAR nar/16hdpr94rrvmyly95wndw75mf4wmynrs0d9h8s8zkm4mh5qg8q7c.nar.zst: uploading NAR nar/16hdpr94rrvmyly95wndw75mf4wmynrs0d9h8s8zkm4mh5qg8q7c.nar.zst: server returned 500: 
error: error: gRPC AddMultipleToStore on 'nix-store.geninf.io:50051' failed: error: niks3 push: uploading objects: uploading NAR nar/16hdpr94rrvmyly95wndw75mf4wmynrs0d9h8s8zkm4mh5qg8q7c.nar.zst: uploading NAR nar/16hdpr94rrvmyly95wndw75mf4wmynrs0d9h8s8zkm4mh5qg8q7c.nar.zst: server returned 500: 
failed checks.aarch64-linux.trusted-nix-caches 2h 47m
setup: 6s2dw8311a4g1n1jcxg12p4ms8l46wb8-perl-5.42.3-env.drv: build01: the build this call attached to did not finish, retry, asking the scheduler again q81la62j …
setup:
6s2dw8311a4g1n1jcxg12p4ms8l46wb8-perl-5.42.3-env.drv: build01: the build this call attached to did not finish, retry, asking the scheduler again
q81la62jls0xps5wrxsz899bip677nxl-unit-NetworkManager-wait-online.service-disabled.drv: build01: the build this call attached to did not finish, retry, asking the scheduler again
ylhcqjzai8ic8sijv6n02fx31dlzchj7-mount-secret-fs.drv: build01: the build this call attached to did not finish, retry, asking the scheduler again
xk3c06jd3s80zzvrq8ww191chabb9dc0-etc-os-release.drv: build01: the build this call attached to did not finish, retry, asking the scheduler again
s5lvsbqnadxd04d5pm17cc3f5sqvzpg0-unit-systemd-networkd-wait-online.service-disabled.drv: build01: the build this call attached to did not finish, retry, asking the scheduler again
55zpgzcisvcb2r7177nms09c4vrkwyyx-nixos-version.drv: build01: the build this call attached to did not finish, retry, asking the scheduler again
zywrfchlkmlhnl7vm5bj33dv40hxvv32-generator-state-version.drv: build01: the build this call attached to did not finish, retry, asking the scheduler again
error: dependency 'p9647nyd2bandc3qbr76p2414x6igkia-nixos-test-driver-trusted-nix-caches.drv' failed
failed eval checks.aarch64-linux.users —
error: … while evaluating the attribute 'drvPath' at «https://releases.nixos.org/nixos/26.05/nixos-26.05.11767.7993f34ee47e/nixexprs.tar.xz?narH …
error:
       … while evaluating the attribute 'drvPath'
         at «https://releases.nixos.org/nixos/26.05/nixos-26.05.11767.7993f34ee47e/nixexprs.tar.xz?narHash=sha256-TnALPKp8o/dtUYgE243iQMbRP4183ZPhWu33FD05k/4%3D»/lib/customisation.nix:427:7:
          426|     // {
          427|       drvPath =
             |       ^
          428|         assert condition;

       … while calling the 'derivationStrict' builtin
         at «nix-internal»/derivation-internal.nix:37:12:
           36|
           37|   strict = derivationStrict drvAttrs;
             |            ^
           38|

       … while evaluating the option `nodes.server.networking.interfaces':

       … while evaluating definitions from `/nix/store/dqn2ddd6vpxbgx2jzparmg93hly0x1mj-source/nixos/modules/hardware/facter/networking':

       … while evaluating the option `nodes.server.hardware.facter.enable':

       … while evaluating the option `nodes.server.hardware.facter.report':

       … while evaluating the option `nodes.server.hardware.facter.reportPath':

       … while evaluating definitions from `/nix/store/11yjkn22440chz70j833a2krkf96anz1-source/nixosModules/clanCore/nixos-facter.nix':

       (stack trace truncated; use '--show-trace' to show the full, detailed trace)

       error: build of '/nix/store/wjj1csz796rsk9nfz1fb3ygmj54jqkb7-merged-test-dir-users.drv^out' failed: error: dependency '5cmdcj5bgksajlz9wncv50x66lbzdsv1-test-vars-generated.drv' failed
failed checks.aarch64-linux.wifi 3h 0m
setup: q81la62jls0xps5wrxsz899bip677nxl-unit-NetworkManager-wait-online.service-disabled.drv: build01: the build this call attached to did not finish, retry, as …
setup:
q81la62jls0xps5wrxsz899bip677nxl-unit-NetworkManager-wait-online.service-disabled.drv: build01: the build this call attached to did not finish, retry, asking the scheduler again
ylhcqjzai8ic8sijv6n02fx31dlzchj7-mount-secret-fs.drv: build01: the build this call attached to did not finish, retry, asking the scheduler again
xk3c06jd3s80zzvrq8ww191chabb9dc0-etc-os-release.drv: build01: the build this call attached to did not finish, retry, asking the scheduler again
s5lvsbqnadxd04d5pm17cc3f5sqvzpg0-unit-systemd-networkd-wait-online.service-disabled.drv: build01: publish failed: error: niks3 push: uploading objects: uploading build log log/s5lvsbqnadxd04d5pm17cc3f5sqvzpg0-unit-systemd-networkd-wait-online.service-disabled.drv: server returned 500: , asking the scheduler again
sf07wpdpr877dczi0h9pa338v4dlppc4-nix.conf.drv: build01: the build this call attached to did not finish, retry, asking the scheduler again
55zpgzcisvcb2r7177nms09c4vrkwyyx-nixos-version.drv: build01: the build this call attached to did not finish, retry, asking the scheduler again
zywrfchlkmlhnl7vm5bj33dv40hxvv32-generator-state-version.drv: build01: the build this call attached to did not finish, retry, asking the scheduler again
6s2dw8311a4g1n1jcxg12p4ms8l46wb8-perl-5.42.3-env.drv: build01: the build this call attached to did not finish, retry, asking the scheduler again
failed eval checks.aarch64-linux.wireguard —
error: … while evaluating the attribute 'drvPath' at «https://releases.nixos.org/nixos/26.05/nixos-26.05.11767.7993f34ee47e/nixexprs.tar.xz?narH …
error:
       … while evaluating the attribute 'drvPath'
         at «https://releases.nixos.org/nixos/26.05/nixos-26.05.11767.7993f34ee47e/nixexprs.tar.xz?narHash=sha256-TnALPKp8o/dtUYgE243iQMbRP4183ZPhWu33FD05k/4%3D»/lib/customisation.nix:427:7:
          426|     // {
          427|       drvPath =
             |       ^
          428|         assert condition;

       … while calling the 'derivationStrict' builtin
         at «nix-internal»/derivation-internal.nix:37:12:
           36|
           37|   strict = derivationStrict drvAttrs;
             |            ^
           38|

       … while evaluating the option `nodes.controller1.networking.interfaces':

       … while evaluating definitions from `/nix/store/dqn2ddd6vpxbgx2jzparmg93hly0x1mj-source/nixos/modules/hardware/facter/networking':

       … while evaluating the option `nodes.controller1.hardware.facter.enable':

       … while evaluating the option `nodes.controller1.hardware.facter.report':

       … while evaluating the option `nodes.controller1.hardware.facter.reportPath':

       … while evaluating definitions from `/nix/store/11yjkn22440chz70j833a2krkf96anz1-source/nixosModules/clanCore/nixos-facter.nix':

       (stack trace truncated; use '--show-trace' to show the full, detailed trace)

       error: build of '/nix/store/bqv8zsy58v6f6jyz0lmdjxq33jvbjfwi-merged-test-dir-wireguard.drv^out' failed: error: dependency 'pa5slki1wyssvp1x8ra66lp35n9djp09-test-vars-generated.drv' failed
failed checks.aarch64-linux.yggdrasil 2h 58m
setup: xk3c06jd3s80zzvrq8ww191chabb9dc0-etc-os-release.drv: build01: the build this call attached to did not finish, retry, asking the scheduler again s5lvsbqna …
setup:
xk3c06jd3s80zzvrq8ww191chabb9dc0-etc-os-release.drv: build01: the build this call attached to did not finish, retry, asking the scheduler again
s5lvsbqnadxd04d5pm17cc3f5sqvzpg0-unit-systemd-networkd-wait-online.service-disabled.drv: build01: the build this call attached to did not finish, retry, asking the scheduler again
sf07wpdpr877dczi0h9pa338v4dlppc4-nix.conf.drv: build01: the build this call attached to did not finish, retry, asking the scheduler again
h30mdzcw08lj8x31s611s0hhkl5qlgjr-unit-99-wireless-client-dhcp.network.drv: build01: the build this call attached to did not finish, retry, asking the scheduler again
55zpgzcisvcb2r7177nms09c4vrkwyyx-nixos-version.drv: build01: the build this call attached to did not finish, retry, asking the scheduler again
zywrfchlkmlhnl7vm5bj33dv40hxvv32-generator-state-version.drv: build01: the build this call attached to did not finish, retry, asking the scheduler again
6s2dw8311a4g1n1jcxg12p4ms8l46wb8-perl-5.42.3-env.drv: build01: publish failed: error: niks3 push: uploading objects: uploading NAR nar/148qr69a2kg472fq1cwnvsaajf73qskps1pk362xf91j05yrv15c.nar.zst: uploading NAR nar/148qr69a2kg472fq1cwnvsaajf73qskps1pk362xf91j05yrv15c.nar.zst: server returned 500: , asking the scheduler again
error: dependency 'gcy6y3sr30pmyck2svjyxgiqqjiawcjj-nixos-test-driver-yggdrasil.drv' failed
failed checks.aarch64-linux.zerotier 2h 59m
setup: xk3c06jd3s80zzvrq8ww191chabb9dc0-etc-os-release.drv: build01: the build this call attached to did not finish, retry, asking the scheduler again s5lvsbqna …
setup:
xk3c06jd3s80zzvrq8ww191chabb9dc0-etc-os-release.drv: build01: the build this call attached to did not finish, retry, asking the scheduler again
s5lvsbqnadxd04d5pm17cc3f5sqvzpg0-unit-systemd-networkd-wait-online.service-disabled.drv: build01: the build this call attached to did not finish, retry, asking the scheduler again
sf07wpdpr877dczi0h9pa338v4dlppc4-nix.conf.drv: build01: the build this call attached to did not finish, retry, asking the scheduler again
h30mdzcw08lj8x31s611s0hhkl5qlgjr-unit-99-wireless-client-dhcp.network.drv: build01: the build this call attached to did not finish, retry, asking the scheduler again
55zpgzcisvcb2r7177nms09c4vrkwyyx-nixos-version.drv: build01: publish failed: error: niks3 push: uploading objects: uploading build log log/55zpgzcisvcb2r7177nms09c4vrkwyyx-nixos-version.drv: server returned 500: , asking the scheduler again
zywrfchlkmlhnl7vm5bj33dv40hxvv32-generator-state-version.drv: build01: the build this call attached to did not finish, retry, asking the scheduler again
6s2dw8311a4g1n1jcxg12p4ms8l46wb8-perl-5.42.3-env.drv: build01: the build this call attached to did not finish, retry, asking the scheduler again
error: dependency '3ibghva701fpc1lppag96810aw0dxwxk-nixos-test-driver-zerotier.drv' failed
failed checks.aarch64-linux.zerotier-multi-instance 2h 59m
setup: xk3c06jd3s80zzvrq8ww191chabb9dc0-etc-os-release.drv: build01: the build this call attached to did not finish, retry, asking the scheduler again s5lvsbqna …
setup:
xk3c06jd3s80zzvrq8ww191chabb9dc0-etc-os-release.drv: build01: the build this call attached to did not finish, retry, asking the scheduler again
s5lvsbqnadxd04d5pm17cc3f5sqvzpg0-unit-systemd-networkd-wait-online.service-disabled.drv: build01: the build this call attached to did not finish, retry, asking the scheduler again
sf07wpdpr877dczi0h9pa338v4dlppc4-nix.conf.drv: build01: publish failed: error: niks3 push: uploading objects: uploading build log log/sf07wpdpr877dczi0h9pa338v4dlppc4-nix.conf.drv: server returned 500: , asking the scheduler again
h30mdzcw08lj8x31s611s0hhkl5qlgjr-unit-99-wireless-client-dhcp.network.drv: build01: the build this call attached to did not finish, retry, asking the scheduler again
55zpgzcisvcb2r7177nms09c4vrkwyyx-nixos-version.drv: build01: the build this call attached to did not finish, retry, asking the scheduler again
zywrfchlkmlhnl7vm5bj33dv40hxvv32-generator-state-version.drv: build01: the build this call attached to did not finish, retry, asking the scheduler again
6s2dw8311a4g1n1jcxg12p4ms8l46wb8-perl-5.42.3-env.drv: build01: the build this call attached to did not finish, retry, asking the scheduler again
error: dependency '1yy90887ppkgmjal67a4g7092c65gbp4-nixos-test-driver-zerotier-multi-instance.drv' failed
failed checks.x86_64-linux.admin 5m 50s
setup: don't know how to build these paths: /nix/store/sfhpz5w3fn1y0f9w8vvyzahcakpj3dps-container-test-run-admin.drv warning: ignoring the client-specified se …
setup:
don't know how to build these paths:
  /nix/store/sfhpz5w3fn1y0f9w8vvyzahcakpj3dps-container-test-run-admin.drv
warning: ignoring the client-specified setting 'store', because it is a restricted setting and you are not a trusted user
vms9scp713fp8cjdfv0b90msxb8crd83-command-not-found.drv: build-x86-01: publish failed: error: niks3 push: uploading objects: uploading NAR nar/0qmrbzrb6wdc2vd3ac5dk9zps78lf9pksbvbw5v8q84p6b3fmcwc.nar.zst: uploading NAR nar/0qmrbzrb6wdc2vd3ac5dk9zps78lf9pksbvbw5v8q84p6b3fmcwc.nar.zst: server returned 500: , asking the scheduler again
vms9scp713fp8cjdfv0b90msxb8crd83-command-not-found.drv: build-x86-01: publish failed: error: niks3 push: uploading objects: uploading build log log/vms9scp713fp8cjdfv0b90msxb8crd83-command-not-found.drv: server returned 500: , asking the scheduler again
vms9scp713fp8cjdfv0b90msxb8crd83-command-not-found.drv: error: gRPC AddMultipleToStore on 'nix-store.geninf.io:50051' failed: error: niks3 push: uploading objects: uploading NAR nar/16gn0s86xk3mcndb85az02xp84sbnk80m6w848nky2acjj1jrpgg.nar.zst: uploading NAR nar/16gn0s86xk3mcndb85az02xp84sbnk80m6w848nky2acjj1jrpgg.nar.zst: server returned 500: 
error: dependency '9bhlxfzjd5v4rjc2dhc09d2fgnf00vrp-nixos-test-driver-admin.drv' failed
failed eval checks.x86_64-linux.all-packages —
error: … while calling the 'derivationStrict' builtin at «nix-internal»/derivation-internal.nix:37:12: 36| 37| strict = …
error:
       … while calling the 'derivationStrict' builtin
         at «nix-internal»/derivation-internal.nix:37:12:
           36|
           37|   strict = derivationStrict drvAttrs;
             |            ^
           38|

       … while evaluating derivation 'all-packages'
         whose name attribute is located at «https://releases.nixos.org/nixos/26.05/nixos-26.05.11767.7993f34ee47e/nixexprs.tar.xz?narHash=sha256-TnALPKp8o/dtUYgE243iQMbRP4183ZPhWu33FD05k/4%3D»/pkgs/stdenv/generic/make-derivation.nix:647:11

       … while evaluating attribute 'buildCommand' of derivation 'all-packages'
         at «https://releases.nixos.org/nixos/26.05/nixos-26.05.11767.7993f34ee47e/nixexprs.tar.xz?narHash=sha256-TnALPKp8o/dtUYgE243iQMbRP4183ZPhWu33FD05k/4%3D»/pkgs/build-support/trivial-builders/default.nix:81:17:
           80|         enableParallelBuilding = true;
           81|         inherit buildCommand name;
             |                 ^
           82|         passAsFile = [ "buildCommand" ] ++ (derivationArgs.passAsFile or [ ]);

       (stack trace truncated; use '--show-trace' to show the full, detailed trace)

       error: Refusing to evaluate package 'pnpm-10.34.0' in /nix/store/dqn2ddd6vpxbgx2jzparmg93hly0x1mj-source/pkgs/development/tools/pnpm/generic.nix:170 because it is marked as insecure

       Known issues:
        - CVE-2026-55487
        - CVE-2026-55698
        - CVE-2026-55180
        - CVE-2026-55697
        - CVE-2026-59194
        - CVE-2026-59195
        - CVE-2026-59196
        - CVE-2026-82392
        - CVE-2026-82393

       You can install it anyway by allowing this package, using the
       following methods:

       a) To temporarily allow all insecure packages, you can use an environment
          variable for a single invocation of the nix tools:

            $ export NIXPKGS_ALLOW_INSECURE=1

          Note: When using `nix shell`, `nix build`, `nix develop`, etc with a flake,
                then pass `--impure` in order to allow use of environment variables.

       b) for `nixos-rebuild` you can add ‘pnpm-10.34.0’ to
          `nixpkgs.config.permittedInsecurePackages` in the configuration.nix,
          like so:

            {
              nixpkgs.config.permittedInsecurePackages = [
                "pnpm-10.34.0"
              ];
            }

       c) For `nix-env`, `nix-build`, `nix-shell` or any other Nix command you can add
          ‘pnpm-10.34.0’ to `permittedInsecurePackages` in
          ~/.config/nixpkgs/config.nix, like so:

            {
              permittedInsecurePackages = [
                "pnpm-10.34.0"
              ];
            }
failed eval checks.x86_64-linux.borgbackup —
error: … while evaluating the attribute 'drvPath' at «https://releases.nixos.org/nixos/26.05/nixos-26.05.11767.7993f34ee47e/nixexprs.tar.xz?narH …
error:
       … while evaluating the attribute 'drvPath'
         at «https://releases.nixos.org/nixos/26.05/nixos-26.05.11767.7993f34ee47e/nixexprs.tar.xz?narHash=sha256-TnALPKp8o/dtUYgE243iQMbRP4183ZPhWu33FD05k/4%3D»/lib/customisation.nix:427:7:
          426|     // {
          427|       drvPath =
             |       ^
          428|         assert condition;

       … while calling the 'derivationStrict' builtin
         at «nix-internal»/derivation-internal.nix:37:12:
           36|
           37|   strict = derivationStrict drvAttrs;
             |            ^
           38|

       … while evaluating the option `nodes.clientone.networking.interfaces':

       … while evaluating definitions from `/nix/store/dqn2ddd6vpxbgx2jzparmg93hly0x1mj-source/nixos/modules/hardware/facter/networking':

       … while evaluating the option `nodes.clientone.hardware.facter.enable':

       … while evaluating the option `nodes.clientone.hardware.facter.report':

       … while evaluating the option `nodes.clientone.hardware.facter.reportPath':

       … while evaluating definitions from `/nix/store/11yjkn22440chz70j833a2krkf96anz1-source/nixosModules/clanCore/nixos-facter.nix':

       (stack trace truncated; use '--show-trace' to show the full, detailed trace)

       error: gRPC QueryValidPaths on 'nix-store.geninf.io:50051' failed: error: niks3 push: uploading objects: uploading build log log/ajaf2grr0lplmbc48n044grln9w60mdr-generator-borgbackup.drv: server returned 500: 
failed eval checks.x86_64-linux.certificates —
error: … while evaluating the attribute 'drvPath' at «https://releases.nixos.org/nixos/26.05/nixos-26.05.11767.7993f34ee47e/nixexprs.tar.xz?narH …
error:
       … while evaluating the attribute 'drvPath'
         at «https://releases.nixos.org/nixos/26.05/nixos-26.05.11767.7993f34ee47e/nixexprs.tar.xz?narHash=sha256-TnALPKp8o/dtUYgE243iQMbRP4183ZPhWu33FD05k/4%3D»/lib/customisation.nix:427:7:
          426|     // {
          427|       drvPath =
             |       ^
          428|         assert condition;

       … while calling the 'derivationStrict' builtin
         at «nix-internal»/derivation-internal.nix:37:12:
           36|
           37|   strict = derivationStrict drvAttrs;
             |            ^
           38|

       … while evaluating the option `nodes.ca.networking.interfaces':

       … while evaluating definitions from `/nix/store/dqn2ddd6vpxbgx2jzparmg93hly0x1mj-source/nixos/modules/hardware/facter/networking':

       … while evaluating the option `nodes.ca.hardware.facter.enable':

       … while evaluating the option `nodes.ca.hardware.facter.report':

       … while evaluating the option `nodes.ca.hardware.facter.reportPath':

       … while evaluating definitions from `/nix/store/11yjkn22440chz70j833a2krkf96anz1-source/nixosModules/clanCore/nixos-facter.nix':

       (stack trace truncated; use '--show-trace' to show the full, detailed trace)

       error: build of '/nix/store/4l0b6fay94iqq24kqzjr0340hb8isk8v-merged-test-dir-certificates.drv^out' failed: error: dependency 'dcprywyx49335g99k4zk2zypa1zwazh8-test-vars-generated.drv' failed
failed checks.x86_64-linux.clan-app-pytest 2m 23s
setup: /nix/store/7zbzvm0bwa2mh5dp3p5gasix417lysxc-zstd-1.5.7 /nix/store/z8fp2l0b1k64swd0dxpych445wpfcgb0-zstd-1.5.7-bin /nix/store/1hjg44rywjpc52nnhs1z9i …
setup:
  /nix/store/7zbzvm0bwa2mh5dp3p5gasix417lysxc-zstd-1.5.7
  /nix/store/z8fp2l0b1k64swd0dxpych445wpfcgb0-zstd-1.5.7-bin
  /nix/store/1hjg44rywjpc52nnhs1z9iba9vgr2s3n-zstd-1.5.7-dev
  /nix/store/yw25lb99z7b7lk2fq587d9k9n8pxx2k9-zvbi-0.2.45
  /nix/store/x8i59ikxpg2j3z4b07fmljxfp74w5kqr-zxing-cpp-2.3.0
warning: ignoring the client-specified setting 'store', because it is a restricted setting and you are not a trusted user
l7syd7mzdw47vbh0akihys23kms7fav6-clan-runtime.drv: error: gRPC AddMultipleToStore on 'nix-store.geninf.io:50051' failed: error: niks3 push: uploading objects: uploading NAR nar/1wh2mwyql0671br105kr3p9j13kf10ba10xa55l81rmgw1pzfwgf.nar.zst: uploading NAR nar/1wh2mwyql0671br105kr3p9j13kf10ba10xa55l81rmgw1pzfwgf.nar.zst: server returned 500: 
error: dependency 'f7qihrisj2qbf4pj28lcxzrl6zsbcc8v-python3-3.13.15-env.drv' failed
failed checks.x86_64-linux.clan-pytest-with-core 2m 57s
setup: /nix/store/llsvyjp1d86nh4jr6yprl2x1lxahzyzc-zlib-ng-2.3.3 /nix/store/7zbzvm0bwa2mh5dp3p5gasix417lysxc-zstd-1.5.7 /nix/store/yw25lb99z7b7lk2fq587d9k …
setup:
  /nix/store/llsvyjp1d86nh4jr6yprl2x1lxahzyzc-zlib-ng-2.3.3
  /nix/store/7zbzvm0bwa2mh5dp3p5gasix417lysxc-zstd-1.5.7
  /nix/store/yw25lb99z7b7lk2fq587d9k9n8pxx2k9-zvbi-0.2.45
  /nix/store/x8i59ikxpg2j3z4b07fmljxfp74w5kqr-zxing-cpp-2.3.0
warning: ignoring the client-specified setting 'store', because it is a restricted setting and you are not a trusted user
l7syd7mzdw47vbh0akihys23kms7fav6-clan-runtime.drv: error: gRPC AddMultipleToStore on 'nix-store.geninf.io:50051' failed: error: niks3 push: uploading objects: uploading NAR nar/1wh2mwyql0671br105kr3p9j13kf10ba10xa55l81rmgw1pzfwgf.nar.zst: uploading NAR nar/1wh2mwyql0671br105kr3p9j13kf10ba10xa55l81rmgw1pzfwgf.nar.zst: server returned 500: 
9jciz3v7ak93dv16qiq2nhj117jgpg80-clan-core-flake.drv: error: gRPC AddMultipleToStore on 'nix-store.geninf.io:50051' failed: error: niks3 push: uploading objects: uploading NAR nar/0ywz960wii5i2y111z6g8x1c1rbnhh34pw8c3am5pc2kk3h9yd4f.nar.zst: uploading NAR nar/0ywz960wii5i2y111z6g8x1c1rbnhh34pw8c3am5pc2kk3h9yd4f.nar.zst: server returned 500: 
error: dependency 'ih9fwpkplbb0qilxyza9l0dbkam773rh-closure-info.drv' failed
failed checks.x86_64-linux.clan-pytest-without-core 2m 16s
setup: don't know how to build these paths: /nix/store/r8m98gv9xnpk7kgs91gyi9f9l3b400xh-clan-pytest-without-core.drv warning: ignoring the client-specified se …
setup:
don't know how to build these paths:
  /nix/store/r8m98gv9xnpk7kgs91gyi9f9l3b400xh-clan-pytest-without-core.drv
warning: ignoring the client-specified setting 'store', because it is a restricted setting and you are not a trusted user
l7syd7mzdw47vbh0akihys23kms7fav6-clan-runtime.drv: error: gRPC AddMultipleToStore on 'nix-store.geninf.io:50051' failed: error: niks3 push: uploading objects: uploading NAR nar/1zlk74yi9xzdbbhr7pbwilzx3ij0wa6xn148a5nzg8vwm8y0nw2f.nar.zst: uploading part 1: server returned 500: 
error: dependency 'wx0i5zbwxshf41kqslr778lg5pj9xbi8-clan-cli-source.drv' failed
failed eval checks.x86_64-linux.clan-site-lint —
error: … while calling the 'derivationStrict' builtin at «nix-internal»/derivation-internal.nix:37:12: 36| 37| strict = …
error:
       … while calling the 'derivationStrict' builtin
         at «nix-internal»/derivation-internal.nix:37:12:
           36|
           37|   strict = derivationStrict drvAttrs;
             |            ^
           38|

       … while evaluating derivation 'clan-site-lint'
         whose name attribute is located at «https://releases.nixos.org/nixos/26.05/nixos-26.05.11767.7993f34ee47e/nixexprs.tar.xz?narHash=sha256-TnALPKp8o/dtUYgE243iQMbRP4183ZPhWu33FD05k/4%3D»/pkgs/stdenv/generic/make-derivation.nix:647:11

       … while evaluating attribute 'nativeBuildInputs' of derivation 'clan-site-lint'
         at «https://releases.nixos.org/nixos/26.05/nixos-26.05.11767.7993f34ee47e/nixexprs.tar.xz?narHash=sha256-TnALPKp8o/dtUYgE243iQMbRP4183ZPhWu33FD05k/4%3D»/pkgs/stdenv/generic/make-derivation.nix:715:11:
          714|           depsBuildBuild = buildBuildOutputs;
          715|           nativeBuildInputs = buildHostOutputs;
             |           ^
          716|           depsBuildTarget = buildTargetOutputs;

       (stack trace truncated; use '--show-trace' to show the full, detailed trace)

       error: Refusing to evaluate package 'pnpm-10.34.0' in /nix/store/dqn2ddd6vpxbgx2jzparmg93hly0x1mj-source/pkgs/development/tools/pnpm/generic.nix:170 because it is marked as insecure

       Known issues:
        - CVE-2026-55487
        - CVE-2026-55698
        - CVE-2026-55180
        - CVE-2026-55697
        - CVE-2026-59194
        - CVE-2026-59195
        - CVE-2026-59196
        - CVE-2026-82392
        - CVE-2026-82393

       You can install it anyway by allowing this package, using the
       following methods:

       a) To temporarily allow all insecure packages, you can use an environment
          variable for a single invocation of the nix tools:

            $ export NIXPKGS_ALLOW_INSECURE=1

          Note: When using `nix shell`, `nix build`, `nix develop`, etc with a flake,
                then pass `--impure` in order to allow use of environment variables.

       b) for `nixos-rebuild` you can add ‘pnpm-10.34.0’ to
          `nixpkgs.config.permittedInsecurePackages` in the configuration.nix,
          like so:

            {
              nixpkgs.config.permittedInsecurePackages = [
                "pnpm-10.34.0"
              ];
            }

       c) For `nix-env`, `nix-build`, `nix-shell` or any other Nix command you can add
          ‘pnpm-10.34.0’ to `permittedInsecurePackages` in
          ~/.config/nixpkgs/config.nix, like so:

            {
              permittedInsecurePackages = [
                "pnpm-10.34.0"
              ];
            }
failed checks.x86_64-linux.clan-test-iso 3m 21s
setup: vms9scp713fp8cjdfv0b90msxb8crd83-command-not-found.drv: build-x86-01: publish failed: error: niks3 push: uploading objects: uploading NAR nar/0qmrbzrb6wd …
setup:
vms9scp713fp8cjdfv0b90msxb8crd83-command-not-found.drv: build-x86-01: publish failed: error: niks3 push: uploading objects: uploading NAR nar/0qmrbzrb6wdc2vd3ac5dk9zps78lf9pksbvbw5v8q84p6b3fmcwc.nar.zst: uploading NAR nar/0qmrbzrb6wdc2vd3ac5dk9zps78lf9pksbvbw5v8q84p6b3fmcwc.nar.zst: server returned 500: , asking the scheduler again
vms9scp713fp8cjdfv0b90msxb8crd83-command-not-found.drv: build-x86-01: the build this call attached to did not finish, retry, asking the scheduler again
cg9f0if688w7gkm0f85kf62lfigb2cdz-nixos-version.drv: gi-build-x86-02: publish failed: error: niks3 push: uploading objects: uploading build log log/cg9f0if688w7gkm0f85kf62lfigb2cdz-nixos-version.drv: server returned 500: , asking the scheduler again
cg9f0if688w7gkm0f85kf62lfigb2cdz-nixos-version.drv: build-x86-01: publish failed: error: niks3 push: uploading objects: uploading NAR nar/1m1hgdfl2rxypg3w8m7hac2vvq9diivapvpsqbzkgvjgq8w5hhjl.nar.zst: uploading NAR nar/1m1hgdfl2rxypg3w8m7hac2vvq9diivapvpsqbzkgvjgq8w5hhjl.nar.zst: server returned 500: , asking the scheduler again
cg9f0if688w7gkm0f85kf62lfigb2cdz-nixos-version.drv: build-x86-01: publish failed: error: niks3 push: uploading objects: uploading build log log/cg9f0if688w7gkm0f85kf62lfigb2cdz-nixos-version.drv: server returned 500: , asking the scheduler again
cg9f0if688w7gkm0f85kf62lfigb2cdz-nixos-version.drv: gi-build-x86-02: publish failed: error: niks3 push: uploading objects: uploading NAR nar/1m1hgdfl2rxypg3w8m7hac2vvq9diivapvpsqbzkgvjgq8w5hhjl.nar.zst: uploading NAR nar/1m1hgdfl2rxypg3w8m7hac2vvq9diivapvpsqbzkgvjgq8w5hhjl.nar.zst: server returned 500: , asking the scheduler again
cg9f0if688w7gkm0f85kf62lfigb2cdz-nixos-version.drv: build-x86-01: publish failed: error: niks3 push: uploading objects: uploading NAR nar/1m1hgdfl2rxypg3w8m7hac2vvq9diivapvpsqbzkgvjgq8w5hhjl.nar.zst: uploading NAR nar/1m1hgdfl2rxypg3w8m7hac2vvq9diivapvpsqbzkgvjgq8w5hhjl.nar.zst: server returned 500: , asking the scheduler again
error: dependency '9wci4fb9crjs2qzjbqlfjgkl4bqw1803-nixos-test-driver-clan-test-iso.drv' failed
failed checks.x86_64-linux.clan-test-update 3m 0s
setup: vms9scp713fp8cjdfv0b90msxb8crd83-command-not-found.drv: build-x86-01: the build this call attached to did not finish, retry, asking the scheduler again v …
setup:
vms9scp713fp8cjdfv0b90msxb8crd83-command-not-found.drv: build-x86-01: the build this call attached to did not finish, retry, asking the scheduler again
vms9scp713fp8cjdfv0b90msxb8crd83-command-not-found.drv: build-x86-01: the build this call attached to did not finish, retry, asking the scheduler again
vms9scp713fp8cjdfv0b90msxb8crd83-command-not-found.drv: build-x86-01: the build this call attached to did not finish, retry, asking the scheduler again
lha1zdibhrpc2728jhz8xijw156ck3hq-clan-runtime.drv: error: gRPC AddMultipleToStore on 'nix-store.geninf.io:50051' failed: error: niks3 push: uploading objects: uploading NAR nar/1npgznb31ar2ms436ydkfgnrb1hkw2j25b0p9anjisa8l4hcvf57.nar.zst: uploading NAR nar/1npgznb31ar2ms436ydkfgnrb1hkw2j25b0p9anjisa8l4hcvf57.nar.zst: server returned 500: 
q7hiwsm8xz5n8zsvd145c5xlbqiysm09-offline-flake-for-test-clan-test-update.drv: error: gRPC AddMultipleToStore on 'nix-store.geninf.io:50051' failed: error: niks3 push: uploading objects: uploading NAR nar/1cjy6h4qwggaif6m81s6w7l26193icchna9m9h23gsmx7xcc1asf.nar.zst: uploading NAR nar/1cjy6h4qwggaif6m81s6w7l26193icchna9m9h23gsmx7xcc1asf.nar.zst: server returned 500: 
vms9scp713fp8cjdfv0b90msxb8crd83-command-not-found.drv: build-x86-01: the build this call attached to did not finish, retry, asking the scheduler again
vms9scp713fp8cjdfv0b90msxb8crd83-command-not-found.drv: build-x86-01: the build this call attached to did not finish, retry, asking the scheduler again
error: dependency 'kn9z5bjgj0378pd4gk6xq1sxbksmcg2v-nixos-test-driver-clan-test-update.drv' failed
failed checks.x86_64-linux.darwin-test-darwin-machine 4m 46s
setup: 5q0h66jqvnhnmm8d7y1m8dp6vr6qbb7z-etc-sudo_local.drv: error: gRPC QueryValidPaths on 'nix-store.geninf.io:50051' failed: error: niks3 push: uploading obje …
setup:
5q0h66jqvnhnmm8d7y1m8dp6vr6qbb7z-etc-sudo_local.drv: error: gRPC QueryValidPaths on 'nix-store.geninf.io:50051' failed: error: niks3 push: uploading objects: uploading NAR nar/02gp1y1nh8yvjcfs58znrsm6a5620ayjxx7lmaffgnmab011qrgq.nar.zst: uploading NAR nar/02gp1y1nh8yvjcfs58znrsm6a5620ayjxx7lmaffgnmab011qrgq.nar.zst: server returned 500: 
a2zn5rmbqzkwd54m0jkkmkl7wg4jb122-etc-zprofile.drv: error: gRPC QueryValidPaths on 'nix-store.geninf.io:50051' failed: error: niks3 push: uploading objects: uploading NAR nar/1naavwfvm5gdk9z70maj3qwnfcxsd280wb55768iwdclnfv4v849.nar.zst: uploading NAR nar/1naavwfvm5gdk9z70maj3qwnfcxsd280wb55768iwdclnfv4v849.nar.zst: server returned 500: 
daxrmfdmr79v27lv487bkpninrz2i4w9-nix.conf.drv: error: gRPC QueryValidPaths on 'nix-store.geninf.io:50051' failed: error: niks3 push: uploading objects: uploading NAR nar/1sqpsjhqbw3pz102xy8ngkn5zc15443h7hklim9wnf79x8ghl8gx.nar.zst: uploading NAR nar/1sqpsjhqbw3pz102xy8ngkn5zc15443h7hklim9wnf79x8ghl8gx.nar.zst: server returned 500: 
if3g4ljrvbwd3h91i7871q5dgmr7x4mi-etc-100-nix-darwin.conf.drv: error: gRPC QueryValidPaths on 'nix-store.geninf.io:50051' failed: error: niks3 push: uploading objects: uploading NAR nar/045wd3gvf08s6gpxx70cmrlclwa1c3nk56w7acdj078ii78xd6k6.nar.zst: uploading NAR nar/045wd3gvf08s6gpxx70cmrlclwa1c3nk56w7acdj078ii78xd6k6.nar.zst: server returned 500: 
ifqs0rpkk821igh43cs3956g7vb657zm-ca-certificates.crt.drv: error: gRPC QueryValidPaths on 'nix-store.geninf.io:50051' failed: error: niks3 push: uploading objects: uploading NAR nar/1s76hyhvdg0zsagjm19d15z7rg5rnjckqs744bgw3hgn5bsi6v2z.nar.zst: uploading NAR nar/1s76hyhvdg0zsagjm19d15z7rg5rnjckqs744bgw3hgn5bsi6v2z.nar.zst: server returned 500: 
y5f294bglikn7b7gcnlchbaj9j1qmfjf-etc-099-host-keys.conf.drv: error: gRPC QueryValidPaths on 'nix-store.geninf.io:50051' failed: error: niks3 push: uploading objects: uploading NAR nar/0kx06sddchy60jx7dmavxy07gk56garrj8dmaisswaiyils09xhw.nar.zst: uploading NAR nar/0kx06sddchy60jx7dmavxy07gk56garrj8dmaisswaiyils09xhw.nar.zst: server returned 500: 
8d3ilb98ih6zmfkrji3ar9lmh2ncqckh-darwin-version.json.drv: error: gRPC QueryValidPaths on 'nix-store.geninf.io:50051' failed: error: niks3 push: uploading objects: uploading NAR nar/1s76hyhvdg0zsagjm19d15z7rg5rnjckqs744bgw3hgn5bsi6v2z.nar.zst: uploading NAR nar/1s76hyhvdg0zsagjm19d15z7rg5rnjckqs744bgw3hgn5bsi6v2z.nar.zst: server returned 500: 
error: dependency 'q52zn986wach507sllk5f15iya7z5rgg-fonts.drv' failed
failed checks.x86_64-linux.data-mesher 47s
setup: /nix/store/6s4wm3zl2y0v5g998n2g88k1zh3vf2pr-zlib-1.3.2 /nix/store/xvpdcmxbccnavnw2dciidp0zrknzr1db-zlib-1.3.2-static /nix/store/llsvyjp1d86nh4jr6yp …
setup:
  /nix/store/6s4wm3zl2y0v5g998n2g88k1zh3vf2pr-zlib-1.3.2
  /nix/store/xvpdcmxbccnavnw2dciidp0zrknzr1db-zlib-1.3.2-static
  /nix/store/llsvyjp1d86nh4jr6yprl2x1lxahzyzc-zlib-ng-2.3.3
  /nix/store/7zbzvm0bwa2mh5dp3p5gasix417lysxc-zstd-1.5.7
  /nix/store/z8fp2l0b1k64swd0dxpych445wpfcgb0-zstd-1.5.7-bin
  /nix/store/4d2k230fhyxb8qab8amyk011m7pmpcrz-zstd-1.5.7-man
warning: ignoring the client-specified setting 'store', because it is a restricted setting and you are not a trusted user
error: gRPC QueryValidPaths on 'nix-store.geninf.io:50051' failed: error: niks3 push: uploading objects: uploading build log log/vms9scp713fp8cjdfv0b90msxb8crd83-command-not-found.drv: server returned 500: 
dependency failed checks.x86_64-linux.devshell —
failed checks.x86_64-linux.devShell-clan-app 1m 50s
setup: /nix/store/7zbzvm0bwa2mh5dp3p5gasix417lysxc-zstd-1.5.7 /nix/store/z8fp2l0b1k64swd0dxpych445wpfcgb0-zstd-1.5.7-bin /nix/store/1hjg44rywjpc52nnhs1z9i …
setup:
  /nix/store/7zbzvm0bwa2mh5dp3p5gasix417lysxc-zstd-1.5.7
  /nix/store/z8fp2l0b1k64swd0dxpych445wpfcgb0-zstd-1.5.7-bin
  /nix/store/1hjg44rywjpc52nnhs1z9iba9vgr2s3n-zstd-1.5.7-dev
  /nix/store/yw25lb99z7b7lk2fq587d9k9n8pxx2k9-zvbi-0.2.45
  /nix/store/x8i59ikxpg2j3z4b07fmljxfp74w5kqr-zxing-cpp-2.3.0
warning: ignoring the client-specified setting 'store', because it is a restricted setting and you are not a trusted user
l7syd7mzdw47vbh0akihys23kms7fav6-clan-runtime.drv: error: gRPC AddMultipleToStore on 'nix-store.geninf.io:50051' failed: error: niks3 push: uploading objects: uploading NAR nar/1wh2mwyql0671br105kr3p9j13kf10ba10xa55l81rmgw1pzfwgf.nar.zst: uploading NAR nar/1wh2mwyql0671br105kr3p9j13kf10ba10xa55l81rmgw1pzfwgf.nar.zst: server returned 500: 
error: dependency 'l7syd7mzdw47vbh0akihys23kms7fav6-clan-runtime.drv' failed
failed checks.x86_64-linux.devShell-clan-cli 3m 2s
setup: don't know how to build these paths: /nix/store/a0s89a8vm4jr7immvi11vlr5zhn1zdwq-clan-cli.drv warning: ignoring the client-specified setting 'store', b …
setup:
don't know how to build these paths:
  /nix/store/a0s89a8vm4jr7immvi11vlr5zhn1zdwq-clan-cli.drv
warning: ignoring the client-specified setting 'store', because it is a restricted setting and you are not a trusted user
l7syd7mzdw47vbh0akihys23kms7fav6-clan-runtime.drv: build-x86-01: not scheduled here: l7syd7mzdw47vbh0akihys23kms7fav6-clan-runtime.drv, asking the scheduler again
l7syd7mzdw47vbh0akihys23kms7fav6-clan-runtime.drv: build-x86-01: publish failed: error: niks3 push: uploading objects: uploading build log log/l7syd7mzdw47vbh0akihys23kms7fav6-clan-runtime.drv: server returned 500: , asking the scheduler again
l7syd7mzdw47vbh0akihys23kms7fav6-clan-runtime.drv: build-x86-01: the build this call attached to did not finish, retry, asking the scheduler again
l7syd7mzdw47vbh0akihys23kms7fav6-clan-runtime.drv: error: gRPC QueryValidPaths on 'nix-store.geninf.io:50051' failed: error: niks3 push: uploading objects: uploading NAR nar/1zlk74yi9xzdbbhr7pbwilzx3ij0wa6xn148a5nzg8vwm8y0nw2f.nar.zst: uploading part 1: server returned 500: 
error: dependency 'l7syd7mzdw47vbh0akihys23kms7fav6-clan-runtime.drv' failed
failed eval checks.x86_64-linux.devShell-clan-site —
error: … while calling the 'derivationStrict' builtin at «nix-internal»/derivation-internal.nix:37:12: 36| 37| strict = …
error:
       … while calling the 'derivationStrict' builtin
         at «nix-internal»/derivation-internal.nix:37:12:
           36|
           37|   strict = derivationStrict drvAttrs;
             |            ^
           38|

       … while evaluating derivation 'nix-shell'
         whose name attribute is located at «https://releases.nixos.org/nixos/26.05/nixos-26.05.11767.7993f34ee47e/nixexprs.tar.xz?narHash=sha256-TnALPKp8o/dtUYgE243iQMbRP4183ZPhWu33FD05k/4%3D»/pkgs/stdenv/generic/make-derivation.nix:647:11

       … while evaluating attribute 'nativeBuildInputs' of derivation 'nix-shell'
         at «https://releases.nixos.org/nixos/26.05/nixos-26.05.11767.7993f34ee47e/nixexprs.tar.xz?narHash=sha256-TnALPKp8o/dtUYgE243iQMbRP4183ZPhWu33FD05k/4%3D»/pkgs/stdenv/generic/make-derivation.nix:715:11:
          714|           depsBuildBuild = buildBuildOutputs;
          715|           nativeBuildInputs = buildHostOutputs;
             |           ^
          716|           depsBuildTarget = buildTargetOutputs;

       (stack trace truncated; use '--show-trace' to show the full, detailed trace)

       error: Refusing to evaluate package 'pnpm-10.34.0' in /nix/store/dqn2ddd6vpxbgx2jzparmg93hly0x1mj-source/pkgs/development/tools/pnpm/generic.nix:170 because it is marked as insecure

       Known issues:
        - CVE-2026-55487
        - CVE-2026-55698
        - CVE-2026-55180
        - CVE-2026-55697
        - CVE-2026-59194
        - CVE-2026-59195
        - CVE-2026-59196
        - CVE-2026-82392
        - CVE-2026-82393

       You can install it anyway by allowing this package, using the
       following methods:

       a) To temporarily allow all insecure packages, you can use an environment
          variable for a single invocation of the nix tools:

            $ export NIXPKGS_ALLOW_INSECURE=1

          Note: When using `nix shell`, `nix build`, `nix develop`, etc with a flake,
                then pass `--impure` in order to allow use of environment variables.

       b) for `nixos-rebuild` you can add ‘pnpm-10.34.0’ to
          `nixpkgs.config.permittedInsecurePackages` in the configuration.nix,
          like so:

            {
              nixpkgs.config.permittedInsecurePackages = [
                "pnpm-10.34.0"
              ];
            }

       c) For `nix-env`, `nix-build`, `nix-shell` or any other Nix command you can add
          ‘pnpm-10.34.0’ to `permittedInsecurePackages` in
          ~/.config/nixpkgs/config.nix, like so:

            {
              permittedInsecurePackages = [
                "pnpm-10.34.0"
              ];
            }
failed checks.x86_64-linux.devShell-default 2m 54s
setup: /nix/store/z8fp2l0b1k64swd0dxpych445wpfcgb0-zstd-1.5.7-bin /nix/store/1hjg44rywjpc52nnhs1z9iba9vgr2s3n-zstd-1.5.7-dev warning: ignoring the client-sp …
setup:
  /nix/store/z8fp2l0b1k64swd0dxpych445wpfcgb0-zstd-1.5.7-bin
  /nix/store/1hjg44rywjpc52nnhs1z9iba9vgr2s3n-zstd-1.5.7-dev
warning: ignoring the client-specified setting 'store', because it is a restricted setting and you are not a trusted user
l7syd7mzdw47vbh0akihys23kms7fav6-clan-runtime.drv: build-x86-01: not scheduled here: l7syd7mzdw47vbh0akihys23kms7fav6-clan-runtime.drv, asking the scheduler again
l7syd7mzdw47vbh0akihys23kms7fav6-clan-runtime.drv: build-x86-01: the build this call attached to did not finish, retry, asking the scheduler again
l7syd7mzdw47vbh0akihys23kms7fav6-clan-runtime.drv: build-x86-01: the build this call attached to did not finish, retry, asking the scheduler again
l7syd7mzdw47vbh0akihys23kms7fav6-clan-runtime.drv: error: gRPC QueryValidPaths on 'nix-store.geninf.io:50051' failed: error: niks3 push: uploading objects: uploading NAR nar/1zlk74yi9xzdbbhr7pbwilzx3ij0wa6xn148a5nzg8vwm8y0nw2f.nar.zst: uploading part 1: server returned 500: 
error: dependency 'l7syd7mzdw47vbh0akihys23kms7fav6-clan-runtime.drv' failed
failed eval checks.x86_64-linux.devShell-docs —
error: … while calling the 'derivationStrict' builtin at «nix-internal»/derivation-internal.nix:37:12: 36| 37| strict = …
error:
       … while calling the 'derivationStrict' builtin
         at «nix-internal»/derivation-internal.nix:37:12:
           36|
           37|   strict = derivationStrict drvAttrs;
             |            ^
           38|

       … while evaluating derivation 'nix-shell'
         whose name attribute is located at «https://releases.nixos.org/nixos/26.05/nixos-26.05.11767.7993f34ee47e/nixexprs.tar.xz?narHash=sha256-TnALPKp8o/dtUYgE243iQMbRP4183ZPhWu33FD05k/4%3D»/pkgs/stdenv/generic/make-derivation.nix:647:11

       … while evaluating attribute 'nativeBuildInputs' of derivation 'nix-shell'
         at «https://releases.nixos.org/nixos/26.05/nixos-26.05.11767.7993f34ee47e/nixexprs.tar.xz?narHash=sha256-TnALPKp8o/dtUYgE243iQMbRP4183ZPhWu33FD05k/4%3D»/pkgs/stdenv/generic/make-derivation.nix:715:11:
          714|           depsBuildBuild = buildBuildOutputs;
          715|           nativeBuildInputs = buildHostOutputs;
             |           ^
          716|           depsBuildTarget = buildTargetOutputs;

       (stack trace truncated; use '--show-trace' to show the full, detailed trace)

       error: Refusing to evaluate package 'pnpm-10.34.0' in /nix/store/dqn2ddd6vpxbgx2jzparmg93hly0x1mj-source/pkgs/development/tools/pnpm/generic.nix:170 because it is marked as insecure

       Known issues:
        - CVE-2026-55487
        - CVE-2026-55698
        - CVE-2026-55180
        - CVE-2026-55697
        - CVE-2026-59194
        - CVE-2026-59195
        - CVE-2026-59196
        - CVE-2026-82392
        - CVE-2026-82393

       You can install it anyway by allowing this package, using the
       following methods:

       a) To temporarily allow all insecure packages, you can use an environment
          variable for a single invocation of the nix tools:

            $ export NIXPKGS_ALLOW_INSECURE=1

          Note: When using `nix shell`, `nix build`, `nix develop`, etc with a flake,
                then pass `--impure` in order to allow use of environment variables.

       b) for `nixos-rebuild` you can add ‘pnpm-10.34.0’ to
          `nixpkgs.config.permittedInsecurePackages` in the configuration.nix,
          like so:

            {
              nixpkgs.config.permittedInsecurePackages = [
                "pnpm-10.34.0"
              ];
            }

       c) For `nix-env`, `nix-build`, `nix-shell` or any other Nix command you can add
          ‘pnpm-10.34.0’ to `permittedInsecurePackages` in
          ~/.config/nixpkgs/config.nix, like so:

            {
              permittedInsecurePackages = [
                "pnpm-10.34.0"
              ];
            }
failed checks.x86_64-linux.devShell-inventory-schema 3m 10s
setup: /nix/store/z8fp2l0b1k64swd0dxpych445wpfcgb0-zstd-1.5.7-bin /nix/store/1hjg44rywjpc52nnhs1z9iba9vgr2s3n-zstd-1.5.7-dev warning: ignoring the client-sp …
setup:
  /nix/store/z8fp2l0b1k64swd0dxpych445wpfcgb0-zstd-1.5.7-bin
  /nix/store/1hjg44rywjpc52nnhs1z9iba9vgr2s3n-zstd-1.5.7-dev
warning: ignoring the client-specified setting 'store', because it is a restricted setting and you are not a trusted user
l7syd7mzdw47vbh0akihys23kms7fav6-clan-runtime.drv: build-x86-01: not scheduled here: l7syd7mzdw47vbh0akihys23kms7fav6-clan-runtime.drv, asking the scheduler again
l7syd7mzdw47vbh0akihys23kms7fav6-clan-runtime.drv: build-x86-01: the build this call attached to did not finish, retry, asking the scheduler again
l7syd7mzdw47vbh0akihys23kms7fav6-clan-runtime.drv: build-x86-01: publish failed: error: niks3 push: uploading objects: uploading build log log/l7syd7mzdw47vbh0akihys23kms7fav6-clan-runtime.drv: server returned 500: , asking the scheduler again
l7syd7mzdw47vbh0akihys23kms7fav6-clan-runtime.drv: error: gRPC QueryValidPaths on 'nix-store.geninf.io:50051' failed: error: niks3 push: uploading objects: uploading NAR nar/1zlk74yi9xzdbbhr7pbwilzx3ij0wa6xn148a5nzg8vwm8y0nw2f.nar.zst: uploading part 1: server returned 500: 
error: dependency 'l7syd7mzdw47vbh0akihys23kms7fav6-clan-runtime.drv' failed
failed checks.x86_64-linux.dm-dns 2m 44s
setup: vms9scp713fp8cjdfv0b90msxb8crd83-command-not-found.drv: build-x86-01: the build this call attached to did not finish, retry, asking the scheduler again v …
setup:
vms9scp713fp8cjdfv0b90msxb8crd83-command-not-found.drv: build-x86-01: the build this call attached to did not finish, retry, asking the scheduler again
vms9scp713fp8cjdfv0b90msxb8crd83-command-not-found.drv: build-x86-01: the build this call attached to did not finish, retry, asking the scheduler again
vms9scp713fp8cjdfv0b90msxb8crd83-command-not-found.drv: build-x86-01: the build this call attached to did not finish, retry, asking the scheduler again
vms9scp713fp8cjdfv0b90msxb8crd83-command-not-found.drv: build-x86-01: the build this call attached to did not finish, retry, asking the scheduler again
vms9scp713fp8cjdfv0b90msxb8crd83-command-not-found.drv: build-x86-01: the build this call attached to did not finish, retry, asking the scheduler again
vms9scp713fp8cjdfv0b90msxb8crd83-command-not-found.drv: build-x86-01: the build this call attached to did not finish, retry, asking the scheduler again
vms9scp713fp8cjdfv0b90msxb8crd83-command-not-found.drv: gi-build-x86-02: the build this call attached to did not finish, retry, asking the scheduler again
error: dependency '9kiwlwzb2jgmb8f2wiclmgvgmmyil1fc-nixos-test-driver-dm-dns.drv' failed
failed checks.x86_64-linux.dyndns 24s
setup: /nix/store/xvpdcmxbccnavnw2dciidp0zrknzr1db-zlib-1.3.2-static /nix/store/dzjbrs1dwpg2rk4784jpckw617g5y1dh-zlib-ng-2.3.3 /nix/store/llsvyjp1d86nh4jr …
setup:
  /nix/store/xvpdcmxbccnavnw2dciidp0zrknzr1db-zlib-1.3.2-static
  /nix/store/dzjbrs1dwpg2rk4784jpckw617g5y1dh-zlib-ng-2.3.3
  /nix/store/llsvyjp1d86nh4jr6yprl2x1lxahzyzc-zlib-ng-2.3.3
  /nix/store/7zbzvm0bwa2mh5dp3p5gasix417lysxc-zstd-1.5.7
  /nix/store/z8fp2l0b1k64swd0dxpych445wpfcgb0-zstd-1.5.7-bin
  /nix/store/4d2k230fhyxb8qab8amyk011m7pmpcrz-zstd-1.5.7-man
warning: ignoring the client-specified setting 'store', because it is a restricted setting and you are not a trusted user
error: gRPC QueryValidPaths on 'nix-store.geninf.io:50051' failed: error: niks3 push: uploading objects: uploading build log log/vms9scp713fp8cjdfv0b90msxb8crd83-command-not-found.drv: server returned 500: 
failed checks.x86_64-linux.eval-tests 4m 31s
setup: ddd4qx21b2yfs1h1nwm8rglil6pnzl13-evalCheck-eval-tests-types.drv: error: gRPC AddMultipleToStore on 'nix-store.geninf.io:50051' failed: error: niks3 push: …
setup:
ddd4qx21b2yfs1h1nwm8rglil6pnzl13-evalCheck-eval-tests-types.drv: error: gRPC AddMultipleToStore on 'nix-store.geninf.io:50051' failed: error: niks3 push: uploading objects: uploading NAR nar/0ns5n4d0f8ly7qwriqqw12s2kf0kmdvblsaqpih05i72vfiqaqbf.nar.zst: uploading NAR nar/0ns5n4d0f8ly7qwriqqw12s2kf0kmdvblsaqpih05i72vfiqaqbf.nar.zst: server returned 500: 
q3v49wqnzw1lya6nalnr1a6nc88c6kl3-evalCheck-eval-vars-backends.drv: error: gRPC AddMultipleToStore on 'nix-store.geninf.io:50051' failed: error: niks3 push: uploading objects: uploading NAR nar/1n64wvg0p128fgsgsxv7sawdyc2fq52j5v5dd28n3sglcn42j9ks.nar.zst: uploading NAR nar/1n64wvg0p128fgsgsxv7sawdyc2fq52j5v5dd28n3sglcn42j9ks.nar.zst: server returned 500: 
z382lwdqkjhhw0ynk39p7fix3jvfnwzb-evalCheck-eval-tests-installer.drv: error: gRPC AddMultipleToStore on 'nix-store.geninf.io:50051' failed: error: niks3 push: uploading objects: uploading NAR nar/0k8fjsbwm047qlvcnnj9mwylyfi8kj5m414jhm2ybwicnggkcb9n.nar.zst: uploading NAR nar/0k8fjsbwm047qlvcnnj9mwylyfi8kj5m414jhm2ybwicnggkcb9n.nar.zst: server returned 500: 
qva21jdiricfhzy5bw3dzih65v2yc9zd-evalCheck-eval-lib-relativeDir.drv: error: gRPC AddMultipleToStore on 'nix-store.geninf.io:50051' failed: error: niks3 push: uploading objects: uploading NAR nar/0rjc67zn0kg29kiagcyis29511ykifdilrvymvmr9y9l0a2s63n1.nar.zst: uploading NAR nar/0rjc67zn0kg29kiagcyis29511ykifdilrvymvmr9y9l0a2s63n1.nar.zst: server returned 500: 
pk5lksmcrlb6w3qrdmj6846zgnbmh9kb-evalCheck-eval-tests-syncthing.drv: error: gRPC AddMultipleToStore on 'nix-store.geninf.io:50051' failed: error: niks3 push: uploading objects: uploading NAR nar/0jb4dqvffmw4knwk3djz9lx817yfykcwwlh20k59jqs3icnjsnkf.nar.zst: uploading NAR nar/0jb4dqvffmw4knwk3djz9lx817yfykcwwlh20k59jqs3icnjsnkf.nar.zst: server returned 500: 
rhibxfcrrs1czkkmf8kdyyq09jdws3z5-evalCheck-eval-tests-hello-world.drv: error: gRPC AddMultipleToStore on 'nix-store.geninf.io:50051' failed: error: niks3 push: uploading objects: uploading NAR nar/01k7ifn3vwsz8xrris6c8v6dryhdx9h8d98ak3hc0zwjm6vcs7ad.nar.zst: uploading NAR nar/01k7ifn3vwsz8xrris6c8v6dryhdx9h8d98ak3hc0zwjm6vcs7ad.nar.zst: server returned 500: 
83g84453xvrc4nmnciyjpxnrj8irn328-evalCheck-eval-lib-distributedServices.drv: error: gRPC AddMultipleToStore on 'nix-store.geninf.io:50051' failed: error: niks3 push: uploading objects: uploading NAR nar/1941r9xarrm04vqf6d4ymxl12f2jy5jnx5gb36wfza0df1knla27.nar.zst: uploading NAR nar/1941r9xarrm04vqf6d4ymxl12f2jy5jnx5gb36wfza0df1knla27.nar.zst: server returned 500: 
error: dependency 'k5bmph0kwgqbwk3r7mmbzjxmsn91jkgh-evalCheck-lib-jsonschema-unit-tests.drv' failed
failed checks.x86_64-linux.garage 3m 0s
setup: vms9scp713fp8cjdfv0b90msxb8crd83-command-not-found.drv: gi-build-x86-02: the build this call attached to did not finish, retry, asking the scheduler agai …
setup:
vms9scp713fp8cjdfv0b90msxb8crd83-command-not-found.drv: gi-build-x86-02: the build this call attached to did not finish, retry, asking the scheduler again
vms9scp713fp8cjdfv0b90msxb8crd83-command-not-found.drv: gi-build-x86-02: the build this call attached to did not finish, retry, asking the scheduler again
vms9scp713fp8cjdfv0b90msxb8crd83-command-not-found.drv: build-x86-01: the build this call attached to did not finish, retry, asking the scheduler again
vms9scp713fp8cjdfv0b90msxb8crd83-command-not-found.drv: build-x86-01: the build this call attached to did not finish, retry, asking the scheduler again
vms9scp713fp8cjdfv0b90msxb8crd83-command-not-found.drv: build-x86-01: the build this call attached to did not finish, retry, asking the scheduler again
vms9scp713fp8cjdfv0b90msxb8crd83-command-not-found.drv: build-x86-01: the build this call attached to did not finish, retry, asking the scheduler again
vms9scp713fp8cjdfv0b90msxb8crd83-command-not-found.drv: build-x86-01: the build this call attached to did not finish, retry, asking the scheduler again
error: dependency 'ks9gqwnxd7kxkx53yxnlkkv377x308q4-nixos-test-driver-garage.drv' failed
failed checks.x86_64-linux.hello-service 2m 48s
setup: vms9scp713fp8cjdfv0b90msxb8crd83-command-not-found.drv: build-x86-01: the build this call attached to did not finish, retry, asking the scheduler again v …
setup:
vms9scp713fp8cjdfv0b90msxb8crd83-command-not-found.drv: build-x86-01: the build this call attached to did not finish, retry, asking the scheduler again
vms9scp713fp8cjdfv0b90msxb8crd83-command-not-found.drv: build-x86-01: the build this call attached to did not finish, retry, asking the scheduler again
vms9scp713fp8cjdfv0b90msxb8crd83-command-not-found.drv: build-x86-01: the build this call attached to did not finish, retry, asking the scheduler again
vms9scp713fp8cjdfv0b90msxb8crd83-command-not-found.drv: build-x86-01: the build this call attached to did not finish, retry, asking the scheduler again
vms9scp713fp8cjdfv0b90msxb8crd83-command-not-found.drv: build-x86-01: the build this call attached to did not finish, retry, asking the scheduler again
vms9scp713fp8cjdfv0b90msxb8crd83-command-not-found.drv: build-x86-01: the build this call attached to did not finish, retry, asking the scheduler again
vms9scp713fp8cjdfv0b90msxb8crd83-command-not-found.drv: build-x86-01: the build this call attached to did not finish, retry, asking the scheduler again
error: dependency 'zzf0mwh7si32qwl8bpvy3mf6wwwrijlc-nixos-test-driver-hello-service.drv' failed
failed checks.x86_64-linux.kde 3m 18s
setup: vms9scp713fp8cjdfv0b90msxb8crd83-command-not-found.drv: build-x86-01: the build this call attached to did not finish, retry, asking the scheduler again v …
setup:
vms9scp713fp8cjdfv0b90msxb8crd83-command-not-found.drv: build-x86-01: the build this call attached to did not finish, retry, asking the scheduler again
vms9scp713fp8cjdfv0b90msxb8crd83-command-not-found.drv: build-x86-01: the build this call attached to did not finish, retry, asking the scheduler again
vms9scp713fp8cjdfv0b90msxb8crd83-command-not-found.drv: build-x86-01: the build this call attached to did not finish, retry, asking the scheduler again
vms9scp713fp8cjdfv0b90msxb8crd83-command-not-found.drv: build-x86-01: the build this call attached to did not finish, retry, asking the scheduler again
vms9scp713fp8cjdfv0b90msxb8crd83-command-not-found.drv: build-x86-01: the build this call attached to did not finish, retry, asking the scheduler again
vms9scp713fp8cjdfv0b90msxb8crd83-command-not-found.drv: gi-build-x86-02: the build this call attached to did not finish, retry, asking the scheduler again
vms9scp713fp8cjdfv0b90msxb8crd83-command-not-found.drv: build-x86-01: publish failed: error: niks3 push: uploading objects: uploading build log log/vms9scp713fp8cjdfv0b90msxb8crd83-command-not-found.drv: server returned 500: , asking the scheduler again
error: dependency 'zlf7i6as4dgqy214r6qc7c321l3w3gjg-nixos-test-driver-kde.drv' failed
failed checks.x86_64-linux.localbackup 1m 56s
setup: don't know how to build these paths: /nix/store/j19v6w78iqapx11hh81k0k6qd1zh7wmh-container-test-run-localbackup.drv warning: ignoring the client-specif …
setup:
don't know how to build these paths:
  /nix/store/j19v6w78iqapx11hh81k0k6qd1zh7wmh-container-test-run-localbackup.drv
warning: ignoring the client-specified setting 'store', because it is a restricted setting and you are not a trusted user
error: gRPC QueryValidPaths on 'nix-store.geninf.io:50051' failed: error: niks3 push: uploading objects: uploading build log log/vms9scp713fp8cjdfv0b90msxb8crd83-command-not-found.drv: server returned 500: 
failed checks.x86_64-linux.machine-id 4m 36s
setup: vms9scp713fp8cjdfv0b90msxb8crd83-command-not-found.drv: build-x86-01: publish failed: error: niks3 push: uploading objects: uploading NAR nar/0qmrbzrb6wd …
setup:
vms9scp713fp8cjdfv0b90msxb8crd83-command-not-found.drv: build-x86-01: publish failed: error: niks3 push: uploading objects: uploading NAR nar/0qmrbzrb6wdc2vd3ac5dk9zps78lf9pksbvbw5v8q84p6b3fmcwc.nar.zst: uploading NAR nar/0qmrbzrb6wdc2vd3ac5dk9zps78lf9pksbvbw5v8q84p6b3fmcwc.nar.zst: server returned 500: , asking the scheduler again
vms9scp713fp8cjdfv0b90msxb8crd83-command-not-found.drv: build-x86-01: publish failed: error: niks3 push: uploading objects: uploading build log log/vms9scp713fp8cjdfv0b90msxb8crd83-command-not-found.drv: server returned 500: , asking the scheduler again
vms9scp713fp8cjdfv0b90msxb8crd83-command-not-found.drv: gi-build-x86-02: publish failed: error: niks3 push: uploading objects: uploading NAR nar/0qmrbzrb6wdc2vd3ac5dk9zps78lf9pksbvbw5v8q84p6b3fmcwc.nar.zst: uploading NAR nar/0qmrbzrb6wdc2vd3ac5dk9zps78lf9pksbvbw5v8q84p6b3fmcwc.nar.zst: server returned 500: , asking the scheduler again
vms9scp713fp8cjdfv0b90msxb8crd83-command-not-found.drv: gi-build-x86-02: publish failed: error: niks3 push: uploading objects: uploading build log log/vms9scp713fp8cjdfv0b90msxb8crd83-command-not-found.drv: server returned 500: , asking the scheduler again
vms9scp713fp8cjdfv0b90msxb8crd83-command-not-found.drv: build-x86-01: publish failed: error: niks3 push: uploading objects: uploading build log log/vms9scp713fp8cjdfv0b90msxb8crd83-command-not-found.drv: server returned 500: , asking the scheduler again
vms9scp713fp8cjdfv0b90msxb8crd83-command-not-found.drv: gi-build-x86-02: the build this call attached to did not finish, retry, asking the scheduler again
vms9scp713fp8cjdfv0b90msxb8crd83-command-not-found.drv: gi-build-x86-02: the build this call attached to did not finish, retry, asking the scheduler again
error: dependency 'c676l65ngmhpf88kva04ry7i2h98aarh-nixos-test-driver-service-machine-id.drv' failed
failed checks.x86_64-linux.matrix-synapse 2m 59s
setup: vms9scp713fp8cjdfv0b90msxb8crd83-command-not-found.drv: gi-build-x86-02: the build this call attached to did not finish, retry, asking the scheduler agai …
setup:
vms9scp713fp8cjdfv0b90msxb8crd83-command-not-found.drv: gi-build-x86-02: the build this call attached to did not finish, retry, asking the scheduler again
vms9scp713fp8cjdfv0b90msxb8crd83-command-not-found.drv: build-x86-01: the build this call attached to did not finish, retry, asking the scheduler again
vms9scp713fp8cjdfv0b90msxb8crd83-command-not-found.drv: build-x86-01: the build this call attached to did not finish, retry, asking the scheduler again
vms9scp713fp8cjdfv0b90msxb8crd83-command-not-found.drv: build-x86-01: the build this call attached to did not finish, retry, asking the scheduler again
vms9scp713fp8cjdfv0b90msxb8crd83-command-not-found.drv: build-x86-01: the build this call attached to did not finish, retry, asking the scheduler again
vms9scp713fp8cjdfv0b90msxb8crd83-command-not-found.drv: build-x86-01: the build this call attached to did not finish, retry, asking the scheduler again
vms9scp713fp8cjdfv0b90msxb8crd83-command-not-found.drv: build-x86-01: the build this call attached to did not finish, retry, asking the scheduler again
error: dependency 'bkf5ywdqq7walnwm9906dch0s9vb9zrs-nixos-test-driver-matrix-synapse.drv' failed
failed checks.x86_64-linux.monitoring 3m 7s
setup: vms9scp713fp8cjdfv0b90msxb8crd83-command-not-found.drv: build-x86-01: the build this call attached to did not finish, retry, asking the scheduler again v …
setup:
vms9scp713fp8cjdfv0b90msxb8crd83-command-not-found.drv: build-x86-01: the build this call attached to did not finish, retry, asking the scheduler again
vms9scp713fp8cjdfv0b90msxb8crd83-command-not-found.drv: build-x86-01: the build this call attached to did not finish, retry, asking the scheduler again
vms9scp713fp8cjdfv0b90msxb8crd83-command-not-found.drv: build-x86-01: the build this call attached to did not finish, retry, asking the scheduler again
vms9scp713fp8cjdfv0b90msxb8crd83-command-not-found.drv: build-x86-01: the build this call attached to did not finish, retry, asking the scheduler again
vms9scp713fp8cjdfv0b90msxb8crd83-command-not-found.drv: build-x86-01: the build this call attached to did not finish, retry, asking the scheduler again
vms9scp713fp8cjdfv0b90msxb8crd83-command-not-found.drv: build-x86-01: the build this call attached to did not finish, retry, asking the scheduler again
vms9scp713fp8cjdfv0b90msxb8crd83-command-not-found.drv: build-x86-01: the build this call attached to did not finish, retry, asking the scheduler again
error: dependency 'dfbv2rdi24v8dd9mivqiv9p7p5vhhgqp-nixos-test-driver-monitoring.drv' failed
failed checks.x86_64-linux.mycelium 29s
setup: don't know how to build these paths: /nix/store/834jgddy8vw1x4iw4s4470z01pxj097b-vm-test-run-mycelium.drv warning: ignoring the client-specified settin …
setup:
don't know how to build these paths:
  /nix/store/834jgddy8vw1x4iw4s4470z01pxj097b-vm-test-run-mycelium.drv
warning: ignoring the client-specified setting 'store', because it is a restricted setting and you are not a trusted user
error: gRPC QueryValidPaths on 'nix-store.geninf.io:50051' failed: error: niks3 push: uploading objects: uploading build log log/vms9scp713fp8cjdfv0b90msxb8crd83-command-not-found.drv: server returned 500: 
failed checks.x86_64-linux.ncps 3m 7s
setup: vms9scp713fp8cjdfv0b90msxb8crd83-command-not-found.drv: build-x86-01: the build this call attached to did not finish, retry, asking the scheduler again v …
setup:
vms9scp713fp8cjdfv0b90msxb8crd83-command-not-found.drv: build-x86-01: the build this call attached to did not finish, retry, asking the scheduler again
vms9scp713fp8cjdfv0b90msxb8crd83-command-not-found.drv: build-x86-01: the build this call attached to did not finish, retry, asking the scheduler again
vms9scp713fp8cjdfv0b90msxb8crd83-command-not-found.drv: build-x86-01: the build this call attached to did not finish, retry, asking the scheduler again
vms9scp713fp8cjdfv0b90msxb8crd83-command-not-found.drv: build-x86-01: the build this call attached to did not finish, retry, asking the scheduler again
vms9scp713fp8cjdfv0b90msxb8crd83-command-not-found.drv: build-x86-01: the build this call attached to did not finish, retry, asking the scheduler again
vms9scp713fp8cjdfv0b90msxb8crd83-command-not-found.drv: build-x86-01: publish failed: error: niks3 push: uploading objects: uploading build log log/vms9scp713fp8cjdfv0b90msxb8crd83-command-not-found.drv: server returned 500: , asking the scheduler again
vms9scp713fp8cjdfv0b90msxb8crd83-command-not-found.drv: build-x86-01: the build this call attached to did not finish, retry, asking the scheduler again
error: dependency 'fl8f71nv7ghpc882nj3lqy86yncsnpjz-nixos-test-driver-ncps.drv' failed
failed checks.x86_64-linux.nixos-documentation 2m 44s
setup: /nix/store/6s4wm3zl2y0v5g998n2g88k1zh3vf2pr-zlib-1.3.2 /nix/store/xvpdcmxbccnavnw2dciidp0zrknzr1db-zlib-1.3.2-static /nix/store/llsvyjp1d86nh4jr6yp …
setup:
  /nix/store/6s4wm3zl2y0v5g998n2g88k1zh3vf2pr-zlib-1.3.2
  /nix/store/xvpdcmxbccnavnw2dciidp0zrknzr1db-zlib-1.3.2-static
  /nix/store/llsvyjp1d86nh4jr6yprl2x1lxahzyzc-zlib-ng-2.3.3
  /nix/store/7zbzvm0bwa2mh5dp3p5gasix417lysxc-zstd-1.5.7
  /nix/store/z8fp2l0b1k64swd0dxpych445wpfcgb0-zstd-1.5.7-bin
  /nix/store/4d2k230fhyxb8qab8amyk011m7pmpcrz-zstd-1.5.7-man
warning: ignoring the client-specified setting 'store', because it is a restricted setting and you are not a trusted user
error: gRPC QueryValidPaths on 'nix-store.geninf.io:50051' failed: error: niks3 push: uploading objects: uploading NAR nar/1m1hgdfl2rxypg3w8m7hac2vvq9diivapvpsqbzkgvjgq8w5hhjl.nar.zst: uploading NAR nar/1m1hgdfl2rxypg3w8m7hac2vvq9diivapvpsqbzkgvjgq8w5hhjl.nar.zst: server returned 500: 
dependency failed checks.x86_64-linux.nixos-flash-installer —
failed checks.x86_64-linux.nixos-systemd-abstraction 9s
setup: don't know how to build these paths: /nix/store/arf5xlwp983wplw8c0rf2ra72rdw5ih6-container-test-run-systemd-abstraction.drv warning: ignoring the clien …
setup:
don't know how to build these paths:
  /nix/store/arf5xlwp983wplw8c0rf2ra72rdw5ih6-container-test-run-systemd-abstraction.drv
warning: ignoring the client-specified setting 'store', because it is a restricted setting and you are not a trusted user
error: gRPC QueryValidPaths on 'nix-store.geninf.io:50051' failed: error: niks3 push: uploading objects: uploading build log log/vms9scp713fp8cjdfv0b90msxb8crd83-command-not-found.drv: server returned 500: 
failed checks.x86_64-linux.nixos-test-age-backend 3m 2s
setup: vms9scp713fp8cjdfv0b90msxb8crd83-command-not-found.drv: build-x86-01: the build this call attached to did not finish, retry, asking the scheduler again v …
setup:
vms9scp713fp8cjdfv0b90msxb8crd83-command-not-found.drv: build-x86-01: the build this call attached to did not finish, retry, asking the scheduler again
vms9scp713fp8cjdfv0b90msxb8crd83-command-not-found.drv: build-x86-01: the build this call attached to did not finish, retry, asking the scheduler again
vms9scp713fp8cjdfv0b90msxb8crd83-command-not-found.drv: build-x86-01: publish failed: error: niks3 push: uploading objects: uploading NAR nar/0qmrbzrb6wdc2vd3ac5dk9zps78lf9pksbvbw5v8q84p6b3fmcwc.nar.zst: uploading NAR nar/0qmrbzrb6wdc2vd3ac5dk9zps78lf9pksbvbw5v8q84p6b3fmcwc.nar.zst: server returned 500: , asking the scheduler again
vms9scp713fp8cjdfv0b90msxb8crd83-command-not-found.drv: build-x86-01: publish failed: error: niks3 push: uploading objects: uploading NAR nar/0qmrbzrb6wdc2vd3ac5dk9zps78lf9pksbvbw5v8q84p6b3fmcwc.nar.zst: uploading NAR nar/0qmrbzrb6wdc2vd3ac5dk9zps78lf9pksbvbw5v8q84p6b3fmcwc.nar.zst: server returned 500: , asking the scheduler again
vms9scp713fp8cjdfv0b90msxb8crd83-command-not-found.drv: build-x86-01: the build this call attached to did not finish, retry, asking the scheduler again
vms9scp713fp8cjdfv0b90msxb8crd83-command-not-found.drv: build-x86-01: the build this call attached to did not finish, retry, asking the scheduler again
vms9scp713fp8cjdfv0b90msxb8crd83-command-not-found.drv: build-x86-01: the build this call attached to did not finish, retry, asking the scheduler again
error: dependency 's9shpa765pfbrnwp13nps3mbpwx1i8a4-nixos-test-driver-nixos-test-age-backend.drv' failed
failed checks.x86_64-linux.nixos-test-container 1m 51s
setup: don't know how to build these paths: /nix/store/gvhiic9kzvcc9pwca52qgjjy0ggc38m6-container-test-run-container.drv warning: ignoring the client-specifie …
setup:
don't know how to build these paths:
  /nix/store/gvhiic9kzvcc9pwca52qgjjy0ggc38m6-container-test-run-container.drv
warning: ignoring the client-specified setting 'store', because it is a restricted setting and you are not a trusted user
error: gRPC QueryValidPaths on 'nix-store.geninf.io:50051' failed: error: niks3 push: uploading objects: uploading build log log/vms9scp713fp8cjdfv0b90msxb8crd83-command-not-found.drv: server returned 500: 
failed checks.x86_64-linux.nixos-test-extra-python-packages 3m 5s
setup: vms9scp713fp8cjdfv0b90msxb8crd83-command-not-found.drv: build-x86-01: the build this call attached to did not finish, retry, asking the scheduler again v …
setup:
vms9scp713fp8cjdfv0b90msxb8crd83-command-not-found.drv: build-x86-01: the build this call attached to did not finish, retry, asking the scheduler again
vms9scp713fp8cjdfv0b90msxb8crd83-command-not-found.drv: build-x86-01: the build this call attached to did not finish, retry, asking the scheduler again
vms9scp713fp8cjdfv0b90msxb8crd83-command-not-found.drv: build-x86-01: the build this call attached to did not finish, retry, asking the scheduler again
vms9scp713fp8cjdfv0b90msxb8crd83-command-not-found.drv: build-x86-01: the build this call attached to did not finish, retry, asking the scheduler again
vms9scp713fp8cjdfv0b90msxb8crd83-command-not-found.drv: build-x86-01: the build this call attached to did not finish, retry, asking the scheduler again
vms9scp713fp8cjdfv0b90msxb8crd83-command-not-found.drv: build-x86-01: the build this call attached to did not finish, retry, asking the scheduler again
vms9scp713fp8cjdfv0b90msxb8crd83-command-not-found.drv: gi-build-x86-02: publish failed: error: niks3 push: uploading objects: uploading build log log/vms9scp713fp8cjdfv0b90msxb8crd83-command-not-found.drv: server returned 500: , asking the scheduler again
error: dependency 'y3ji03nk1r12ckyvq3jiqhfi3n0vmdrd-nixos-test-driver-test-extra-python-packages.drv' failed
failed checks.x86_64-linux.nixos-test-flash 17s
setup: /nix/store/llsvyjp1d86nh4jr6yprl2x1lxahzyzc-zlib-ng-2.3.3 /nix/store/7zbzvm0bwa2mh5dp3p5gasix417lysxc-zstd-1.5.7 /nix/store/z8fp2l0b1k64swd0dxpych4 …
setup:
  /nix/store/llsvyjp1d86nh4jr6yprl2x1lxahzyzc-zlib-ng-2.3.3
  /nix/store/7zbzvm0bwa2mh5dp3p5gasix417lysxc-zstd-1.5.7
  /nix/store/z8fp2l0b1k64swd0dxpych445wpfcgb0-zstd-1.5.7-bin
  /nix/store/4d2k230fhyxb8qab8amyk011m7pmpcrz-zstd-1.5.7-man
  /nix/store/yw25lb99z7b7lk2fq587d9k9n8pxx2k9-zvbi-0.2.45
  /nix/store/x8i59ikxpg2j3z4b07fmljxfp74w5kqr-zxing-cpp-2.3.0
warning: ignoring the client-specified setting 'store', because it is a restricted setting and you are not a trusted user
error: gRPC QueryValidPaths on 'nix-store.geninf.io:50051' failed: error: niks3 push: uploading objects: uploading NAR nar/0qmrbzrb6wdc2vd3ac5dk9zps78lf9pksbvbw5v8q84p6b3fmcwc.nar.zst: uploading NAR nar/0qmrbzrb6wdc2vd3ac5dk9zps78lf9pksbvbw5v8q84p6b3fmcwc.nar.zst: server returned 500: 
failed checks.x86_64-linux.nixos-test-flash-installer-boot 1m 35s
setup: /nix/store/6s4wm3zl2y0v5g998n2g88k1zh3vf2pr-zlib-1.3.2 /nix/store/xvpdcmxbccnavnw2dciidp0zrknzr1db-zlib-1.3.2-static /nix/store/llsvyjp1d86nh4jr6yp …
setup:
  /nix/store/6s4wm3zl2y0v5g998n2g88k1zh3vf2pr-zlib-1.3.2
  /nix/store/xvpdcmxbccnavnw2dciidp0zrknzr1db-zlib-1.3.2-static
  /nix/store/llsvyjp1d86nh4jr6yprl2x1lxahzyzc-zlib-ng-2.3.3
  /nix/store/7zbzvm0bwa2mh5dp3p5gasix417lysxc-zstd-1.5.7
  /nix/store/z8fp2l0b1k64swd0dxpych445wpfcgb0-zstd-1.5.7-bin
  /nix/store/4d2k230fhyxb8qab8amyk011m7pmpcrz-zstd-1.5.7-man
warning: ignoring the client-specified setting 'store', because it is a restricted setting and you are not a trusted user
error: gRPC QueryValidPaths on 'nix-store.geninf.io:50051' failed: error: niks3 push: uploading objects: uploading build log log/6lc9nfw3fkn744md97gqpwr66jppq6r1-linux-7.2.10-modules.drv: server returned 500: 
failed checks.x86_64-linux.nixos-test-installation 1m 39s
setup: don't know how to build these paths: /nix/store/6ll7n6l3sf68ahy059378z80wag2hgvd-vm-test-run-installation.drv warning: ignoring the client-specified se …
setup:
don't know how to build these paths:
  /nix/store/6ll7n6l3sf68ahy059378z80wag2hgvd-vm-test-run-installation.drv
warning: ignoring the client-specified setting 'store', because it is a restricted setting and you are not a trusted user
error: gRPC QueryValidPaths on 'nix-store.geninf.io:50051' failed: error: niks3 push: uploading objects: uploading NAR nar/0qmrbzrb6wdc2vd3ac5dk9zps78lf9pksbvbw5v8q84p6b3fmcwc.nar.zst: uploading NAR nar/0qmrbzrb6wdc2vd3ac5dk9zps78lf9pksbvbw5v8q84p6b3fmcwc.nar.zst: server returned 500: 
failed checks.x86_64-linux.nixos-test-installation-age 3m 0s
setup: vms9scp713fp8cjdfv0b90msxb8crd83-command-not-found.drv: build-x86-01: the build this call attached to did not finish, retry, asking the scheduler again v …
setup:
vms9scp713fp8cjdfv0b90msxb8crd83-command-not-found.drv: build-x86-01: the build this call attached to did not finish, retry, asking the scheduler again
vms9scp713fp8cjdfv0b90msxb8crd83-command-not-found.drv: build-x86-01: the build this call attached to did not finish, retry, asking the scheduler again
vms9scp713fp8cjdfv0b90msxb8crd83-command-not-found.drv: build-x86-01: the build this call attached to did not finish, retry, asking the scheduler again
vms9scp713fp8cjdfv0b90msxb8crd83-command-not-found.drv: build-x86-01: the build this call attached to did not finish, retry, asking the scheduler again
gfwgvi9mynbwqbwz6g69j4lmz85crbhd-initrd-units.drv: gi-build-x86-02: the build this call attached to did not finish, retry, asking the scheduler again
gfwgvi9mynbwqbwz6g69j4lmz85crbhd-initrd-units.drv: build-x86-01: publish failed: error: niks3 push: uploading objects: uploading build log log/gfwgvi9mynbwqbwz6g69j4lmz85crbhd-initrd-units.drv: server returned 500: , asking the scheduler again
gfwgvi9mynbwqbwz6g69j4lmz85crbhd-initrd-units.drv: build-x86-01: the build this call attached to did not finish, retry, asking the scheduler again
error: dependency 'hmw55xwjnq4hsgbr3xxiskjkafzd3x7f-nixos-test-driver-installation.drv' failed
failed checks.x86_64-linux.nixos-test-installation-password-store 1m 42s
setup: /nix/store/llsvyjp1d86nh4jr6yprl2x1lxahzyzc-zlib-ng-2.3.3 /nix/store/7zbzvm0bwa2mh5dp3p5gasix417lysxc-zstd-1.5.7 /nix/store/z8fp2l0b1k64swd0dxpych4 …
setup:
  /nix/store/llsvyjp1d86nh4jr6yprl2x1lxahzyzc-zlib-ng-2.3.3
  /nix/store/7zbzvm0bwa2mh5dp3p5gasix417lysxc-zstd-1.5.7
  /nix/store/z8fp2l0b1k64swd0dxpych445wpfcgb0-zstd-1.5.7-bin
  /nix/store/4d2k230fhyxb8qab8amyk011m7pmpcrz-zstd-1.5.7-man
  /nix/store/yw25lb99z7b7lk2fq587d9k9n8pxx2k9-zvbi-0.2.45
  /nix/store/x8i59ikxpg2j3z4b07fmljxfp74w5kqr-zxing-cpp-2.3.0
warning: ignoring the client-specified setting 'store', because it is a restricted setting and you are not a trusted user
error: gRPC QueryValidPaths on 'nix-store.geninf.io:50051' failed: error: niks3 push: uploading objects: uploading build log log/vms9scp713fp8cjdfv0b90msxb8crd83-command-not-found.drv: server returned 500: 
failed checks.x86_64-linux.nixos-test-password-store-mounts 37s
setup: /nix/store/6s4wm3zl2y0v5g998n2g88k1zh3vf2pr-zlib-1.3.2 /nix/store/xvpdcmxbccnavnw2dciidp0zrknzr1db-zlib-1.3.2-static /nix/store/llsvyjp1d86nh4jr6yp …
setup:
  /nix/store/6s4wm3zl2y0v5g998n2g88k1zh3vf2pr-zlib-1.3.2
  /nix/store/xvpdcmxbccnavnw2dciidp0zrknzr1db-zlib-1.3.2-static
  /nix/store/llsvyjp1d86nh4jr6yprl2x1lxahzyzc-zlib-ng-2.3.3
  /nix/store/7zbzvm0bwa2mh5dp3p5gasix417lysxc-zstd-1.5.7
  /nix/store/z8fp2l0b1k64swd0dxpych445wpfcgb0-zstd-1.5.7-bin
  /nix/store/4d2k230fhyxb8qab8amyk011m7pmpcrz-zstd-1.5.7-man
warning: ignoring the client-specified setting 'store', because it is a restricted setting and you are not a trusted user
error: gRPC QueryValidPaths on 'nix-store.geninf.io:50051' failed: error: niks3 push: uploading objects: uploading build log log/vms9scp713fp8cjdfv0b90msxb8crd83-command-not-found.drv: server returned 500: 
failed checks.x86_64-linux.nixos-test-secrets 2m 48s
setup: xjfxifz3xjlws2zs8i2z23l06qir8z9f-initrd-linux-6.18.56.drv: error: gRPC AddMultipleToStore on 'nix-store.geninf.io:50051' failed: error: niks3 push: uploa …
setup:
xjfxifz3xjlws2zs8i2z23l06qir8z9f-initrd-linux-6.18.56.drv: error: gRPC AddMultipleToStore on 'nix-store.geninf.io:50051' failed: error: niks3 push: uploading objects: uploading NAR nar/1ycp9kdy1vj7wbd659bkh172x7dyv4fqln82lgj53diydnbghrjl.nar.zst: uploading NAR nar/1ycp9kdy1vj7wbd659bkh172x7dyv4fqln82lgj53diydnbghrjl.nar.zst: server returned 500: 
vms9scp713fp8cjdfv0b90msxb8crd83-command-not-found.drv: build-x86-01: the build this call attached to did not finish, retry, asking the scheduler again
vms9scp713fp8cjdfv0b90msxb8crd83-command-not-found.drv: build-x86-01: the build this call attached to did not finish, retry, asking the scheduler again
vms9scp713fp8cjdfv0b90msxb8crd83-command-not-found.drv: build-x86-01: the build this call attached to did not finish, retry, asking the scheduler again
vms9scp713fp8cjdfv0b90msxb8crd83-command-not-found.drv: build-x86-01: the build this call attached to did not finish, retry, asking the scheduler again
vms9scp713fp8cjdfv0b90msxb8crd83-command-not-found.drv: build-x86-01: the build this call attached to did not finish, retry, asking the scheduler again
vms9scp713fp8cjdfv0b90msxb8crd83-command-not-found.drv: build-x86-01: the build this call attached to did not finish, retry, asking the scheduler again
error: dependency '97dhxvqc4a0r14cc3zcwmj062cpqahv1-nixos-test-driver-secrets.drv' failed
failed checks.x86_64-linux.nixos-test-update-hardware-configuration 3m 47s
setup: vms9scp713fp8cjdfv0b90msxb8crd83-command-not-found.drv: gi-build-x86-02: the build this call attached to did not finish, retry, asking the scheduler agai …
setup:
vms9scp713fp8cjdfv0b90msxb8crd83-command-not-found.drv: gi-build-x86-02: the build this call attached to did not finish, retry, asking the scheduler again
gfwgvi9mynbwqbwz6g69j4lmz85crbhd-initrd-units.drv: build-x86-01: publish failed: error: niks3 push: uploading objects: uploading build log log/gfwgvi9mynbwqbwz6g69j4lmz85crbhd-initrd-units.drv: server returned 500: , asking the scheduler again
gfwgvi9mynbwqbwz6g69j4lmz85crbhd-initrd-units.drv: gi-build-x86-02: publish failed: error: niks3 push: uploading objects: uploading build log log/gfwgvi9mynbwqbwz6g69j4lmz85crbhd-initrd-units.drv: server returned 500: , asking the scheduler again
gfwgvi9mynbwqbwz6g69j4lmz85crbhd-initrd-units.drv: gi-build-x86-02: publish failed: error: niks3 push: uploading objects: uploading NAR nar/0xbrwhli24blsr8rb5ngf3l1zg6qj5s6myiplcbj0lda2izazy2k.nar.zst: uploading NAR nar/0xbrwhli24blsr8rb5ngf3l1zg6qj5s6myiplcbj0lda2izazy2k.nar.zst: server returned 500: , asking the scheduler again
gfwgvi9mynbwqbwz6g69j4lmz85crbhd-initrd-units.drv: build-x86-01: publish failed: error: niks3 push: uploading objects: uploading build log log/gfwgvi9mynbwqbwz6g69j4lmz85crbhd-initrd-units.drv: server returned 500: , asking the scheduler again
gfwgvi9mynbwqbwz6g69j4lmz85crbhd-initrd-units.drv: gi-build-x86-02: publish failed: error: niks3 push: uploading objects: uploading build log log/gfwgvi9mynbwqbwz6g69j4lmz85crbhd-initrd-units.drv: server returned 500: , asking the scheduler again
gfwgvi9mynbwqbwz6g69j4lmz85crbhd-initrd-units.drv: gi-build-x86-02: publish failed: error: niks3 push: uploading objects: uploading build log log/gfwgvi9mynbwqbwz6g69j4lmz85crbhd-initrd-units.drv: server returned 500: , asking the scheduler again
error: dependency 'ym8rfq9bw5bnfbvgdsdp678x61v52xg7-nixos-test-driver-update-hardware-configuration.drv' failed
failed checks.x86_64-linux.nixos-test-user-firewall-iptables 2m 36s
setup: vms9scp713fp8cjdfv0b90msxb8crd83-command-not-found.drv: build-x86-01: the build this call attached to did not finish, retry, asking the scheduler again v …
setup:
vms9scp713fp8cjdfv0b90msxb8crd83-command-not-found.drv: build-x86-01: the build this call attached to did not finish, retry, asking the scheduler again
vms9scp713fp8cjdfv0b90msxb8crd83-command-not-found.drv: build-x86-01: the build this call attached to did not finish, retry, asking the scheduler again
vms9scp713fp8cjdfv0b90msxb8crd83-command-not-found.drv: build-x86-01: the build this call attached to did not finish, retry, asking the scheduler again
vms9scp713fp8cjdfv0b90msxb8crd83-command-not-found.drv: build-x86-01: the build this call attached to did not finish, retry, asking the scheduler again
vms9scp713fp8cjdfv0b90msxb8crd83-command-not-found.drv: build-x86-01: the build this call attached to did not finish, retry, asking the scheduler again
vms9scp713fp8cjdfv0b90msxb8crd83-command-not-found.drv: build-x86-01: the build this call attached to did not finish, retry, asking the scheduler again
vms9scp713fp8cjdfv0b90msxb8crd83-command-not-found.drv: build-x86-01: the build this call attached to did not finish, retry, asking the scheduler again
error: dependency 'c53y7234ykpb9vxga711zhffm1m1c17c-nixos-test-driver-user-firewall-iptables.drv' failed
failed checks.x86_64-linux.nixos-test-user-firewall-nftables 2m 45s
setup: vms9scp713fp8cjdfv0b90msxb8crd83-command-not-found.drv: build-x86-01: the build this call attached to did not finish, retry, asking the scheduler again v …
setup:
vms9scp713fp8cjdfv0b90msxb8crd83-command-not-found.drv: build-x86-01: the build this call attached to did not finish, retry, asking the scheduler again
vms9scp713fp8cjdfv0b90msxb8crd83-command-not-found.drv: build-x86-01: the build this call attached to did not finish, retry, asking the scheduler again
vms9scp713fp8cjdfv0b90msxb8crd83-command-not-found.drv: build-x86-01: the build this call attached to did not finish, retry, asking the scheduler again
vms9scp713fp8cjdfv0b90msxb8crd83-command-not-found.drv: build-x86-01: the build this call attached to did not finish, retry, asking the scheduler again
vms9scp713fp8cjdfv0b90msxb8crd83-command-not-found.drv: build-x86-01: the build this call attached to did not finish, retry, asking the scheduler again
vms9scp713fp8cjdfv0b90msxb8crd83-command-not-found.drv: build-x86-01: the build this call attached to did not finish, retry, asking the scheduler again
vms9scp713fp8cjdfv0b90msxb8crd83-command-not-found.drv: gi-build-x86-02: the build this call attached to did not finish, retry, asking the scheduler again
error: dependency '7spsvlc672f4qnwnapk53vj5m1z8lrwl-nixos-test-driver-user-firewall-nftables.drv' failed
failed checks.x86_64-linux.nixos-test-wayland-proxy-virtwl 2m 34s
setup: vms9scp713fp8cjdfv0b90msxb8crd83-command-not-found.drv: build-x86-01: the build this call attached to did not finish, retry, asking the scheduler again v …
setup:
vms9scp713fp8cjdfv0b90msxb8crd83-command-not-found.drv: build-x86-01: the build this call attached to did not finish, retry, asking the scheduler again
vms9scp713fp8cjdfv0b90msxb8crd83-command-not-found.drv: build-x86-01: the build this call attached to did not finish, retry, asking the scheduler again
vms9scp713fp8cjdfv0b90msxb8crd83-command-not-found.drv: build-x86-01: the build this call attached to did not finish, retry, asking the scheduler again
vms9scp713fp8cjdfv0b90msxb8crd83-command-not-found.drv: build-x86-01: the build this call attached to did not finish, retry, asking the scheduler again
xjfxifz3xjlws2zs8i2z23l06qir8z9f-initrd-linux-6.18.56.drv: error: gRPC AddMultipleToStore on 'nix-store.geninf.io:50051' failed: error: niks3 push: uploading objects: uploading NAR nar/0yq8n7wgy25pcg2q0gf55273fm6drkih3i7gbxidsyfl0i5yl875.nar.zst: uploading NAR nar/0yq8n7wgy25pcg2q0gf55273fm6drkih3i7gbxidsyfl0i5yl875.nar.zst: server returned 500: 
vms9scp713fp8cjdfv0b90msxb8crd83-command-not-found.drv: build-x86-01: the build this call attached to did not finish, retry, asking the scheduler again
vms9scp713fp8cjdfv0b90msxb8crd83-command-not-found.drv: build-x86-01: the build this call attached to did not finish, retry, asking the scheduler again
error: dependency 'sxbjsyd02r63smx6npdvf7qzj5g6r0d8-nixos-test-driver-wayland-proxy-virtwl.drv' failed
failed checks.x86_64-linux.p2p-ssh-iroh 1m 15s
setup: mj4l27vh5xgf8wizpf1923q641qxjii3-vars-check-clan-test-p2p-ssh-iroh.drv: error: gRPC AddMultipleToStore on 'nix-store.geninf.io:50051' failed: error: niks …
setup:
mj4l27vh5xgf8wizpf1923q641qxjii3-vars-check-clan-test-p2p-ssh-iroh.drv: error: gRPC AddMultipleToStore on 'nix-store.geninf.io:50051' failed: error: niks3 push: uploading objects: uploading NAR nar/1378z35pdhj3654prvkns20xmapdf2qd52672bvkvagyw9ghpfjq.nar.zst: uploading NAR nar/1378z35pdhj3654prvkns20xmapdf2qd52672bvkvagyw9ghpfjq.nar.zst: server returned 500: 
vms9scp713fp8cjdfv0b90msxb8crd83-command-not-found.drv: gi-build-x86-02: the build this call attached to did not finish, retry, asking the scheduler again
vms9scp713fp8cjdfv0b90msxb8crd83-command-not-found.drv: gi-build-x86-02: the build this call attached to did not finish, retry, asking the scheduler again
vms9scp713fp8cjdfv0b90msxb8crd83-command-not-found.drv: gi-build-x86-02: the build this call attached to did not finish, retry, asking the scheduler again
vms9scp713fp8cjdfv0b90msxb8crd83-command-not-found.drv: gi-build-x86-02: the build this call attached to did not finish, retry, asking the scheduler again
vms9scp713fp8cjdfv0b90msxb8crd83-command-not-found.drv: build-x86-01: the build this call attached to did not finish, retry, asking the scheduler again
vms9scp713fp8cjdfv0b90msxb8crd83-command-not-found.drv: gi-build-x86-02: publish failed: error: niks3 push: uploading objects: uploading build log log/vms9scp713fp8cjdfv0b90msxb8crd83-command-not-found.drv: server returned 500: , asking the scheduler again
error: dependency '5sigzh9zk7k4yl3zn8bpw0lsbn6aacja-nixos-test-driver-clan-test-p2p-ssh-iroh.drv' failed
failed checks.x86_64-linux.packages 2m 33s
setup: vms9scp713fp8cjdfv0b90msxb8crd83-command-not-found.drv: build-x86-01: the build this call attached to did not finish, retry, asking the scheduler again v …
setup:
vms9scp713fp8cjdfv0b90msxb8crd83-command-not-found.drv: build-x86-01: the build this call attached to did not finish, retry, asking the scheduler again
vms9scp713fp8cjdfv0b90msxb8crd83-command-not-found.drv: build-x86-01: publish failed: error: niks3 push: uploading objects: uploading build log log/vms9scp713fp8cjdfv0b90msxb8crd83-command-not-found.drv: server returned 500: , asking the scheduler again
vms9scp713fp8cjdfv0b90msxb8crd83-command-not-found.drv: build-x86-01: the build this call attached to did not finish, retry, asking the scheduler again
vms9scp713fp8cjdfv0b90msxb8crd83-command-not-found.drv: build-x86-01: the build this call attached to did not finish, retry, asking the scheduler again
vms9scp713fp8cjdfv0b90msxb8crd83-command-not-found.drv: build-x86-01: the build this call attached to did not finish, retry, asking the scheduler again
vms9scp713fp8cjdfv0b90msxb8crd83-command-not-found.drv: build-x86-01: the build this call attached to did not finish, retry, asking the scheduler again
vms9scp713fp8cjdfv0b90msxb8crd83-command-not-found.drv: build-x86-01: the build this call attached to did not finish, retry, asking the scheduler again
error: dependency '5i10gfzkgs1h3ib694wlgpxkh5lmwf2d-nixos-test-driver-packages.drv' failed
failed checks.x86_64-linux.pki 56s
setup: wgz2npqjyhz1p8wvlwba243l4p3g3n5f-initrd-linux-6.18.56.drv: error: gRPC AddMultipleToStore on 'nix-store.geninf.io:50051' failed: error: niks3 push: uploa …
setup:
wgz2npqjyhz1p8wvlwba243l4p3g3n5f-initrd-linux-6.18.56.drv: error: gRPC AddMultipleToStore on 'nix-store.geninf.io:50051' failed: error: niks3 push: uploading objects: uploading NAR nar/0yq8n7wgy25pcg2q0gf55273fm6drkih3i7gbxidsyfl0i5yl875.nar.zst: uploading NAR nar/0yq8n7wgy25pcg2q0gf55273fm6drkih3i7gbxidsyfl0i5yl875.nar.zst: server returned 500: 
vms9scp713fp8cjdfv0b90msxb8crd83-command-not-found.drv: gi-build-x86-02: the build this call attached to did not finish, retry, asking the scheduler again
4dinbd5jhma3kkcy7dngxdi9c27xqj91-initrd-linux-6.18.56.drv: error: gRPC AddMultipleToStore on 'nix-store.geninf.io:50051' failed: error: niks3 push: uploading objects: uploading NAR nar/014lh5ihp7gfnvh1dibc2kvwwyyr2k6rbkix1dxhicl69s2kw9jw.nar.zst: uploading NAR nar/014lh5ihp7gfnvh1dibc2kvwwyyr2k6rbkix1dxhicl69s2kw9jw.nar.zst: server returned 500: 
vms9scp713fp8cjdfv0b90msxb8crd83-command-not-found.drv: gi-build-x86-02: the build this call attached to did not finish, retry, asking the scheduler again
vms9scp713fp8cjdfv0b90msxb8crd83-command-not-found.drv: gi-build-x86-02: the build this call attached to did not finish, retry, asking the scheduler again
vms9scp713fp8cjdfv0b90msxb8crd83-command-not-found.drv: build-x86-01: the build this call attached to did not finish, retry, asking the scheduler again
vms9scp713fp8cjdfv0b90msxb8crd83-command-not-found.drv: gi-build-x86-02: the build this call attached to did not finish, retry, asking the scheduler again
error: dependency 'i2y9bxncg87554c97rf4jz646k4afm6p-nixos-test-driver-pki.drv' failed
failed checks.x86_64-linux.postgresql 2m 33s
setup: vms9scp713fp8cjdfv0b90msxb8crd83-command-not-found.drv: build-x86-01: the build this call attached to did not finish, retry, asking the scheduler again v …
setup:
vms9scp713fp8cjdfv0b90msxb8crd83-command-not-found.drv: build-x86-01: the build this call attached to did not finish, retry, asking the scheduler again
vms9scp713fp8cjdfv0b90msxb8crd83-command-not-found.drv: build-x86-01: the build this call attached to did not finish, retry, asking the scheduler again
vms9scp713fp8cjdfv0b90msxb8crd83-command-not-found.drv: build-x86-01: the build this call attached to did not finish, retry, asking the scheduler again
vms9scp713fp8cjdfv0b90msxb8crd83-command-not-found.drv: build-x86-01: the build this call attached to did not finish, retry, asking the scheduler again
vms9scp713fp8cjdfv0b90msxb8crd83-command-not-found.drv: build-x86-01: the build this call attached to did not finish, retry, asking the scheduler again
vms9scp713fp8cjdfv0b90msxb8crd83-command-not-found.drv: build-x86-01: the build this call attached to did not finish, retry, asking the scheduler again
vms9scp713fp8cjdfv0b90msxb8crd83-command-not-found.drv: build-x86-01: publish failed: error: niks3 push: uploading objects: uploading build log log/vms9scp713fp8cjdfv0b90msxb8crd83-command-not-found.drv: server returned 500: , asking the scheduler again
error: dependency 'aynvxn078wcw46n0z5gw4zv9bbrlh8wn-nixos-test-driver-service-postgresql.drv' failed
failed checks.x86_64-linux.service-dummy-test 26s
setup: /nix/store/6s4wm3zl2y0v5g998n2g88k1zh3vf2pr-zlib-1.3.2 /nix/store/xvpdcmxbccnavnw2dciidp0zrknzr1db-zlib-1.3.2-static /nix/store/llsvyjp1d86nh4jr6yp …
setup:
  /nix/store/6s4wm3zl2y0v5g998n2g88k1zh3vf2pr-zlib-1.3.2
  /nix/store/xvpdcmxbccnavnw2dciidp0zrknzr1db-zlib-1.3.2-static
  /nix/store/llsvyjp1d86nh4jr6yprl2x1lxahzyzc-zlib-ng-2.3.3
  /nix/store/7zbzvm0bwa2mh5dp3p5gasix417lysxc-zstd-1.5.7
  /nix/store/z8fp2l0b1k64swd0dxpych445wpfcgb0-zstd-1.5.7-bin
  /nix/store/4d2k230fhyxb8qab8amyk011m7pmpcrz-zstd-1.5.7-man
warning: ignoring the client-specified setting 'store', because it is a restricted setting and you are not a trusted user
error: gRPC QueryValidPaths on 'nix-store.geninf.io:50051' failed: error: niks3 push: uploading objects: uploading build log log/vms9scp713fp8cjdfv0b90msxb8crd83-command-not-found.drv: server returned 500: 
failed checks.x86_64-linux.service-dummy-test-from-flake 52s
setup: don't know how to build these paths: /nix/store/lpdrpr9r5d3x4qhz0cxmpcrbyp412ah7-container-test-run-service-dummy-test-from-flake.drv warning: ignoring …
setup:
don't know how to build these paths:
  /nix/store/lpdrpr9r5d3x4qhz0cxmpcrbyp412ah7-container-test-run-service-dummy-test-from-flake.drv
warning: ignoring the client-specified setting 'store', because it is a restricted setting and you are not a trusted user
error: gRPC QueryValidPaths on 'nix-store.geninf.io:50051' failed: error: niks3 push: uploading objects: uploading build log log/vms9scp713fp8cjdfv0b90msxb8crd83-command-not-found.drv: server returned 500: 
failed checks.x86_64-linux.sshd 1m 24s
setup: vms9scp713fp8cjdfv0b90msxb8crd83-command-not-found.drv: gi-build-x86-02: the build this call attached to did not finish, retry, asking the scheduler agai …
setup:
vms9scp713fp8cjdfv0b90msxb8crd83-command-not-found.drv: gi-build-x86-02: the build this call attached to did not finish, retry, asking the scheduler again
vms9scp713fp8cjdfv0b90msxb8crd83-command-not-found.drv: gi-build-x86-02: the build this call attached to did not finish, retry, asking the scheduler again
vms9scp713fp8cjdfv0b90msxb8crd83-command-not-found.drv: gi-build-x86-02: the build this call attached to did not finish, retry, asking the scheduler again
vms9scp713fp8cjdfv0b90msxb8crd83-command-not-found.drv: gi-build-x86-02: publish failed: error: niks3 push: uploading objects: uploading NAR nar/0qmrbzrb6wdc2vd3ac5dk9zps78lf9pksbvbw5v8q84p6b3fmcwc.nar.zst: uploading NAR nar/0qmrbzrb6wdc2vd3ac5dk9zps78lf9pksbvbw5v8q84p6b3fmcwc.nar.zst: server returned 500: , asking the scheduler again
vms9scp713fp8cjdfv0b90msxb8crd83-command-not-found.drv: gi-build-x86-02: publish failed: error: niks3 push: uploading objects: uploading NAR nar/0qmrbzrb6wdc2vd3ac5dk9zps78lf9pksbvbw5v8q84p6b3fmcwc.nar.zst: uploading NAR nar/0qmrbzrb6wdc2vd3ac5dk9zps78lf9pksbvbw5v8q84p6b3fmcwc.nar.zst: server returned 500: , asking the scheduler again
vms9scp713fp8cjdfv0b90msxb8crd83-command-not-found.drv: build-x86-01: the build this call attached to did not finish, retry, asking the scheduler again
vms9scp713fp8cjdfv0b90msxb8crd83-command-not-found.drv: gi-build-x86-02: the build this call attached to did not finish, retry, asking the scheduler again
error: dependency 'za94dxzdrwgpzdhhjdm11vykxggfl9ii-nixos-test-driver-sshd.drv' failed
failed checks.x86_64-linux.sshd-no-ca 1m 25s
setup: vms9scp713fp8cjdfv0b90msxb8crd83-command-not-found.drv: gi-build-x86-02: publish failed: error: niks3 push: uploading objects: uploading build log log/vm …
setup:
vms9scp713fp8cjdfv0b90msxb8crd83-command-not-found.drv: gi-build-x86-02: publish failed: error: niks3 push: uploading objects: uploading build log log/vms9scp713fp8cjdfv0b90msxb8crd83-command-not-found.drv: server returned 500: , asking the scheduler again
vms9scp713fp8cjdfv0b90msxb8crd83-command-not-found.drv: gi-build-x86-02: publish failed: error: niks3 push: uploading objects: uploading build log log/vms9scp713fp8cjdfv0b90msxb8crd83-command-not-found.drv: server returned 500: , asking the scheduler again
vms9scp713fp8cjdfv0b90msxb8crd83-command-not-found.drv: gi-build-x86-02: the build this call attached to did not finish, retry, asking the scheduler again
vms9scp713fp8cjdfv0b90msxb8crd83-command-not-found.drv: gi-build-x86-02: the build this call attached to did not finish, retry, asking the scheduler again
vms9scp713fp8cjdfv0b90msxb8crd83-command-not-found.drv: build-x86-01: the build this call attached to did not finish, retry, asking the scheduler again
vms9scp713fp8cjdfv0b90msxb8crd83-command-not-found.drv: gi-build-x86-02: the build this call attached to did not finish, retry, asking the scheduler again
vms9scp713fp8cjdfv0b90msxb8crd83-command-not-found.drv: gi-build-x86-02: publish failed: error: niks3 push: uploading objects: uploading NAR nar/0qmrbzrb6wdc2vd3ac5dk9zps78lf9pksbvbw5v8q84p6b3fmcwc.nar.zst: uploading NAR nar/0qmrbzrb6wdc2vd3ac5dk9zps78lf9pksbvbw5v8q84p6b3fmcwc.nar.zst: server returned 500: , asking the scheduler again
error: dependency 'dd46xwbdwlcfxhwxgwpzbxdfdjq6l40r-nixos-test-driver-sshd.drv' failed
failed checks.x86_64-linux.state-version 2m 25s
setup: vms9scp713fp8cjdfv0b90msxb8crd83-command-not-found.drv: build-x86-01: the build this call attached to did not finish, retry, asking the scheduler again v …
setup:
vms9scp713fp8cjdfv0b90msxb8crd83-command-not-found.drv: build-x86-01: the build this call attached to did not finish, retry, asking the scheduler again
vms9scp713fp8cjdfv0b90msxb8crd83-command-not-found.drv: build-x86-01: the build this call attached to did not finish, retry, asking the scheduler again
vms9scp713fp8cjdfv0b90msxb8crd83-command-not-found.drv: build-x86-01: the build this call attached to did not finish, retry, asking the scheduler again
vms9scp713fp8cjdfv0b90msxb8crd83-command-not-found.drv: build-x86-01: the build this call attached to did not finish, retry, asking the scheduler again
vms9scp713fp8cjdfv0b90msxb8crd83-command-not-found.drv: build-x86-01: the build this call attached to did not finish, retry, asking the scheduler again
vms9scp713fp8cjdfv0b90msxb8crd83-command-not-found.drv: build-x86-01: the build this call attached to did not finish, retry, asking the scheduler again
vms9scp713fp8cjdfv0b90msxb8crd83-command-not-found.drv: build-x86-01: the build this call attached to did not finish, retry, asking the scheduler again
error: dependency 'sr4ym1xsinvcgkrm3z5hmfnp48miwn9h-nixos-test-driver-service-state-version.drv' failed
failed eval checks.x86_64-linux.syncthing-service —
error: … while evaluating the attribute 'drvPath' at «https://releases.nixos.org/nixos/26.05/nixos-26.05.11767.7993f34ee47e/nixexprs.tar.xz?narH …
error:
       … while evaluating the attribute 'drvPath'
         at «https://releases.nixos.org/nixos/26.05/nixos-26.05.11767.7993f34ee47e/nixexprs.tar.xz?narHash=sha256-TnALPKp8o/dtUYgE243iQMbRP4183ZPhWu33FD05k/4%3D»/lib/customisation.nix:427:7:
          426|     // {
          427|       drvPath =
             |       ^
          428|         assert condition;

       … while calling the 'derivationStrict' builtin
         at «nix-internal»/derivation-internal.nix:37:12:
           36|
           37|   strict = derivationStrict drvAttrs;
             |            ^
           38|

       … while evaluating the option `nodes.machine1.networking.interfaces':

       … while evaluating definitions from `/nix/store/dqn2ddd6vpxbgx2jzparmg93hly0x1mj-source/nixos/modules/hardware/facter/networking':

       … while evaluating the option `nodes.machine1.hardware.facter.enable':

       … while evaluating the option `nodes.machine1.hardware.facter.report':

       … while evaluating the option `nodes.machine1.hardware.facter.reportPath':

       … while evaluating definitions from `/nix/store/11yjkn22440chz70j833a2krkf96anz1-source/nixosModules/clanCore/nixos-facter.nix':

       (stack trace truncated; use '--show-trace' to show the full, detailed trace)

       error: gRPC QueryValidPaths on 'nix-store.geninf.io:50051' failed: error: niks3 push: uploading objects: uploading build log log/kaaprpkw8vk1z1kal1wrbdl4lpm2mfsp-generator-syncthing.drv: server returned 500: 
failed checks.x86_64-linux.template-minimal 8s
setup: /nix/store/6s4wm3zl2y0v5g998n2g88k1zh3vf2pr-zlib-1.3.2 /nix/store/xvpdcmxbccnavnw2dciidp0zrknzr1db-zlib-1.3.2-static /nix/store/llsvyjp1d86nh4jr6yp …
setup:
  /nix/store/6s4wm3zl2y0v5g998n2g88k1zh3vf2pr-zlib-1.3.2
  /nix/store/xvpdcmxbccnavnw2dciidp0zrknzr1db-zlib-1.3.2-static
  /nix/store/llsvyjp1d86nh4jr6yprl2x1lxahzyzc-zlib-ng-2.3.3
  /nix/store/7zbzvm0bwa2mh5dp3p5gasix417lysxc-zstd-1.5.7
  /nix/store/z8fp2l0b1k64swd0dxpych445wpfcgb0-zstd-1.5.7-bin
  /nix/store/4d2k230fhyxb8qab8amyk011m7pmpcrz-zstd-1.5.7-man
warning: ignoring the client-specified setting 'store', because it is a restricted setting and you are not a trusted user
error: gRPC QueryValidPaths on 'nix-store.geninf.io:50051' failed: error: niks3 push: uploading objects: uploading build log log/cg9f0if688w7gkm0f85kf62lfigb2cdz-nixos-version.drv: server returned 500: 
failed checks.x86_64-linux.treefmt 12s
setup: /nix/store/xvpdcmxbccnavnw2dciidp0zrknzr1db-zlib-1.3.2-static /nix/store/llsvyjp1d86nh4jr6yprl2x1lxahzyzc-zlib-ng-2.3.3 /nix/store/7zbzvm0bwa2mh5dp …
setup:
  /nix/store/xvpdcmxbccnavnw2dciidp0zrknzr1db-zlib-1.3.2-static
  /nix/store/llsvyjp1d86nh4jr6yprl2x1lxahzyzc-zlib-ng-2.3.3
  /nix/store/7zbzvm0bwa2mh5dp3p5gasix417lysxc-zstd-1.5.7
  /nix/store/z8fp2l0b1k64swd0dxpych445wpfcgb0-zstd-1.5.7-bin
  /nix/store/1hjg44rywjpc52nnhs1z9iba9vgr2s3n-zstd-1.5.7-dev
warning: ignoring the client-specified setting 'store', because it is a restricted setting and you are not a trusted user
2852a2ah9sxya1dcdl7zrc7dzfxnca48-treefmt-check.drv: error: gRPC AddMultipleToStore on 'nix-store.geninf.io:50051' failed: error: niks3 push: uploading objects: uploading NAR nar/1hwc3wqrbwhj84i1kb7lhzqg4l7bhsbdznazi95qlhzi3vg9x9xd.nar.zst: uploading NAR nar/1hwc3wqrbwhj84i1kb7lhzqg4l7bhsbdznazi95qlhzi3vg9x9xd.nar.zst: server returned 500: 
error: error: gRPC AddMultipleToStore on 'nix-store.geninf.io:50051' failed: error: niks3 push: uploading objects: uploading NAR nar/1hwc3wqrbwhj84i1kb7lhzqg4l7bhsbdznazi95qlhzi3vg9x9xd.nar.zst: uploading NAR nar/1hwc3wqrbwhj84i1kb7lhzqg4l7bhsbdznazi95qlhzi3vg9x9xd.nar.zst: server returned 500: 
failed checks.x86_64-linux.trusted-nix-caches 1m 7s
setup: vms9scp713fp8cjdfv0b90msxb8crd83-command-not-found.drv: gi-build-x86-02: the build this call attached to did not finish, retry, asking the scheduler agai …
setup:
vms9scp713fp8cjdfv0b90msxb8crd83-command-not-found.drv: gi-build-x86-02: the build this call attached to did not finish, retry, asking the scheduler again
vms9scp713fp8cjdfv0b90msxb8crd83-command-not-found.drv: gi-build-x86-02: the build this call attached to did not finish, retry, asking the scheduler again
vms9scp713fp8cjdfv0b90msxb8crd83-command-not-found.drv: gi-build-x86-02: the build this call attached to did not finish, retry, asking the scheduler again
vms9scp713fp8cjdfv0b90msxb8crd83-command-not-found.drv: gi-build-x86-02: the build this call attached to did not finish, retry, asking the scheduler again
vms9scp713fp8cjdfv0b90msxb8crd83-command-not-found.drv: gi-build-x86-02: the build this call attached to did not finish, retry, asking the scheduler again
vms9scp713fp8cjdfv0b90msxb8crd83-command-not-found.drv: gi-build-x86-02: the build this call attached to did not finish, retry, asking the scheduler again
vms9scp713fp8cjdfv0b90msxb8crd83-command-not-found.drv: build-x86-01: publish failed: error: niks3 push: uploading objects: uploading build log log/vms9scp713fp8cjdfv0b90msxb8crd83-command-not-found.drv: server returned 500: , asking the scheduler again
error: dependency 'qb92smd9b8n8z9szmknw2dhm21b4nsg0-nixos-test-driver-trusted-nix-caches.drv' failed
failed eval checks.x86_64-linux.users —
error: … while evaluating the attribute 'drvPath' at «https://releases.nixos.org/nixos/26.05/nixos-26.05.11767.7993f34ee47e/nixexprs.tar.xz?narH …
error:
       … while evaluating the attribute 'drvPath'
         at «https://releases.nixos.org/nixos/26.05/nixos-26.05.11767.7993f34ee47e/nixexprs.tar.xz?narHash=sha256-TnALPKp8o/dtUYgE243iQMbRP4183ZPhWu33FD05k/4%3D»/lib/customisation.nix:427:7:
          426|     // {
          427|       drvPath =
             |       ^
          428|         assert condition;

       … while calling the 'derivationStrict' builtin
         at «nix-internal»/derivation-internal.nix:37:12:
           36|
           37|   strict = derivationStrict drvAttrs;
             |            ^
           38|

       … while evaluating the option `nodes.server.networking.interfaces':

       … while evaluating definitions from `/nix/store/dqn2ddd6vpxbgx2jzparmg93hly0x1mj-source/nixos/modules/hardware/facter/networking':

       … while evaluating the option `nodes.server.hardware.facter.enable':

       … while evaluating the option `nodes.server.hardware.facter.report':

       … while evaluating the option `nodes.server.hardware.facter.reportPath':

       … while evaluating definitions from `/nix/store/11yjkn22440chz70j833a2krkf96anz1-source/nixosModules/clanCore/nixos-facter.nix':

       (stack trace truncated; use '--show-trace' to show the full, detailed trace)

       error: build of '/nix/store/wjj1csz796rsk9nfz1fb3ygmj54jqkb7-merged-test-dir-users.drv^out' failed: error: dependency '5cmdcj5bgksajlz9wncv50x66lbzdsv1-test-vars-generated.drv' failed
failed checks.x86_64-linux.wifi 49s
setup: /nix/store/6s4wm3zl2y0v5g998n2g88k1zh3vf2pr-zlib-1.3.2 /nix/store/xvpdcmxbccnavnw2dciidp0zrknzr1db-zlib-1.3.2-static /nix/store/llsvyjp1d86nh4jr6yp …
setup:
  /nix/store/6s4wm3zl2y0v5g998n2g88k1zh3vf2pr-zlib-1.3.2
  /nix/store/xvpdcmxbccnavnw2dciidp0zrknzr1db-zlib-1.3.2-static
  /nix/store/llsvyjp1d86nh4jr6yprl2x1lxahzyzc-zlib-ng-2.3.3
  /nix/store/7zbzvm0bwa2mh5dp3p5gasix417lysxc-zstd-1.5.7
  /nix/store/z8fp2l0b1k64swd0dxpych445wpfcgb0-zstd-1.5.7-bin
  /nix/store/4d2k230fhyxb8qab8amyk011m7pmpcrz-zstd-1.5.7-man
warning: ignoring the client-specified setting 'store', because it is a restricted setting and you are not a trusted user
error: gRPC QueryValidPaths on 'nix-store.geninf.io:50051' failed: error: niks3 push: uploading objects: uploading build log log/vms9scp713fp8cjdfv0b90msxb8crd83-command-not-found.drv: server returned 500: 
failed eval checks.x86_64-linux.wireguard —
error: … while evaluating the attribute 'drvPath' at «https://releases.nixos.org/nixos/26.05/nixos-26.05.11767.7993f34ee47e/nixexprs.tar.xz?narH …
error:
       … while evaluating the attribute 'drvPath'
         at «https://releases.nixos.org/nixos/26.05/nixos-26.05.11767.7993f34ee47e/nixexprs.tar.xz?narHash=sha256-TnALPKp8o/dtUYgE243iQMbRP4183ZPhWu33FD05k/4%3D»/lib/customisation.nix:427:7:
          426|     // {
          427|       drvPath =
             |       ^
          428|         assert condition;

       … while calling the 'derivationStrict' builtin
         at «nix-internal»/derivation-internal.nix:37:12:
           36|
           37|   strict = derivationStrict drvAttrs;
             |            ^
           38|

       … while evaluating the option `nodes.controller1.networking.interfaces':

       … while evaluating definitions from `/nix/store/dqn2ddd6vpxbgx2jzparmg93hly0x1mj-source/nixos/modules/hardware/facter/networking':

       … while evaluating the option `nodes.controller1.hardware.facter.enable':

       … while evaluating the option `nodes.controller1.hardware.facter.report':

       … while evaluating the option `nodes.controller1.hardware.facter.reportPath':

       … while evaluating definitions from `/nix/store/11yjkn22440chz70j833a2krkf96anz1-source/nixosModules/clanCore/nixos-facter.nix':

       (stack trace truncated; use '--show-trace' to show the full, detailed trace)

       error: build of '/nix/store/bqv8zsy58v6f6jyz0lmdjxq33jvbjfwi-merged-test-dir-wireguard.drv^out' failed: error: dependency 'pa5slki1wyssvp1x8ra66lp35n9djp09-test-vars-generated.drv' failed
failed checks.x86_64-linux.yggdrasil 5s
setup: /nix/store/llsvyjp1d86nh4jr6yprl2x1lxahzyzc-zlib-ng-2.3.3 /nix/store/7zbzvm0bwa2mh5dp3p5gasix417lysxc-zstd-1.5.7 /nix/store/z8fp2l0b1k64swd0dxpych4 …
setup:
  /nix/store/llsvyjp1d86nh4jr6yprl2x1lxahzyzc-zlib-ng-2.3.3
  /nix/store/7zbzvm0bwa2mh5dp3p5gasix417lysxc-zstd-1.5.7
  /nix/store/z8fp2l0b1k64swd0dxpych445wpfcgb0-zstd-1.5.7-bin
  /nix/store/4d2k230fhyxb8qab8amyk011m7pmpcrz-zstd-1.5.7-man
  /nix/store/8b9cf419x8n6kjfgx8kriwn3k387j52a-zt-local.conf
  /nix/store/gfw448n3nm7pf27nvgisnyivfw6bbgsp-zt-local.conf
warning: ignoring the client-specified setting 'store', because it is a restricted setting and you are not a trusted user
error: gRPC QueryValidPaths on 'nix-store.geninf.io:50051' failed: error: niks3 push: uploading objects: uploading NAR nar/1jzmx83y6wqdgappa8zw8pnwiwrn90psy6vmrschw2wcnxz4qq67.nar.zst: uploading NAR nar/1jzmx83y6wqdgappa8zw8pnwiwrn90psy6vmrschw2wcnxz4qq67.nar.zst: server returned 500: 
failed checks.x86_64-linux.zerotier 18s
setup: /nix/store/xvpdcmxbccnavnw2dciidp0zrknzr1db-zlib-1.3.2-static /nix/store/llsvyjp1d86nh4jr6yprl2x1lxahzyzc-zlib-ng-2.3.3 /nix/store/7zbzvm0bwa2mh5dp …
setup:
  /nix/store/xvpdcmxbccnavnw2dciidp0zrknzr1db-zlib-1.3.2-static
  /nix/store/llsvyjp1d86nh4jr6yprl2x1lxahzyzc-zlib-ng-2.3.3
  /nix/store/7zbzvm0bwa2mh5dp3p5gasix417lysxc-zstd-1.5.7
  /nix/store/z8fp2l0b1k64swd0dxpych445wpfcgb0-zstd-1.5.7-bin
  /nix/store/4d2k230fhyxb8qab8amyk011m7pmpcrz-zstd-1.5.7-man
  /nix/store/gfw448n3nm7pf27nvgisnyivfw6bbgsp-zt-local.conf
warning: ignoring the client-specified setting 'store', because it is a restricted setting and you are not a trusted user
error: gRPC QueryValidPaths on 'nix-store.geninf.io:50051' failed: error: niks3 push: uploading objects: uploading NAR nar/0qmrbzrb6wdc2vd3ac5dk9zps78lf9pksbvbw5v8q84p6b3fmcwc.nar.zst: uploading NAR nar/0qmrbzrb6wdc2vd3ac5dk9zps78lf9pksbvbw5v8q84p6b3fmcwc.nar.zst: server returned 500: 
failed checks.x86_64-linux.zerotier-multi-instance 4s
setup: don't know how to build these paths: /nix/store/3n33f36g6sq3g5d3wwpfkyhjin5dg9zn-vm-test-run-zerotier-multi-instance.drv warning: ignoring the client-s …
setup:
don't know how to build these paths:
  /nix/store/3n33f36g6sq3g5d3wwpfkyhjin5dg9zn-vm-test-run-zerotier-multi-instance.drv
warning: ignoring the client-specified setting 'store', because it is a restricted setting and you are not a trusted user
error: gRPC QueryValidPaths on 'nix-store.geninf.io:50051' failed: error: niks3 push: uploading objects: uploading build log log/vms9scp713fp8cjdfv0b90msxb8crd83-command-not-found.drv: server returned 500: 
18 already built
skipped attributes
status attribute duration
loading…