clan/data-mesher build #85 failed ← #84 #86 →
eval warnings
1 kind
· 18 occurrences
- warn unable to download 'https://cache.clan.lol/…': HTTP error 503 ×18
9 failed
| status | attribute | duration |
|---|---|---|
checks.aarch64-linux.nixos-data-mesher-basic
|
15m 11s | |
setup: 8xryxphianvd9c5bnzmbvnfqql99f5cc-system-units.drv: build01: build01: input not substitutable: error: some references of path '/nix/store/qkmi23i114jchc9g …setup: 8xryxphianvd9c5bnzmbvnfqql99f5cc-system-units.drv: build01: build01: input not substitutable: error: some references of path '/nix/store/qkmi23i114jchc9gqxdqwnysghxbgqp2-unit-data-mesher.service' could not be realised, asking the scheduler again jh89k57viq2arklz3h8569p5wipwzv3x-system-units.drv: build01: build01: input not substitutable: error: some references of path '/nix/store/qkmi23i114jchc9gqxdqwnysghxbgqp2-unit-data-mesher.service' could not be realised, asking the scheduler again 8xryxphianvd9c5bnzmbvnfqql99f5cc-system-units.drv: build01: build01: input not substitutable: error: some references of path '/nix/store/qkmi23i114jchc9gqxdqwnysghxbgqp2-unit-data-mesher.service' could not be realised, asking the scheduler again jh89k57viq2arklz3h8569p5wipwzv3x-system-units.drv: build01: build01: input not substitutable: error: some references of path '/nix/store/qkmi23i114jchc9gqxdqwnysghxbgqp2-unit-data-mesher.service' could not be realised, asking the scheduler again 8xryxphianvd9c5bnzmbvnfqql99f5cc-system-units.drv: build01: build01: input not substitutable: error: some references of path '/nix/store/qkmi23i114jchc9gqxdqwnysghxbgqp2-unit-data-mesher.service' could not be realised, asking the scheduler again jh89k57viq2arklz3h8569p5wipwzv3x-system-units.drv: build01: build01: input not substitutable: error: some references of path '/nix/store/qkmi23i114jchc9gqxdqwnysghxbgqp2-unit-data-mesher.service' could not be realised, asking the scheduler again 8xryxphianvd9c5bnzmbvnfqql99f5cc-system-units.drv: build01: build01: input not substitutable: error: some references of path '/nix/store/qkmi23i114jchc9gqxdqwnysghxbgqp2-unit-data-mesher.service' could not be realised, asking the scheduler again error: dependency 'jfs61sm8f5nk51zpdjsiz0h28il6a8ah-nixos-test-driver-data-mesher-basic.drv' failed |
||
checks.aarch64-linux.nixos-data-mesher-multi-network
|
11m 47s | |
setup: /nix/store/41w8fh9nwrn32vxzwdkm7d06n45n1im7-vm-test-run-data-mesher-multi-network.drv warning: ignoring the client-specified setting 'store', because i …setup: /nix/store/41w8fh9nwrn32vxzwdkm7d06n45n1im7-vm-test-run-data-mesher-multi-network.drv warning: ignoring the client-specified setting 'store', because it is a restricted setting and you are not a trusted user l1yf22n143nq39fl1z70pc44hj0incw3-dm.toml.drv: error: gRPC AddMultipleToStore on 'nix-store.geninf.io:50051' failed: error: path '/nix/store/f8294l9lwnwrvw3m5iv1nv9xbgxc8yag-bob.pub' is required, but there is no substituter that can build it zazw3j8llrs9wzlfpdi3knxfkmkx66nc-test-script.drv: error: gRPC AddMultipleToStore on 'nix-store.geninf.io:50051' failed: error: path '/nix/store/1yl548848pjjgg0x72dakis31zrhcmp2-network.pub' is required, but there is no substituter that can build it nz3rrww7kyf33nrp8dks69rpvb6rcsjy-dm.toml.drv: error: gRPC AddMultipleToStore on 'nix-store.geninf.io:50051' failed: error: path '/nix/store/ddd249sjjbahq84r5xxkprkfrfi7kafd-alice.pub' is required, but there is no substituter that can build it 4nj577pdz5ai4fm8g9r5z4lpgjz7f447-dm.toml.drv: error: gRPC AddMultipleToStore on 'nix-store.geninf.io:50051' failed: error: path '/nix/store/ddd249sjjbahq84r5xxkprkfrfi7kafd-alice.pub' is required, but there is no substituter that can build it 3yga54z7sb02lh5137hpy4crmzhssh7k-system-path.drv: build01: not scheduled here: 3yga54z7sb02lh5137hpy4crmzhssh7k-system-path.drv, asking the scheduler again error: dependency '1jvd9h2n67z8k99hh69hra4zqqcpy4wx-nixos-test-driver-data-mesher-multi-network.drv' failed |
||
checks.aarch64-linux.pkg-data-mesher-test-golangci-lint
|
5m 14s | |
data-mesher-0.1.0: attached to the build already running on this workerdata-mesher-0.1.0: attached to the build already running on this worker |
||
checks.aarch64-linux.pkg-default-test-golangci-lint
|
5m 14s | |
data-mesher-0.1.0: }) pkg/model/signature.go:16:25: directive `//nolint:recvcheck` is unused for linter "recvcheck" (nolintlint) type SignatureType byte //noli …data-mesher-0.1.0: }) pkg/model/signature.go:16:25: directive `//nolint:recvcheck` is unused for linter "recvcheck" (nolintlint) type SignatureType byte //nolint:recvcheck ^ 52 issues: * exhaustruct_v5: 50 * gosec: 1 * nolintlint: 1 |
||
checks.x86_64-linux.nixos-data-mesher-basic
|
11m 46s | |
setup: 2l5wqz9633ia92q0h8krx3zviw0gwb31-system-units.drv: gi-build-x86-02: gi-build-x86-02: input not substitutable: error: path '/nix/store/0rsl0fhb7ziiwz5f2n2 …setup: 2l5wqz9633ia92q0h8krx3zviw0gwb31-system-units.drv: gi-build-x86-02: gi-build-x86-02: input not substitutable: error: path '/nix/store/0rsl0fhb7ziiwz5f2n2kha97svz6zcbq-unit-data-mesher.service' is required, but there is no substituter that can build it, asking the scheduler again 2l5wqz9633ia92q0h8krx3zviw0gwb31-system-units.drv: gi-build-x86-02: gi-build-x86-02: input not substitutable: error: path '/nix/store/0rsl0fhb7ziiwz5f2n2kha97svz6zcbq-unit-data-mesher.service' is required, but there is no substituter that can build it, asking the scheduler again 2l5wqz9633ia92q0h8krx3zviw0gwb31-system-units.drv: gi-build-x86-02: gi-build-x86-02: input not substitutable: error: path '/nix/store/0rsl0fhb7ziiwz5f2n2kha97svz6zcbq-unit-data-mesher.service' is required, but there is no substituter that can build it, asking the scheduler again ansj3h7lsld6j1gbz2nbw1r8sia9y577-system-units.drv: build-x86-01: build-x86-01: input not substitutable: error: path '/nix/store/7rbkci10xd9h8n58i2slalj37yq8c13b-unit-test-plugin.service' is required, but there is no substituter that can build it, asking the scheduler again 2l5wqz9633ia92q0h8krx3zviw0gwb31-system-units.drv: gi-build-x86-02: gi-build-x86-02: input not substitutable: error: path '/nix/store/0rsl0fhb7ziiwz5f2n2kha97svz6zcbq-unit-data-mesher.service' is required, but there is no substituter that can build it, asking the scheduler again ansj3h7lsld6j1gbz2nbw1r8sia9y577-system-units.drv: build-x86-01: build-x86-01: input not substitutable: error: path '/nix/store/7rbkci10xd9h8n58i2slalj37yq8c13b-unit-test-plugin.service' is required, but there is no substituter that can build it, asking the scheduler again ansj3h7lsld6j1gbz2nbw1r8sia9y577-system-units.drv: build-x86-01: build-x86-01: input not substitutable: error: path '/nix/store/7rbkci10xd9h8n58i2slalj37yq8c13b-unit-test-plugin.service' is required, but there is no substituter that can build it, asking the scheduler again error: dependency 'hw425j8lfmaq23sjrbf6qf7mkrmz1j5y-nixos-test-driver-data-mesher-basic.drv' failed |
||
checks.x86_64-linux.nixos-data-mesher-multi-network
|
19m 42s | |
setup: don't know how to build these paths: /nix/store/89vz7fh335avnrqfshk7dqca3naafpw3-vm-test-run-data-mesher-multi-network.drv warning: ignoring the client …setup: don't know how to build these paths: /nix/store/89vz7fh335avnrqfshk7dqca3naafpw3-vm-test-run-data-mesher-multi-network.drv warning: ignoring the client-specified setting 'store', because it is a restricted setting and you are not a trusted user kzyhv4gdn0ayl03zxh44j3dl0jzdi6x4-activate.drv: error: gRPC AddMultipleToStore on 'nix-store.geninf.io:50051' failed: error: path '/nix/store/7m1qkx4wpp1vfi8wbnzn1lvm2hqxzvl8-a2.cert' is required, but there is no substituter that can build it a1aayl7qri6zh310my1s3n9fpsplyxfq-activate.drv: error: gRPC AddMultipleToStore on 'nix-store.geninf.io:50051' failed: error: path '/nix/store/14b2zachr08l0h6h1z76fyymgh5k4qm0-a1.cert' is required, but there is no substituter that can build it b03nnpas9agk6ak59vm8m1w6ng6r0dsz-activate.drv: error: gRPC AddMultipleToStore on 'nix-store.geninf.io:50051' failed: error: path '/nix/store/qfk11gigx2b2a71aqximf34kwcpcbcl0-c2.cert' is required, but there is no substituter that can build it error: dependency 'g0aj71haw9w90glfs2vracsmcink0lf0-nixos-test-driver-data-mesher-multi-network.drv' failed |
||
checks.x86_64-linux.pkg-data-mesher-test-golangci-lint
|
6m 23s | |
data-mesher-0.1.0: }) pkg/model/signature.go:16:25: directive `//nolint:recvcheck` is unused for linter "recvcheck" (nolintlint) type SignatureType byte //noli …data-mesher-0.1.0: }) pkg/model/signature.go:16:25: directive `//nolint:recvcheck` is unused for linter "recvcheck" (nolintlint) type SignatureType byte //nolint:recvcheck ^ 52 issues: * exhaustruct_v5: 50 * gosec: 1 * nolintlint: 1 |
||
checks.x86_64-linux.pkg-default-test-golangci-lint
|
7m 20s | |
data-mesher-0.1.0: }) pkg/model/signature.go:16:25: directive `//nolint:recvcheck` is unused for linter "recvcheck" (nolintlint) type SignatureType byte //noli …data-mesher-0.1.0: }) pkg/model/signature.go:16:25: directive `//nolint:recvcheck` is unused for linter "recvcheck" (nolintlint) type SignatureType byte //nolint:recvcheck ^ 52 issues: * exhaustruct_v5: 50 * gosec: 1 * nolintlint: 1 |
||
checks.x86_64-linux.treefmt
|
5m 46s | |
setup: /nix/store/xvp6nfxayb07si2jaggqwvx3iykw89g2-rustc-1.98.1 /nix/store/vy0xilifxb02fwal0wihsrwc8s69rlyk-rustc-wrapper-1.98.1 /nix/store/jpcqlbhkwxwvq5 …setup: /nix/store/xvp6nfxayb07si2jaggqwvx3iykw89g2-rustc-1.98.1 /nix/store/vy0xilifxb02fwal0wihsrwc8s69rlyk-rustc-wrapper-1.98.1 /nix/store/jpcqlbhkwxwvq507mq0hkacpxbxcdwjj-rustfmt-1.98.1 /nix/store/h4wvy56dvdkqcw0zmjpvn0r6niyf5972-shfmt-3.14.1 /nix/store/p815nz0hpyn74gg4xc94v613z1jwp5yz-sizelint.toml /nix/store/iilkgn9cr0qbz2hfypz7i3lq3bx748a6-treefmt.toml warning: ignoring the client-specified setting 'store', because it is a restricted setting and you are not a trusted user error: gRPC QueryValidPaths on 'nix-store.geninf.io:50051' failed: error: substituter 'https://cache.clan.lol' is disabled |
||
2 succeeded
| status | attribute | duration |
|---|---|---|
| loading… | ||