clan/data-mesher build #86 failed ← #85 #87 →
eval warnings
4 kinds
· 102 occurrences
- error unable to download 'https://cache.clan.lol/…': HTTP error 503 ×2
- error unable to download 'https://cache.geninf.io/…': HTTP error 503 ×9
- warn unable to download 'https://cache.clan.lol/…': HTTP error 503 ×14
- warn unable to download 'https://cache.geninf.io/…': HTTP error 503 ×77
9 failed
| status | attribute | duration |
|---|---|---|
checks.aarch64-linux.nixos-data-mesher-basic
|
17m 49s | |
setup: don't know how to build these paths: /nix/store/f33mlap8asj7ywvg49mpxh02gf1vymv7-vm-test-run-data-mesher-basic.drv warning: ignoring the client-specifi …setup: don't know how to build these paths: /nix/store/f33mlap8asj7ywvg49mpxh02gf1vymv7-vm-test-run-data-mesher-basic.drv warning: ignoring the client-specified setting 'store', because it is a restricted setting and you are not a trusted user n1lgvfxfixv7kwr2c1vwa97k2nn44v6f-activate.drv: error: gRPC AddMultipleToStore on 'nix-store.geninf.io:50051' failed: error: path '/nix/store/7m1qkx4wpp1vfi8wbnzn1lvm2hqxzvl8-a2.cert' is required, but there is no substituter that can build it jcnxqax653gnxvb192hll42cvhk6b3iq-activate.drv: error: gRPC AddMultipleToStore on 'nix-store.geninf.io:50051' failed: error: path '/nix/store/14b2zachr08l0h6h1z76fyymgh5k4qm0-a1.cert' is required, but there is no substituter that can build it error: dependency 'jfs61sm8f5nk51zpdjsiz0h28il6a8ah-nixos-test-driver-data-mesher-basic.drv' failed |
||
checks.aarch64-linux.nixos-data-mesher-multi-network
|
19m 51s | |
setup: c0jlmma4xrlhvfbq1v9g9480xmgwn8mp-system-units.drv: build01: build01: input not substitutable: error: some references of path '/nix/store/ysphhphsq7sv1vyq …setup: c0jlmma4xrlhvfbq1v9g9480xmgwn8mp-system-units.drv: build01: build01: input not substitutable: error: some references of path '/nix/store/ysphhphsq7sv1vyqmkx5krlph8i0fg4x-unit-data-mesher.service' could not be realised, asking the scheduler again yjyg9ylf1pw3d1kgy1m1qlb22a4zbww0-system-units.drv: build01: build01: input not substitutable: error: some references of path '/nix/store/ysphhphsq7sv1vyqmkx5krlph8i0fg4x-unit-data-mesher.service' could not be realised, asking the scheduler again ps0hkgjpk3xngxxmkpsm4ggy4lglfzm6-system-units.drv: build01: build01: input not substitutable: error: some references of path '/nix/store/ysphhphsq7sv1vyqmkx5krlph8i0fg4x-unit-data-mesher.service' could not be realised, asking the scheduler again c0jlmma4xrlhvfbq1v9g9480xmgwn8mp-system-units.drv: build01: build01: input not substitutable: error: some references of path '/nix/store/ysphhphsq7sv1vyqmkx5krlph8i0fg4x-unit-data-mesher.service' could not be realised, asking the scheduler again yjyg9ylf1pw3d1kgy1m1qlb22a4zbww0-system-units.drv: build01: build01: input not substitutable: error: some references of path '/nix/store/ysphhphsq7sv1vyqmkx5krlph8i0fg4x-unit-data-mesher.service' could not be realised, asking the scheduler again ps0hkgjpk3xngxxmkpsm4ggy4lglfzm6-system-units.drv: build01: build01: input not substitutable: error: some references of path '/nix/store/ysphhphsq7sv1vyqmkx5krlph8i0fg4x-unit-data-mesher.service' could not be realised, asking the scheduler again c0jlmma4xrlhvfbq1v9g9480xmgwn8mp-system-units.drv: build01: build01: input not substitutable: error: some references of path '/nix/store/ysphhphsq7sv1vyqmkx5krlph8i0fg4x-unit-data-mesher.service' could not be realised, asking the scheduler again error: dependency '1jvd9h2n67z8k99hh69hra4zqqcpy4wx-nixos-test-driver-data-mesher-multi-network.drv' failed |
||
checks.aarch64-linux.pkg-data-mesher-test-golangci-lint
|
6m 13s | |
data-mesher-0.1.0: }) pkg/model/signature.go:16:25: directive `//nolint:recvcheck` is unused for linter "recvcheck" (nolintlint) type SignatureType byte //noli …data-mesher-0.1.0: }) pkg/model/signature.go:16:25: directive `//nolint:recvcheck` is unused for linter "recvcheck" (nolintlint) type SignatureType byte //nolint:recvcheck ^ 52 issues: * exhaustruct_v5: 50 * gosec: 1 * nolintlint: 1 |
||
checks.aarch64-linux.pkg-default-test-golangci-lint
|
37s | |
setup: these 5 paths will be fetched (16.7 MiB download, 301.3 MiB unpacked): /nix/store/lpirbq44rps4yhs5fs4knrr7agl31b68-data-mesher-0.1.0-go-modules /nix/ …setup: these 5 paths will be fetched (16.7 MiB download, 301.3 MiB unpacked): /nix/store/lpirbq44rps4yhs5fs4knrr7agl31b68-data-mesher-0.1.0-go-modules /nix/store/j1kfmcbd7mr5ypfwidxgfzn7gk7pf81q-die-hook /nix/store/2bvkkxxp66zj839qmi7lp4f5l915asjd-go-1.26.7 /nix/store/y2an7133w5r04086j4jl1niwsr67rx48-golangci-lint-2.13.2 /nix/store/9b8nc9hpaclfbysaljkhbyq400r53cyl-make-shell-wrapper-hook warning: ignoring the client-specified setting 'store', because it is a restricted setting and you are not a trusted user error: gRPC QueryValidPaths on 'nix-store.geninf.io:50051' failed: error: substituter 'https://cache.clan.lol' is disabled |
||
checks.x86_64-linux.nixos-data-mesher-basic
|
4m 57s | |
setup: don't know how to build these paths: /nix/store/ivv4s4i8w80jm10cq51fhw97922d6ixn-vm-test-run-data-mesher-basic.drv warning: ignoring the client-specifi …setup: don't know how to build these paths: /nix/store/ivv4s4i8w80jm10cq51fhw97922d6ixn-vm-test-run-data-mesher-basic.drv warning: ignoring the client-specified setting 'store', because it is a restricted setting and you are not a trusted user error: gRPC QueryValidPaths on 'nix-store.geninf.io:50051' failed: error: unable to download 'https://cache.clan.lol/p3k48baxg1kj15p7hdfvxaf0ijc6zjph.narinfo': HTTP error 503 response body: <?xml version="1.0" encoding="UTF-8" standalone="yes"?> <Error> <Code>SlowDown</Code> <Message>Your account has made too many requests; try again later.</Message> </Error> |
||
checks.x86_64-linux.nixos-data-mesher-multi-network
|
1m 54s | |
setup: don't know how to build these paths: /nix/store/89vz7fh335avnrqfshk7dqca3naafpw3-vm-test-run-data-mesher-multi-network.drv warning: ignoring the client …setup: don't know how to build these paths: /nix/store/89vz7fh335avnrqfshk7dqca3naafpw3-vm-test-run-data-mesher-multi-network.drv warning: ignoring the client-specified setting 'store', because it is a restricted setting and you are not a trusted user error: gRPC QueryValidPaths on 'nix-store.geninf.io:50051' failed: error: unable to download 'https://cache.geninf.io/b9lvsp1qawfr8klns49lrmz02zkh8gnb.narinfo': HTTP error 503 response body: <?xml version="1.0" encoding="UTF-8" standalone="yes"?> <Error> <Code>SlowDown</Code> <Message>Your account has made too many requests; try again later.</Message> </Error> |
||
checks.x86_64-linux.pkg-data-mesher-test-golangci-lint
|
7m 13s | |
data-mesher-0.1.0: }) pkg/model/signature.go:16:25: directive `//nolint:recvcheck` is unused for linter "recvcheck" (nolintlint) type SignatureType byte //noli …data-mesher-0.1.0: }) pkg/model/signature.go:16:25: directive `//nolint:recvcheck` is unused for linter "recvcheck" (nolintlint) type SignatureType byte //nolint:recvcheck ^ 52 issues: * exhaustruct_v5: 50 * gosec: 1 * nolintlint: 1 |
||
checks.x86_64-linux.pkg-default-test-golangci-lint
|
58s | |
setup: this derivation will be built: /nix/store/85wi3a01pk6frc99mh6y65vh6rx111na-data-mesher-0.1.0.drv this path will be fetched (0.0 KiB download, 42.5 MiB …setup: this derivation will be built: /nix/store/85wi3a01pk6frc99mh6y65vh6rx111na-data-mesher-0.1.0.drv this path will be fetched (0.0 KiB download, 42.5 MiB unpacked): /nix/store/lpirbq44rps4yhs5fs4knrr7agl31b68-data-mesher-0.1.0-go-modules warning: ignoring the client-specified setting 'store', because it is a restricted setting and you are not a trusted user error: gRPC QueryValidPaths on 'nix-store.geninf.io:50051' failed: error: substituter 'https://cache.clan.lol' is disabled |
||
checks.x86_64-linux.treefmt
|
7m 32s | |
setup: don't know how to build these paths: /nix/store/gkwv3lkx4lmv4v96a294ii3x7rg3fzk1-treefmt-check.drv warning: ignoring the client-specified setting 'stor …setup: don't know how to build these paths: /nix/store/gkwv3lkx4lmv4v96a294ii3x7rg3fzk1-treefmt-check.drv warning: ignoring the client-specified setting 'store', because it is a restricted setting and you are not a trusted user 395fl4qvq94ayyz130jw0kpsynqsak9m-sizelint.toml.drv: error: gRPC QueryValidPaths on 'nix-store.geninf.io:50051' failed: error: unable to download 'https://cache.clan.lol/395fl4qvq94ayyz130jw0kpsynqsak9m.narinfo': HTTP error 503 response body: <?xml version="1.0" encoding="UTF-8" standalone="yes"?> <Error> <Code>SlowDown</Code> <Message>Your account has made too many requests; try again later.</Message> </Error> a7qsz7c6hcpzfcb5pcma5rrpmb06h295-mdformat-wrapped.drv: web01: not scheduled here: a7qsz7c6hcpzfcb5pcma5rrpmb06h295-mdformat-wrapped.drv, asking the scheduler again a7qsz7c6hcpzfcb5pcma5rrpmb06h295-mdformat-wrapped.drv: gi-build-x86-02: not scheduled here: a7qsz7c6hcpzfcb5pcma5rrpmb06h295-mdformat-wrapped.drv, asking the scheduler again a7qsz7c6hcpzfcb5pcma5rrpmb06h295-mdformat-wrapped.drv: build-x86-01: not scheduled here: a7qsz7c6hcpzfcb5pcma5rrpmb06h295-mdformat-wrapped.drv, asking the scheduler again error: dependency 'mc4cjrd95mjkfdpgmj53qavdqzjf7lkw-treefmt.drv' failed |
||
2 succeeded
| status | attribute | duration |
|---|---|---|
| loading… | ||