nixbot

builds

clan/data-mesher build #87 failed

branch main · PR #487 · commit c0401adf8f · · took 3h 27m · eval 15s

9 failed
failed attributes
status attribute duration
failed checks.aarch64-linux.nixos-data-mesher-basic 29m 12s
setup: /nix/store/9xhvy78xv8bmvxwkgjv10si1zv7ffc9l-which-2.25-man /nix/store/9cnwdc51ff894bzrkac3hasqdakspc7c-xwininfo-1.1.6 /nix/store/kg9i257hmpaaj6kdgp …
setup:
  /nix/store/9xhvy78xv8bmvxwkgjv10si1zv7ffc9l-which-2.25-man
  /nix/store/9cnwdc51ff894bzrkac3hasqdakspc7c-xwininfo-1.1.6
  /nix/store/kg9i257hmpaaj6kdgpklpvv6vqjqgr3y-xz-5.8.3-doc
  /nix/store/jk3rbxlh3yl1w2wn0z7pmx0srmk7h7lk-xz-5.8.3-man
  /nix/store/fg5m3drc2ppr9y2nhrk0w07rhqyh7j5j-zstd-1.5.7-man
warning: ignoring the client-specified setting 'store', because it is a restricted setting and you are not a trusted user
ybkxa3j5hm3qq4143m724yq76arbhl3y-test-script.drv: error: gRPC AddMultipleToStore on 'nix-store.geninf.io:50051' failed: error: path '/nix/store/0bbbii0aib4xr4bzwj4q6gmwz0krsa7p-network.key' is required, but there is no substituter that can build it
error: dependency 'jfs61sm8f5nk51zpdjsiz0h28il6a8ah-nixos-test-driver-data-mesher-basic.drv' failed
failed checks.aarch64-linux.nixos-data-mesher-multi-network 34m 40s
setup: /nix/store/9xhvy78xv8bmvxwkgjv10si1zv7ffc9l-which-2.25-man /nix/store/9cnwdc51ff894bzrkac3hasqdakspc7c-xwininfo-1.1.6 /nix/store/kg9i257hmpaaj6kdgp …
setup:
  /nix/store/9xhvy78xv8bmvxwkgjv10si1zv7ffc9l-which-2.25-man
  /nix/store/9cnwdc51ff894bzrkac3hasqdakspc7c-xwininfo-1.1.6
  /nix/store/kg9i257hmpaaj6kdgpklpvv6vqjqgr3y-xz-5.8.3-doc
  /nix/store/jk3rbxlh3yl1w2wn0z7pmx0srmk7h7lk-xz-5.8.3-man
  /nix/store/fg5m3drc2ppr9y2nhrk0w07rhqyh7j5j-zstd-1.5.7-man
warning: ignoring the client-specified setting 'store', because it is a restricted setting and you are not a trusted user
qpjlx5sd561ccjx9npnyp07vys0q3gq4-activate.drv: error: gRPC AddMultipleToStore on 'nix-store.geninf.io:50051' failed: error: path '/nix/store/qfk11gigx2b2a71aqximf34kwcpcbcl0-c2.cert' is required, but there is no substituter that can build it
error: dependency '1jvd9h2n67z8k99hh69hra4zqqcpy4wx-nixos-test-driver-data-mesher-multi-network.drv' failed
failed checks.aarch64-linux.pkg-data-mesher-test-golangci-lint 2h 46m
setup: these 5 paths will be fetched (16.7 MiB download, 301.3 MiB unpacked): /nix/store/lpirbq44rps4yhs5fs4knrr7agl31b68-data-mesher-0.1.0-go-modules /nix/ …
setup:
these 5 paths will be fetched (16.7 MiB download, 301.3 MiB unpacked):
  /nix/store/lpirbq44rps4yhs5fs4knrr7agl31b68-data-mesher-0.1.0-go-modules
  /nix/store/j1kfmcbd7mr5ypfwidxgfzn7gk7pf81q-die-hook
  /nix/store/2bvkkxxp66zj839qmi7lp4f5l915asjd-go-1.26.7
  /nix/store/y2an7133w5r04086j4jl1niwsr67rx48-golangci-lint-2.13.2
  /nix/store/9b8nc9hpaclfbysaljkhbyq400r53cyl-make-shell-wrapper-hook
warning: ignoring the client-specified setting 'store', because it is a restricted setting and you are not a trusted user
error: gRPC QueryValidPaths on 'nix-store.geninf.io:50051' failed: error: substituter 'https://cache.clan.lol' is disabled
failed checks.aarch64-linux.pkg-default-test-golangci-lint 27s
data-mesher-0.1.0: }) pkg/model/signature.go:16:25: directive `//nolint:recvcheck` is unused for linter "recvcheck" (nolintlint) type SignatureType byte //noli …
data-mesher-0.1.0:
	})
pkg/model/signature.go:16:25: directive `//nolint:recvcheck` is unused for linter "recvcheck" (nolintlint)
type SignatureType byte //nolint:recvcheck
                        ^
52 issues:
* exhaustruct_v5: 50
* gosec: 1
* nolintlint: 1
failed checks.x86_64-linux.nixos-data-mesher-basic 28m 52s
setup: 94jj8m1flrncvd7g8pmmrflj8m380i7h-system-units.drv: build-x86-01: build-x86-01: input not substitutable: error: path '/nix/store/7rbkci10xd9h8n58i2slalj37 …
setup:
94jj8m1flrncvd7g8pmmrflj8m380i7h-system-units.drv: build-x86-01: build-x86-01: input not substitutable: error: path '/nix/store/7rbkci10xd9h8n58i2slalj37yq8c13b-unit-test-plugin.service' is required, but there is no substituter that can build it, asking the scheduler again
ansj3h7lsld6j1gbz2nbw1r8sia9y577-system-units.drv: gi-build-x86-02: gi-build-x86-02: input not substitutable: error: path '/nix/store/7rbkci10xd9h8n58i2slalj37yq8c13b-unit-test-plugin.service' is required, but there is no substituter that can build it, asking the scheduler again
ansj3h7lsld6j1gbz2nbw1r8sia9y577-system-units.drv: gi-build-x86-02: gi-build-x86-02: input not substitutable: error: path '/nix/store/7rbkci10xd9h8n58i2slalj37yq8c13b-unit-test-plugin.service' is required, but there is no substituter that can build it, asking the scheduler again
ansj3h7lsld6j1gbz2nbw1r8sia9y577-system-units.drv: gi-build-x86-02: gi-build-x86-02: input not substitutable: error: path '/nix/store/7rbkci10xd9h8n58i2slalj37yq8c13b-unit-test-plugin.service' is required, but there is no substituter that can build it, asking the scheduler again
ansj3h7lsld6j1gbz2nbw1r8sia9y577-system-units.drv: gi-build-x86-02: gi-build-x86-02: input not substitutable: error: path '/nix/store/7rbkci10xd9h8n58i2slalj37yq8c13b-unit-test-plugin.service' is required, but there is no substituter that can build it, asking the scheduler again
ansj3h7lsld6j1gbz2nbw1r8sia9y577-system-units.drv: build-x86-01: build-x86-01: input not substitutable: error: path '/nix/store/7rbkci10xd9h8n58i2slalj37yq8c13b-unit-test-plugin.service' is required, but there is no substituter that can build it, asking the scheduler again
ansj3h7lsld6j1gbz2nbw1r8sia9y577-system-units.drv: gi-build-x86-02: gi-build-x86-02: input not substitutable: error: path '/nix/store/7rbkci10xd9h8n58i2slalj37yq8c13b-unit-test-plugin.service' is required, but there is no substituter that can build it, asking the scheduler again
error: dependency 'hw425j8lfmaq23sjrbf6qf7mkrmz1j5y-nixos-test-driver-data-mesher-basic.drv' failed
failed checks.x86_64-linux.nixos-data-mesher-multi-network 16m 7s
setup: don't know how to build these paths: /nix/store/89vz7fh335avnrqfshk7dqca3naafpw3-vm-test-run-data-mesher-multi-network.drv warning: ignoring the client …
setup:
don't know how to build these paths:
  /nix/store/89vz7fh335avnrqfshk7dqca3naafpw3-vm-test-run-data-mesher-multi-network.drv
warning: ignoring the client-specified setting 'store', because it is a restricted setting and you are not a trusted user
1xigy1q6ipdrbd8qy9ymmvlzvanf9z38-nixos-vm.drv: gi-build-x86-02: not scheduled here: 1xigy1q6ipdrbd8qy9ymmvlzvanf9z38-nixos-vm.drv, asking the scheduler again
b03nnpas9agk6ak59vm8m1w6ng6r0dsz-activate.drv: error: gRPC QueryValidPaths on 'nix-store.geninf.io:50051' failed: error: unable to download 'https://cache.clan.lol/b03nnpas9agk6ak59vm8m1w6ng6r0dsz.narinfo': HTTP error 503

              response body:

              <?xml version="1.0" encoding="UTF-8" standalone="yes"?>
              <Error>
                  <Code>SlowDown</Code>
                  <Message>Your account has made too many requests; try again later.</Message>
              </Error>
error: dependency 'g0aj71haw9w90glfs2vracsmcink0lf0-nixos-test-driver-data-mesher-multi-network.drv' failed
failed checks.x86_64-linux.pkg-data-mesher-test-golangci-lint 10m 5s
setup: this derivation will be built: /nix/store/85wi3a01pk6frc99mh6y65vh6rx111na-data-mesher-0.1.0.drv this path will be fetched (0.0 KiB download, 42.5 MiB …
setup:
this derivation will be built:
  /nix/store/85wi3a01pk6frc99mh6y65vh6rx111na-data-mesher-0.1.0.drv
this path will be fetched (0.0 KiB download, 42.5 MiB unpacked):
  /nix/store/lpirbq44rps4yhs5fs4knrr7agl31b68-data-mesher-0.1.0-go-modules
warning: ignoring the client-specified setting 'store', because it is a restricted setting and you are not a trusted user
error: gRPC QueryValidPaths on 'nix-store.geninf.io:50051' failed: error: substituter 'https://cache.clan.lol' is disabled
failed checks.x86_64-linux.pkg-default-test-golangci-lint 11m 10s
data-mesher-0.1.0: }) pkg/model/signature.go:16:25: directive `//nolint:recvcheck` is unused for linter "recvcheck" (nolintlint) type SignatureType byte //noli …
data-mesher-0.1.0:
	})
pkg/model/signature.go:16:25: directive `//nolint:recvcheck` is unused for linter "recvcheck" (nolintlint)
type SignatureType byte //nolint:recvcheck
                        ^
52 issues:
* exhaustruct_v5: 50
* gosec: 1
* nolintlint: 1
failed checks.x86_64-linux.treefmt 9m 21s
setup: don't know how to build these paths: /nix/store/jm91jf6b8wgxbgb0ihsjinxnx1lcbkwg-treefmt-check.drv warning: ignoring the client-specified setting 'stor …
setup:
don't know how to build these paths:
  /nix/store/jm91jf6b8wgxbgb0ihsjinxnx1lcbkwg-treefmt-check.drv
warning: ignoring the client-specified setting 'store', because it is a restricted setting and you are not a trusted user
error: gRPC QueryValidPaths on 'nix-store.geninf.io:50051' failed: error: substituter 'https://cache.clan.lol' is disabled
2 succeeded
succeeded attributes
status attribute duration
loading…