nixbot

builds

Enzime/hyperconfig build #1144 failed

branch next · PR #1086 · commit 878e34b87c · · took 5m 16s · eval 37s

eval warnings 1 kind · 2 occurrences
  • warn A legacy Nextcloud install (from before NixOS 26.11) may be installed. ×2

11 failed
failed attributes
status attribute duration
failed checks.aarch64-darwin."home-manager-enzime@hyperion-macos" 2m 7s
setup: /nix/store/1yqcgzbny4k5p4b9irn5vw4vy8b5d5dh-zig-0.16.0 /nix/store/aa33ni9r31y6lmad4g83iyqj6hgmvkz6-zod-3.25.76.tgz warning: ignoring the client-speci …
setup:
  /nix/store/1yqcgzbny4k5p4b9irn5vw4vy8b5d5dh-zig-0.16.0
  /nix/store/aa33ni9r31y6lmad4g83iyqj6hgmvkz6-zod-3.25.76.tgz
warning: ignoring the client-specified setting 'store', because it is a restricted setting and you are not a trusted user
warning: 8px2bpildh2zq3m69v6v20f7jx29wqsz-source.drv: no connected, non-draining worker for system 'aarch64-darwin' offers features {}, the workers offer {}, waiting up to 120s for a worker
warning: ccml6pmnvv8y7a1ck8fzlfjdc0691aph-claude.drv: no connected, non-draining worker for system 'aarch64-darwin' offers features {}, the workers offer {}, waiting up to 120s for a worker
8px2bpildh2zq3m69v6v20f7jx29wqsz-source.drv: no connected, non-draining worker for system 'aarch64-darwin' offers features {}, the workers offer {}
ccml6pmnvv8y7a1ck8fzlfjdc0691aph-claude.drv: no connected, non-draining worker for system 'aarch64-darwin' offers features {}, the workers offer {}
error: dependency 'x2h3dqnkgi8yr69g8bkym8jra1rrbwvi-home-manager-path.drv' failed
failed checks.aarch64-darwin.nix-darwin-hyperion-macos 2m 11s
setup: 7y6y1vn24jbgjq36ikbqga4gdsdg4jdw-home-manager-applications.drv: no connected, non-draining worker for system 'aarch64-darwin' offers features {}, the wor …
setup:
7y6y1vn24jbgjq36ikbqga4gdsdg4jdw-home-manager-applications.drv: no connected, non-draining worker for system 'aarch64-darwin' offers features {}, the workers offer {}
8px2bpildh2zq3m69v6v20f7jx29wqsz-source.drv: no connected, non-draining worker for system 'aarch64-darwin' offers features {}, the workers offer {}
8y479gj19lfxymgk1nhkkds74yhng9j4-firefox-bin-unwrapped-157.0.1.drv: no connected, non-draining worker for system 'aarch64-darwin' offers features {}, the workers offer {}
bk1sl3fzx18y57wnp2fxspxg1n3q61vw-options.json.drv: no connected, non-draining worker for system 'aarch64-darwin' offers features {}, the workers offer {}
ccml6pmnvv8y7a1ck8fzlfjdc0691aph-claude.drv: no connected, non-draining worker for system 'aarch64-darwin' offers features {}, the workers offer {}
isl84g9ahgd84aiy9gi356a8qrfl797y-home-manager-fonts.drv: no connected, non-draining worker for system 'aarch64-darwin' offers features {}, the workers offer {}
n7fqyrp1c6lp3l05l0h621vs8063x73h-home-manager-path.drv: no connected, non-draining worker for system 'aarch64-darwin' offers features {}, the workers offer {}
error: dependency '1q0wcra5vxrdidk96w3iq1c8krf90y6r-darwin-version.json.drv' failed
failed checks.aarch64-darwin.package-gaia-vm 2m 6s
setup: don't know how to build these paths: /nix/store/k3vwsxjfp5wf6srr00zsqqx4c6b51x7q-run-gaia-vm-on-aarch64-darwin.drv warning: ignoring the client-specifi …
setup:
don't know how to build these paths:
  /nix/store/k3vwsxjfp5wf6srr00zsqqx4c6b51x7q-run-gaia-vm-on-aarch64-darwin.drv
warning: ignoring the client-specified setting 'store', because it is a restricted setting and you are not a trusted user
warning: k3vwsxjfp5wf6srr00zsqqx4c6b51x7q-run-gaia-vm-on-aarch64-darwin.drv: no connected, non-draining worker for system 'aarch64-darwin' offers features {}, the workers offer {}, waiting up to 120s for a worker
k3vwsxjfp5wf6srr00zsqqx4c6b51x7q-run-gaia-vm-on-aarch64-darwin.drv: no connected, non-draining worker for system 'aarch64-darwin' offers features {}, the workers offer {}
error: no connected, non-draining worker for system 'aarch64-darwin' offers features {}, the workers offer {}
failed checks.aarch64-darwin.package-phi-nixos-vm 2m 1s
setup: this derivation will be built: /nix/store/icvg428ndhbxvwpz5bz4zkglq6pfid6f-run-phi-nixos-vm-on-aarch64-darwin.drv warning: ignoring the client-specifie …
setup:
this derivation will be built:
  /nix/store/icvg428ndhbxvwpz5bz4zkglq6pfid6f-run-phi-nixos-vm-on-aarch64-darwin.drv
warning: ignoring the client-specified setting 'store', because it is a restricted setting and you are not a trusted user
warning: icvg428ndhbxvwpz5bz4zkglq6pfid6f-run-phi-nixos-vm-on-aarch64-darwin.drv: no connected, non-draining worker for system 'aarch64-darwin' offers features {}, the workers offer {}, waiting up to 120s for a worker
icvg428ndhbxvwpz5bz4zkglq6pfid6f-run-phi-nixos-vm-on-aarch64-darwin.drv: no connected, non-draining worker for system 'aarch64-darwin' offers features {}, the workers offer {}
error: no connected, non-draining worker for system 'aarch64-darwin' offers features {}, the workers offer {}
failed checks.aarch64-darwin.package-sigma-vm 2m 6s
setup: don't know how to build these paths: /nix/store/w52hn3p85s6n2w9l27ys94vijz0smnns-run-sigma-vm-on-aarch64-darwin.drv warning: ignoring the client-specif …
setup:
don't know how to build these paths:
  /nix/store/w52hn3p85s6n2w9l27ys94vijz0smnns-run-sigma-vm-on-aarch64-darwin.drv
warning: ignoring the client-specified setting 'store', because it is a restricted setting and you are not a trusted user
warning: w52hn3p85s6n2w9l27ys94vijz0smnns-run-sigma-vm-on-aarch64-darwin.drv: no connected, non-draining worker for system 'aarch64-darwin' offers features {}, the workers offer {}, waiting up to 120s for a worker
w52hn3p85s6n2w9l27ys94vijz0smnns-run-sigma-vm-on-aarch64-darwin.drv: no connected, non-draining worker for system 'aarch64-darwin' offers features {}, the workers offer {}
error: no connected, non-draining worker for system 'aarch64-darwin' offers features {}, the workers offer {}
failed checks.aarch64-darwin.treefmt 2m 3s
setup: /nix/store/925b3zxz1j0984ywkl3y35v0bbrda2k9-statix-0.5.8-unstable-2026-07-17 /nix/store/775mmr2czhrfc7p45i9rwp5imkb7wcvd-statix-config /nix/store/q …
setup:
  /nix/store/925b3zxz1j0984ywkl3y35v0bbrda2k9-statix-0.5.8-unstable-2026-07-17
  /nix/store/775mmr2czhrfc7p45i9rwp5imkb7wcvd-statix-config
  /nix/store/q3s56vfx8n9d3l5pp9jl7kq3ncpa0fw4-statix-fix
  /nix/store/m965417sqcxjj5dj6wmhd4a57a1nx6jk-treefmt.toml
warning: ignoring the client-specified setting 'store', because it is a restricted setting and you are not a trusted user
warning: wb6pb2jx311ba1i3yjc5c8iw7k41i3i4-treefmt-check.drv: no connected, non-draining worker for system 'aarch64-darwin' offers features {}, the workers offer {}, waiting up to 120s for a worker
wb6pb2jx311ba1i3yjc5c8iw7k41i3i4-treefmt-check.drv: no connected, non-draining worker for system 'aarch64-darwin' offers features {}, the workers offer {}
error: no connected, non-draining worker for system 'aarch64-darwin' offers features {}, the workers offer {}
failed checks.aarch64-linux.treefmt 4s
setup: /nix/store/dk6y51p9l3c0sgwvj494i1jq6rnfhzjp-python3.14-pyflakes-3.4.0 /nix/store/w9s5sw6pdlfwnpxh2s1jmbmlwligwwa2-statix-0.5.8-unstable-2026-07-17 …
setup:
  /nix/store/dk6y51p9l3c0sgwvj494i1jq6rnfhzjp-python3.14-pyflakes-3.4.0
  /nix/store/w9s5sw6pdlfwnpxh2s1jmbmlwligwwa2-statix-0.5.8-unstable-2026-07-17
  /nix/store/rdh9wsj7wvmrbrxmcbzajdk5sym7wlcf-statix-config
  /nix/store/wv2fcngsm61yczsh9ddaj9q9bi7wkzra-statix-fix
  /nix/store/i1b9pzkjf5v57dm6xs7a925c4kyia5rh-treefmt.toml
warning: ignoring the client-specified setting 'store', because it is a restricted setting and you are not a trusted user
53d5l41qyzpwa8zjjfm627dfmarm8x18-treefmt-check.drv: error: gRPC AddMultipleToStore on 'nix-store.geninf.io:50051' failed: error: some references of path '/nix/store/rnbix0f1rip6cc9h99h2p6rw436y0v0x-actionlint-1.7.12.drv' could not be realised
error: error: gRPC AddMultipleToStore on 'nix-store.geninf.io:50051' failed: error: some references of path '/nix/store/rnbix0f1rip6cc9h99h2p6rw436y0v0x-actionlint-1.7.12.drv' could not be realised
failed checks.x86_64-linux."home-manager-enzime@gaia" 8s
setup: /nix/store/c4bnviq2hqzz29vymvbmi3k6zcbnrrqf-search.json.mozlz4 /nix/store/6jbzrsrw2nmmnqkxsr5yck7m40s1q976-update-remote-plugins /nix/store/c61553h …
setup:
  /nix/store/c4bnviq2hqzz29vymvbmi3k6zcbnrrqf-search.json.mozlz4
  /nix/store/6jbzrsrw2nmmnqkxsr5yck7m40s1q976-update-remote-plugins
  /nix/store/c61553hzzqp4l3v0mjsmrbz35riw3b8g-vimplugin-lightline.vim-0-unstable-2026-10-04
  /nix/store/6pwyq2ahyvsbaxl85i4vqpdirszn71lm-vscode-user-settings
  /nix/store/k7n7k5axjlj9aifb58fiz8pcjxyiz72w-wayvnc-0.10.2
warning: ignoring the client-specified setting 'store', because it is a restricted setting and you are not a trusted user
k1bjxm3646g5lm109zcxsj86pd88pav5-home-manager-generation.drv: error: gRPC AddMultipleToStore on 'nix-store.geninf.io:50051' failed: error: some references of path '/nix/store/19mg86lx5byj5xkcdvaq8rjs0irmcvip-hm-putter.json.drv' could not be realised
error: error: gRPC AddMultipleToStore on 'nix-store.geninf.io:50051' failed: error: some references of path '/nix/store/19mg86lx5byj5xkcdvaq8rjs0irmcvip-hm-putter.json.drv' could not be realised
failed checks.x86_64-linux."home-manager-enzime@phi-nixos" 27s
setup: don't know how to build these paths: /nix/store/64434qki93qv5s4a178ikka5mjxgy7q3-home-manager-generation.drv warning: ignoring the client-specified set …
setup:
don't know how to build these paths:
  /nix/store/64434qki93qv5s4a178ikka5mjxgy7q3-home-manager-generation.drv
warning: ignoring the client-specified setting 'store', because it is a restricted setting and you are not a trusted user
64434qki93qv5s4a178ikka5mjxgy7q3-home-manager-generation.drv: error: gRPC AddMultipleToStore on 'nix-store.geninf.io:50051' failed: error: some references of path '/nix/store/bz0wmnjskyqhgz174xmxkij71zlbbr7h-activation-script.drv' could not be realised
error: error: gRPC AddMultipleToStore on 'nix-store.geninf.io:50051' failed: error: some references of path '/nix/store/bz0wmnjskyqhgz174xmxkij71zlbbr7h-activation-script.drv' could not be realised
failed checks.x86_64-linux.nixos-gaia 4m 22s
setup: don't know how to build these paths: /nix/store/mak0c8az1pqhcr92vlml0s3z49c58m68-nixos-system-gaia-26.11.20261007.7dd199b.drv warning: ignoring the cli …
setup:
don't know how to build these paths:
  /nix/store/mak0c8az1pqhcr92vlml0s3z49c58m68-nixos-system-gaia-26.11.20261007.7dd199b.drv
warning: ignoring the client-specified setting 'store', because it is a restricted setting and you are not a trusted user
0nfvjd4pgdhbxsiyn5yag198id2jkl72-home-manager-generation.drv: error: gRPC AddMultipleToStore on 'nix-store.geninf.io:50051' failed: error: some references of path '/nix/store/l861wkfggh3gf9lch7n72rxazg75lvi9-hm-putter.json.drv' could not be realised
error: dependency 'z0q0l7cr2a0zrrsmvxvhiw932bqqjhpd-etc.drv' failed
failed checks.x86_64-linux.nixos-sigma 1m 51s
setup: don't know how to build these paths: /nix/store/83wqakv4dd43r85hf35dj6a7h06bpzpv-nixos-system-sigma-26.11.20261007.7dd199b.drv warning: ignoring the cl …
setup:
don't know how to build these paths:
  /nix/store/83wqakv4dd43r85hf35dj6a7h06bpzpv-nixos-system-sigma-26.11.20261007.7dd199b.drv
warning: ignoring the client-specified setting 'store', because it is a restricted setting and you are not a trusted user
3r5by3i216kymz1ixs8av84qczwla1vl-user-generators.drv: error: gRPC AddMultipleToStore on 'nix-store.geninf.io:50051' failed: error: some references of path '/nix/store/gjjmzvmmha1b19413hql9rg73a762i1n-fprintd-1.94.5.drv' could not be realised
8lrvzvz72ws584f0qbbdy97f6w715dvl-system-path.drv: error: gRPC AddMultipleToStore on 'nix-store.geninf.io:50051' failed: error: some references of path '/nix/store/c5r6n3sqxnqyj75x49ra4953lsizcp25-captive-browser.drv' could not be realised
error: dependency '8lrvzvz72ws584f0qbbdy97f6w715dvl-system-path.drv' failed
9 succeeded ⚠ 1
succeeded attributes
status attribute duration
succeeded checks.x86_64-linux.nixos-phi-nixos
  • A legacy Nextcloud install (from before NixOS 26.11) may be installed. After nextcloud33 is installed successfully, you can safely upgrade to 34. The latest version available is Nextcloud35. Please note that Nextcloud doesn't support upgrades across multiple major versions (i.e. an upgrade from 16 is possible to 17, but not 16 to 18). The package can be upgraded by explicitly declaring the service-option `services.nextcloud.package`.
  • A legacy Nextcloud install (from before NixOS 26.11) may be installed. After nextcloud34 is installed successfully, you can safely upgrade to 35. The latest version available is Nextcloud35. Please note that Nextcloud doesn't support upgrades across multiple major versions (i.e. an upgrade from 16 is possible to 17, but not 16 to 18). The package can be upgraded by explicitly declaring the service-option `services.nextcloud.package`.
4m 35s
succeeded checks.aarch64-linux.package-gaia-vm 5s
succeeded checks.aarch64-linux.package-phi-nixos-vm 4s
succeeded checks.aarch64-linux.package-sigma-vm 4s
succeeded checks.x86_64-linux."home-manager-enzime@sigma" 1m 8s
succeeded checks.x86_64-linux.package-gaia-vm 9s
succeeded checks.x86_64-linux.package-phi-nixos-vm 11s
succeeded checks.x86_64-linux.package-sigma-vm 9s
succeeded checks.x86_64-linux.treefmt 34s
39 already built
skipped attributes
status attribute duration
loading…