nixbot

builds

Enzime/hyperconfig build #1150 failed

branch next · PR #1085 · commit 099484042b · · took 4m 10s · eval 20s

eval warnings 1 kind · 2 occurrences
  • warn A legacy Nextcloud install (from before NixOS 26.11) may be installed. ×2

10 failed
failed attributes
status attribute duration
failed checks.aarch64-darwin.devShell-default 2m 0s
setup: don't know how to build these paths: /nix/store/wg7sdrhwl3mxi829sd7lcx49ql54p73p-nix-shell.drv warning: ignoring the client-specified setting 'store', …
setup:
don't know how to build these paths:
  /nix/store/wg7sdrhwl3mxi829sd7lcx49ql54p73p-nix-shell.drv
warning: ignoring the client-specified setting 'store', because it is a restricted setting and you are not a trusted user
warning: hsyv25vscj3l586qmpqlbin2pc6qmijn-home-manager.drv: no connected, non-draining worker for system 'aarch64-darwin' offers features {}, the workers offer {}, waiting up to 120s for a worker
hsyv25vscj3l586qmpqlbin2pc6qmijn-home-manager.drv: no connected, non-draining worker for system 'aarch64-darwin' offers features {}, the workers offer {}
error: dependency 'hsyv25vscj3l586qmpqlbin2pc6qmijn-home-manager.drv' failed
failed checks.aarch64-darwin."home-manager-enzime@hyperion-macos" 2m 2s
setup: warning: dirpw6p7w0pl01r37wzk0wa5qlbidmdm-claude.drv: no connected, non-draining worker for system 'aarch64-darwin' offers features {}, the workers offer …
setup:
warning: dirpw6p7w0pl01r37wzk0wa5qlbidmdm-claude.drv: no connected, non-draining worker for system 'aarch64-darwin' offers features {}, the workers offer {}, waiting up to 120s for a worker
warning: hsyv25vscj3l586qmpqlbin2pc6qmijn-home-manager.drv: no connected, non-draining worker for system 'aarch64-darwin' offers features {}, the workers offer {}, waiting up to 120s for a worker
warning: p3f6rnwlmzn40k5hrprcp0swad8yd2iv-options.json.drv: no connected, non-draining worker for system 'aarch64-darwin' offers features {}, the workers offer {}, waiting up to 120s for a worker
3x8xxp2igwjgf6ahfgbbdpb74vmxkrlc-omp-18.8.3-cargo-vendor-vendor-staging.drv: no connected, non-draining worker for system 'aarch64-darwin' offers features {}, the workers offer {}
dirpw6p7w0pl01r37wzk0wa5qlbidmdm-claude.drv: no connected, non-draining worker for system 'aarch64-darwin' offers features {}, the workers offer {}
hsyv25vscj3l586qmpqlbin2pc6qmijn-home-manager.drv: no connected, non-draining worker for system 'aarch64-darwin' offers features {}, the workers offer {}
p3f6rnwlmzn40k5hrprcp0swad8yd2iv-options.json.drv: no connected, non-draining worker for system 'aarch64-darwin' offers features {}, the workers offer {}
error: dependency 'pnbdydvwhdqxzvr03g8w5bjvahc65md2-home-manager-path.drv' failed
failed checks.aarch64-darwin.nix-darwin-hyperion-macos 2m 2s
setup: 8y479gj19lfxymgk1nhkkds74yhng9j4-firefox-bin-unwrapped-157.0.1.drv: no connected, non-draining worker for system 'aarch64-darwin' offers features {}, the …
setup:
8y479gj19lfxymgk1nhkkds74yhng9j4-firefox-bin-unwrapped-157.0.1.drv: no connected, non-draining worker for system 'aarch64-darwin' offers features {}, the workers offer {}
bk1sl3fzx18y57wnp2fxspxg1n3q61vw-options.json.drv: no connected, non-draining worker for system 'aarch64-darwin' offers features {}, the workers offer {}
c0jjzksz632c0bhdqg8ismj1r8mydwg0-etc-registry.json.drv: no connected, non-draining worker for system 'aarch64-darwin' offers features {}, the workers offer {}
dirpw6p7w0pl01r37wzk0wa5qlbidmdm-claude.drv: no connected, non-draining worker for system 'aarch64-darwin' offers features {}, the workers offer {}
hsyv25vscj3l586qmpqlbin2pc6qmijn-home-manager.drv: no connected, non-draining worker for system 'aarch64-darwin' offers features {}, the workers offer {}
p3f6rnwlmzn40k5hrprcp0swad8yd2iv-options.json.drv: no connected, non-draining worker for system 'aarch64-darwin' offers features {}, the workers offer {}
pamkpa7lq4n5p3m819xrsyb4gfrawhpk-darwin-version.json.drv: no connected, non-draining worker for system 'aarch64-darwin' offers features {}, the workers offer {}
error: dependency 'pamkpa7lq4n5p3m819xrsyb4gfrawhpk-darwin-version.json.drv' failed
failed checks.aarch64-darwin.package-gaia-vm 2m 1s
setup: this derivation will be built: /nix/store/3gh952bvxf9llbwaq25dkhq49sd8yj6j-run-gaia-vm-on-aarch64-darwin.drv warning: ignoring the client-specified set …
setup:
this derivation will be built:
  /nix/store/3gh952bvxf9llbwaq25dkhq49sd8yj6j-run-gaia-vm-on-aarch64-darwin.drv
warning: ignoring the client-specified setting 'store', because it is a restricted setting and you are not a trusted user
warning: 3gh952bvxf9llbwaq25dkhq49sd8yj6j-run-gaia-vm-on-aarch64-darwin.drv: no connected, non-draining worker for system 'aarch64-darwin' offers features {}, the workers offer {}, waiting up to 120s for a worker
3gh952bvxf9llbwaq25dkhq49sd8yj6j-run-gaia-vm-on-aarch64-darwin.drv: no connected, non-draining worker for system 'aarch64-darwin' offers features {}, the workers offer {}
error: no connected, non-draining worker for system 'aarch64-darwin' offers features {}, the workers offer {}
failed checks.aarch64-darwin.package-phi-nixos-vm 2m 2s
setup: this derivation will be built: /nix/store/vqfr737hx1fy710lcabpwxsjmzi5x4i9-run-phi-nixos-vm-on-aarch64-darwin.drv warning: ignoring the client-specifie …
setup:
this derivation will be built:
  /nix/store/vqfr737hx1fy710lcabpwxsjmzi5x4i9-run-phi-nixos-vm-on-aarch64-darwin.drv
warning: ignoring the client-specified setting 'store', because it is a restricted setting and you are not a trusted user
warning: vqfr737hx1fy710lcabpwxsjmzi5x4i9-run-phi-nixos-vm-on-aarch64-darwin.drv: no connected, non-draining worker for system 'aarch64-darwin' offers features {}, the workers offer {}, waiting up to 120s for a worker
vqfr737hx1fy710lcabpwxsjmzi5x4i9-run-phi-nixos-vm-on-aarch64-darwin.drv: no connected, non-draining worker for system 'aarch64-darwin' offers features {}, the workers offer {}
error: no connected, non-draining worker for system 'aarch64-darwin' offers features {}, the workers offer {}
failed checks.aarch64-darwin.package-sigma-vm 2m 1s
setup: don't know how to build these paths: /nix/store/cfkd06ccs7g8xlzl16hnvnvc66j6swml-run-sigma-vm-on-aarch64-darwin.drv warning: ignoring the client-specif …
setup:
don't know how to build these paths:
  /nix/store/cfkd06ccs7g8xlzl16hnvnvc66j6swml-run-sigma-vm-on-aarch64-darwin.drv
warning: ignoring the client-specified setting 'store', because it is a restricted setting and you are not a trusted user
warning: cfkd06ccs7g8xlzl16hnvnvc66j6swml-run-sigma-vm-on-aarch64-darwin.drv: no connected, non-draining worker for system 'aarch64-darwin' offers features {}, the workers offer {}, waiting up to 120s for a worker
cfkd06ccs7g8xlzl16hnvnvc66j6swml-run-sigma-vm-on-aarch64-darwin.drv: no connected, non-draining worker for system 'aarch64-darwin' offers features {}, the workers offer {}
error: no connected, non-draining worker for system 'aarch64-darwin' offers features {}, the workers offer {}
failed checks.aarch64-darwin.package-tf-apply 2m 1s
setup: don't know how to build these paths: /nix/store/pgl242q37zh417xv03xs1l2xlwny3pc3-tf-apply.drv warning: ignoring the client-specified setting 'store', b …
setup:
don't know how to build these paths:
  /nix/store/pgl242q37zh417xv03xs1l2xlwny3pc3-tf-apply.drv
warning: ignoring the client-specified setting 'store', because it is a restricted setting and you are not a trusted user
warning: c9nvx0k0sb7amj6wbdw16pby69qn7g0z-get-clan-secret.drv: no connected, non-draining worker for system 'aarch64-darwin' offers features {}, the workers offer {}, waiting up to 120s for a worker
warning: jly31slxnxn6wi4q6yalpb8mg89gj6jp-opentofu-external-key-provider.drv: no connected, non-draining worker for system 'aarch64-darwin' offers features {}, the workers offer {}, waiting up to 120s for a worker
c9nvx0k0sb7amj6wbdw16pby69qn7g0z-get-clan-secret.drv: no connected, non-draining worker for system 'aarch64-darwin' offers features {}, the workers offer {}
jly31slxnxn6wi4q6yalpb8mg89gj6jp-opentofu-external-key-provider.drv: no connected, non-draining worker for system 'aarch64-darwin' offers features {}, the workers offer {}
error: dependency 'wsz0j307svrcd6abx37n6hh27m051v8l-config.tf.json.drv' failed
failed checks.aarch64-darwin.treefmt 2m 5s
setup: /nix/store/925b3zxz1j0984ywkl3y35v0bbrda2k9-statix-0.5.8-unstable-2026-07-17 /nix/store/775mmr2czhrfc7p45i9rwp5imkb7wcvd-statix-config /nix/store/q …
setup:
  /nix/store/925b3zxz1j0984ywkl3y35v0bbrda2k9-statix-0.5.8-unstable-2026-07-17
  /nix/store/775mmr2czhrfc7p45i9rwp5imkb7wcvd-statix-config
  /nix/store/q3s56vfx8n9d3l5pp9jl7kq3ncpa0fw4-statix-fix
  /nix/store/m965417sqcxjj5dj6wmhd4a57a1nx6jk-treefmt.toml
warning: ignoring the client-specified setting 'store', because it is a restricted setting and you are not a trusted user
warning: bq3i4jid3k8rnkzw8vywci2pqywx1m5g-treefmt-check.drv: no connected, non-draining worker for system 'aarch64-darwin' offers features {}, the workers offer {}, waiting up to 120s for a worker
bq3i4jid3k8rnkzw8vywci2pqywx1m5g-treefmt-check.drv: no connected, non-draining worker for system 'aarch64-darwin' offers features {}, the workers offer {}
error: no connected, non-draining worker for system 'aarch64-darwin' offers features {}, the workers offer {}
failed checks.aarch64-linux.devShell-default 7s
setup: /nix/store/fyb21yfapb4k21bsnr9p3rji6574q94b-home-manager.drv these 3 paths will be fetched (0.0 KiB download, 20.0 MiB unpacked): /nix/store/k3rmy4wf …
setup:
  /nix/store/fyb21yfapb4k21bsnr9p3rji6574q94b-home-manager.drv
these 3 paths will be fetched (0.0 KiB download, 20.0 MiB unpacked):
  /nix/store/k3rmy4wfgaw8g59mbymzmgw1nbwnlhqj-clan-cli
  /nix/store/scwy3jif3fd65d32c8i4awnfsq6qkiz0-opentofu-1.13.1
  /nix/store/jadqw1fnfbzd5qihyfhhnnfsrm3hw6jj-terraform-provider-external-2.4.2
warning: ignoring the client-specified setting 'store', because it is a restricted setting and you are not a trusted user
fyb21yfapb4k21bsnr9p3rji6574q94b-home-manager.drv: error: gRPC AddMultipleToStore on 'nix-store.geninf.io:50051' failed: error: some references of path '/nix/store/7ix3jswjcl56qkc937hcm7y9igmhvvzc-inetutils-2.7.drv' could not be realised
error: dependency 'fyb21yfapb4k21bsnr9p3rji6574q94b-home-manager.drv' failed
failed checks.aarch64-linux.treefmt 3s
setup: don't know how to build these paths: /nix/store/kwv3r83qsvj37sq6vfrx2a8rgqwqmnz1-treefmt-check.drv warning: ignoring the client-specified setting 'stor …
setup:
don't know how to build these paths:
  /nix/store/kwv3r83qsvj37sq6vfrx2a8rgqwqmnz1-treefmt-check.drv
warning: ignoring the client-specified setting 'store', because it is a restricted setting and you are not a trusted user
kwv3r83qsvj37sq6vfrx2a8rgqwqmnz1-treefmt-check.drv: error: gRPC AddMultipleToStore on 'nix-store.geninf.io:50051' failed: error: some references of path '/nix/store/rnbix0f1rip6cc9h99h2p6rw436y0v0x-actionlint-1.7.12.drv' could not be realised
error: error: gRPC AddMultipleToStore on 'nix-store.geninf.io:50051' failed: error: some references of path '/nix/store/rnbix0f1rip6cc9h99h2p6rw436y0v0x-actionlint-1.7.12.drv' could not be realised
14 succeeded ⚠ 1
succeeded attributes
status attribute duration
succeeded checks.x86_64-linux.nixos-phi-nixos
  • A legacy Nextcloud install (from before NixOS 26.11) may be installed. After nextcloud33 is installed successfully, you can safely upgrade to 34. The latest version available is Nextcloud35. Please note that Nextcloud doesn't support upgrades across multiple major versions (i.e. an upgrade from 16 is possible to 17, but not 16 to 18). The package can be upgraded by explicitly declaring the service-option `services.nextcloud.package`.
  • A legacy Nextcloud install (from before NixOS 26.11) may be installed. After nextcloud34 is installed successfully, you can safely upgrade to 35. The latest version available is Nextcloud35. Please note that Nextcloud doesn't support upgrades across multiple major versions (i.e. an upgrade from 16 is possible to 17, but not 16 to 18). The package can be upgraded by explicitly declaring the service-option `services.nextcloud.package`.
3m 0s
succeeded checks.aarch64-linux.package-gaia-vm 3s
succeeded checks.aarch64-linux.package-phi-nixos-vm 2s
succeeded checks.aarch64-linux.package-sigma-vm 4s
succeeded checks.x86_64-linux.devShell-default 9s
succeeded checks.x86_64-linux."home-manager-enzime@gaia" 1m 2s
succeeded checks.x86_64-linux."home-manager-enzime@phi-nixos" 1m 16s
succeeded checks.x86_64-linux."home-manager-enzime@sigma" 1m 19s
succeeded checks.x86_64-linux.nixos-gaia 3m 35s
succeeded checks.x86_64-linux.nixos-sigma 3m 47s
succeeded checks.x86_64-linux.package-gaia-vm 3s
succeeded checks.x86_64-linux.package-phi-nixos-vm 6s
succeeded checks.x86_64-linux.package-sigma-vm 4s
succeeded checks.x86_64-linux.treefmt 4s
35 already built
skipped attributes
status attribute duration
loading…