nixbot

builds

Enzime/hyperconfig build #934 failed

branch next · PR #1027 · commit b42d6f6a32 · · took 9m 46s · eval 2m 38s

eval warnings 5 kinds · 24 occurrences
  • error unable to download 'https://cache.clan.lol/…': HTTP error 503 ×2
  • error unable to download 'https://cache.geninf.io/…': HTTP error 503 ×1
  • warn unable to download 'https://cache.clan.lol/…': HTTP error 503 ×8
  • warn unable to download 'https://cache.geninf.io/…': HTTP error 503 ×11
  • warn A legacy Nextcloud install (from before NixOS 26.11) may be installed. ×2

12 failed ⚠ 1
failed attributes
status attribute duration
failed checks.x86_64-linux.nixos-phi-nixos
  • A legacy Nextcloud install (from before NixOS 26.11) may be installed. After nextcloud33 is installed successfully, you can safely upgrade to 34. The latest version available is Nextcloud35. Please note that Nextcloud doesn't support upgrades across multiple major versions (i.e. an upgrade from 16 is possible to 17, but not 16 to 18). The package can be upgraded by explicitly declaring the service-option `services.nextcloud.package`.
  • A legacy Nextcloud install (from before NixOS 26.11) may be installed. After nextcloud34 is installed successfully, you can safely upgrade to 35. The latest version available is Nextcloud35. Please note that Nextcloud doesn't support upgrades across multiple major versions (i.e. an upgrade from 16 is possible to 17, but not 16 to 18). The package can be upgraded by explicitly declaring the service-option `services.nextcloud.package`.
1m 23s
setup: don't know how to build these paths: /nix/store/qqg1m7qjxn2r4la9398ac4drlb81a092-nixos-system-phi-nixos-26.11.20260922.b6c98e9.drv warning: ignoring th …
setup:
don't know how to build these paths:
  /nix/store/qqg1m7qjxn2r4la9398ac4drlb81a092-nixos-system-phi-nixos-26.11.20260922.b6c98e9.drv
warning: ignoring the client-specified setting 'store', because it is a restricted setting and you are not a trusted user
error: gRPC QueryValidPaths on 'nix-store.geninf.io:50051' failed: error: unable to download 'https://cache.clan.lol/64w6b2w4ipqdd748pl85pnnawwgky65z.narinfo': HTTP error 503

              response body:

              <?xml version="1.0" encoding="UTF-8" standalone="yes"?>
              <Error>
                  <Code>SlowDown</Code>
                  <Message>Your account has made too many requests; try again later.</Message>
              </Error>
failed checks.aarch64-darwin."home-manager-enzime@hyperion-macos" 1m 41s
setup: don't know how to build these paths: /nix/store/02d9c6wyl0gkg2drsnps7pgfprgn6w1c-home-manager-generation.drv warning: ignoring the client-specified set …
setup:
don't know how to build these paths:
  /nix/store/02d9c6wyl0gkg2drsnps7pgfprgn6w1c-home-manager-generation.drv
warning: ignoring the client-specified setting 'store', because it is a restricted setting and you are not a trusted user
error: gRPC QueryValidPaths on 'nix-store.geninf.io:50051' failed: error: unable to download 'https://cache.clan.lol/47dj01gwx439z2gq5v4jbh755x5kxsk6.narinfo': HTTP error 503

              response body:

              <?xml version="1.0" encoding="UTF-8" standalone="yes"?>
              <Error>
                  <Code>SlowDown</Code>
                  <Message>Your account has made too many requests; try again later.</Message>
              </Error>
failed checks.aarch64-darwin.nix-darwin-hyperion-macos 45s
setup: don't know how to build these paths: /nix/store/897563andb8yppbzgyyvl3qykkj7rgrk-darwin-system-26.11.4cff07d.drv warning: ignoring the client-specified …
setup:
don't know how to build these paths:
  /nix/store/897563andb8yppbzgyyvl3qykkj7rgrk-darwin-system-26.11.4cff07d.drv
warning: ignoring the client-specified setting 'store', because it is a restricted setting and you are not a trusted user
error: gRPC QueryValidPaths on 'nix-store.geninf.io:50051' failed: error: unable to download 'https://cache.clan.lol/2gmq17cw1wkaxbx21vgbd3a2qjsh0l9i.narinfo': HTTP error 503

              response body:

              <?xml version="1.0" encoding="UTF-8" standalone="yes"?>
              <Error>
                  <Code>SlowDown</Code>
                  <Message>Your account has made too many requests; try again later.</Message>
              </Error>
failed checks.aarch64-darwin.treefmt 1m 20s
setup: don't know how to build these paths: /nix/store/vc3wq6kmdy50zzyjhbm0z2gsxx8702gc-treefmt-check.drv warning: ignoring the client-specified setting 'stor …
setup:
don't know how to build these paths:
  /nix/store/vc3wq6kmdy50zzyjhbm0z2gsxx8702gc-treefmt-check.drv
warning: ignoring the client-specified setting 'store', because it is a restricted setting and you are not a trusted user
error: gRPC QueryValidPaths on 'nix-store.geninf.io:50051' failed: error: unable to download 'https://cache.clan.lol/71v2rqvrzdkbc72vh2q2nw1p1jrsvmvs.narinfo': HTTP error 503

              response body:

              <?xml version="1.0" encoding="UTF-8" standalone="yes"?>
              <Error>
                  <Code>SlowDown</Code>
                  <Message>Your account has made too many requests; try again later.</Message>
              </Error>
failed checks.aarch64-linux.package-gaia-vm 2m 58s
setup: don't know how to build these paths: /nix/store/arrzxdir5whjx5i9xzf364ldbgp5a2hb-run-gaia-vm-on-aarch64-linux.drv warning: ignoring the client-specifie …
setup:
don't know how to build these paths:
  /nix/store/arrzxdir5whjx5i9xzf364ldbgp5a2hb-run-gaia-vm-on-aarch64-linux.drv
warning: ignoring the client-specified setting 'store', because it is a restricted setting and you are not a trusted user
arrzxdir5whjx5i9xzf364ldbgp5a2hb-run-gaia-vm-on-aarch64-linux.drv: error: gRPC QueryValidPaths on 'nix-store.geninf.io:50051' failed: error: substituter 'https://cache.geninf.io' is disabled
error: error: gRPC QueryValidPaths on 'nix-store.geninf.io:50051' failed: error: substituter 'https://cache.geninf.io' is disabled
failed checks.aarch64-linux.package-phi-nixos-vm 2m 16s
setup: this derivation will be built: /nix/store/v637ypfq3pc8b75mn99d2gcx3q6a93mc-run-phi-nixos-vm-on-aarch64-linux.drv warning: ignoring the client-specified …
setup:
this derivation will be built:
  /nix/store/v637ypfq3pc8b75mn99d2gcx3q6a93mc-run-phi-nixos-vm-on-aarch64-linux.drv
warning: ignoring the client-specified setting 'store', because it is a restricted setting and you are not a trusted user
v637ypfq3pc8b75mn99d2gcx3q6a93mc-run-phi-nixos-vm-on-aarch64-linux.drv: error: gRPC QueryValidPaths on 'nix-store.geninf.io:50051' failed: error: substituter 'https://cache.clan.lol' is disabled
error: error: gRPC QueryValidPaths on 'nix-store.geninf.io:50051' failed: error: substituter 'https://cache.clan.lol' is disabled
failed checks.x86_64-linux."home-manager-enzime@gaia" 37s
setup: don't know how to build these paths: /nix/store/nwv1ld5x4rc5j8bcgfixrl201srf8ssq-home-manager-generation.drv warning: ignoring the client-specified set …
setup:
don't know how to build these paths:
  /nix/store/nwv1ld5x4rc5j8bcgfixrl201srf8ssq-home-manager-generation.drv
warning: ignoring the client-specified setting 'store', because it is a restricted setting and you are not a trusted user
error: gRPC QueryValidPaths on 'nix-store.geninf.io:50051' failed: error: unable to download 'https://cache.geninf.io/2r642h5b4d8gjb56l44aa21ky940jpn4.narinfo': HTTP error 503

              response body:

              <?xml version="1.0" encoding="UTF-8" standalone="yes"?>
              <Error>
                  <Code>SlowDown</Code>
                  <Message>Your account has made too many requests; try again later.</Message>
              </Error>
failed checks.x86_64-linux."home-manager-enzime@phi-nixos" 22s
setup: don't know how to build these paths: /nix/store/3p1lnfvyzc84faz0mm8z3gnxhl4a67xz-home-manager-generation.drv warning: ignoring the client-specified set …
setup:
don't know how to build these paths:
  /nix/store/3p1lnfvyzc84faz0mm8z3gnxhl4a67xz-home-manager-generation.drv
warning: ignoring the client-specified setting 'store', because it is a restricted setting and you are not a trusted user
error: gRPC QueryValidPaths on 'nix-store.geninf.io:50051' failed: error: unable to download 'https://cache.clan.lol/1in4qjycv4j66q1mpavl0wbfhgy887zp.narinfo': HTTP error 503

              response body:

              <?xml version="1.0" encoding="UTF-8" standalone="yes"?>
              <Error>
                  <Code>SlowDown</Code>
                  <Message>Your account has made too many requests; try again later.</Message>
              </Error>
failed checks.x86_64-linux."home-manager-enzime@sigma" 2m 49s
setup: don't know how to build these paths: /nix/store/3xfdk4w13yb3da595vpwldddxbjyywbm-home-manager-generation.drv warning: ignoring the client-specified set …
setup:
don't know how to build these paths:
  /nix/store/3xfdk4w13yb3da595vpwldddxbjyywbm-home-manager-generation.drv
warning: ignoring the client-specified setting 'store', because it is a restricted setting and you are not a trusted user
error: gRPC QueryValidPaths on 'nix-store.geninf.io:50051' failed: error: unable to download 'https://cache.clan.lol/9hqm6i2npg54v8bgi42w9d1ypazdhlw3.narinfo': HTTP error 503

              response body:

              <?xml version="1.0" encoding="UTF-8" standalone="yes"?>
              <Error>
                  <Code>SlowDown</Code>
                  <Message>Your account has made too many requests; try again later.</Message>
              </Error>
failed checks.x86_64-linux.nixos-gaia 41s
setup: don't know how to build these paths: /nix/store/m6myj36226fzh4gzdds7ycmzwwrrmzbb-nixos-system-gaia-26.11.20260922.b6c98e9.drv warning: ignoring the cli …
setup:
don't know how to build these paths:
  /nix/store/m6myj36226fzh4gzdds7ycmzwwrrmzbb-nixos-system-gaia-26.11.20260922.b6c98e9.drv
warning: ignoring the client-specified setting 'store', because it is a restricted setting and you are not a trusted user
error: gRPC QueryValidPaths on 'nix-store.geninf.io:50051' failed: error: unable to download 'https://cache.clan.lol/306rx21rg90xz4q7bwpw6f743j520acp.narinfo': HTTP error 503

              response body:

              <?xml version="1.0" encoding="UTF-8" standalone="yes"?>
              <Error>
                  <Code>SlowDown</Code>
                  <Message>Your account has made too many requests; try again later.</Message>
              </Error>
failed checks.x86_64-linux.nixos-sigma 29s
setup: don't know how to build these paths: /nix/store/ya7qjrfjdh930msgwmypxshld7zczw8y-nixos-system-sigma-26.11.20260922.b6c98e9.drv warning: ignoring the cl …
setup:
don't know how to build these paths:
  /nix/store/ya7qjrfjdh930msgwmypxshld7zczw8y-nixos-system-sigma-26.11.20260922.b6c98e9.drv
warning: ignoring the client-specified setting 'store', because it is a restricted setting and you are not a trusted user
error: gRPC QueryValidPaths on 'nix-store.geninf.io:50051' failed: error: unable to download 'https://cache.clan.lol/c7ydcp8chy2q99rbrj8ybxvvyyxj3cwi.narinfo': HTTP error 503

              response body:

              <?xml version="1.0" encoding="UTF-8" standalone="yes"?>
              <Error>
                  <Code>SlowDown</Code>
                  <Message>Your account has made too many requests; try again later.</Message>
              </Error>
failed checks.x86_64-linux.treefmt 14s
setup: don't know how to build these paths: /nix/store/vp3jdz3hm95cc5lp9052cg6arp2nclm0-treefmt-check.drv warning: ignoring the client-specified setting 'stor …
setup:
don't know how to build these paths:
  /nix/store/vp3jdz3hm95cc5lp9052cg6arp2nclm0-treefmt-check.drv
warning: ignoring the client-specified setting 'store', because it is a restricted setting and you are not a trusted user
error: gRPC QueryValidPaths on 'nix-store.geninf.io:50051' failed: error: unable to download 'https://cache.clan.lol/7rb7p4yvfq2b1chrryv5m3diwjzj55k4.narinfo': HTTP error 503

              response body:

              <?xml version="1.0" encoding="UTF-8" standalone="yes"?>
              <Error>
                  <Code>SlowDown</Code>
                  <Message>Your account has made too many requests; try again later.</Message>
              </Error>
8 succeeded
succeeded attributes
status attribute duration
loading…
39 already built
skipped attributes
status attribute duration
loading…