nixbot

builds

Enzime/hyperconfig build #940 failed

branch main · PR #1033 · commit d213b8d269 · · took 15s · eval 17s

5 failed ⚠ 1
failed attributes
status attribute duration
failed checks.x86_64-linux.nixos-phi-nixos
  • A legacy Nextcloud install (from before NixOS 26.11) may be installed. After nextcloud33 is installed successfully, you can safely upgrade to 34. The latest version available is Nextcloud35. Please note that Nextcloud doesn't support upgrades across multiple major versions (i.e. an upgrade from 16 is possible to 17, but not 16 to 18). The package can be upgraded by explicitly declaring the service-option `services.nextcloud.package`.
  • A legacy Nextcloud install (from before NixOS 26.11) may be installed. After nextcloud34 is installed successfully, you can safely upgrade to 35. The latest version available is Nextcloud35. Please note that Nextcloud doesn't support upgrades across multiple major versions (i.e. an upgrade from 16 is possible to 17, but not 16 to 18). The package can be upgraded by explicitly declaring the service-option `services.nextcloud.package`.
13s
setup: these 4 paths will be fetched (0.0 KiB download, 19.5 KiB unpacked): /nix/store/c50zz1zkx6bk5nrn1na754yq56pdjj89-check-sshd-config /nix/store/2xrph41 …
setup:
these 4 paths will be fetched (0.0 KiB download, 19.5 KiB unpacked):
  /nix/store/c50zz1zkx6bk5nrn1na754yq56pdjj89-check-sshd-config
  /nix/store/2xrph41m8g5g3fdrf0s6xwiswpn7v4wl-dry-activate
  /nix/store/5vsp9w68dlz9c5zn6jrr10sil0kfb34v-home-manager-generation
  /nix/store/azjnwg3za27ccl8czdfsfz83x7gharz2-xkb-validated
warning: ignoring the client-specified setting 'store', because it is a restricted setting and you are not a trusted user
9ch9z33qmdpavndigigx43yn6f0zp8zv-activate.drv: error: gRPC AddMultipleToStore on 'nix-store.geninf.io:50051' failed: error: niks3 push: creating pending closures: creating push: server returned 413: <html>
              <head><title>413 Request Entity Too Large</title></head>
              <body>
              <center><h1>413 Request Entity Too Large</h1></center>
              <hr><center>nginx</center>
              </body>
              </html>
              
error: dependency '9ch9z33qmdpavndigigx43yn6f0zp8zv-activate.drv' failed
failed checks.aarch64-darwin.treefmt 4s
treefmt-check: "${herdrAssets}/omp/herdr-agent-state.ts"; - home.file.".claude/hooks/herdr-agent-state.sh".source = "${herdrAssets}/claude/herdr …
treefmt-check:
         "${herdrAssets}/omp/herdr-agent-state.ts";
 
-      home.file.".claude/hooks/herdr-agent-state.sh".source = "${herdrAssets}/claude/herdr-agent-state.sh";
+      home.file.".claude/hooks/herdr-agent-state.sh".source =
+        "${herdrAssets}/claude/herdr-agent-state.sh";
 
       home.file.".claude/CLAUDE.md".source = ../files/CLAUDE.md;
 
failed checks.aarch64-linux.treefmt 4s
treefmt-check: "${herdrAssets}/omp/herdr-agent-state.ts"; - home.file.".claude/hooks/herdr-agent-state.sh".source = "${herdrAssets}/claude/herdr …
treefmt-check:
         "${herdrAssets}/omp/herdr-agent-state.ts";
 
-      home.file.".claude/hooks/herdr-agent-state.sh".source = "${herdrAssets}/claude/herdr-agent-state.sh";
+      home.file.".claude/hooks/herdr-agent-state.sh".source =
+        "${herdrAssets}/claude/herdr-agent-state.sh";
 
       home.file.".claude/CLAUDE.md".source = ../files/CLAUDE.md;
 
failed checks.x86_64-linux.nixos-sigma 15s
setup: /nix/store/j062nqm82smy3516vhixcphzh1qq3pdi-composefs-1.0.8-lib /nix/store/klqm7x44c27ci8wrx06y9a1c7wz89ad8-dry-activate /nix/store/bhrnmwxdgs7i4w2 …
setup:
  /nix/store/j062nqm82smy3516vhixcphzh1qq3pdi-composefs-1.0.8-lib
  /nix/store/klqm7x44c27ci8wrx06y9a1c7wz89ad8-dry-activate
  /nix/store/bhrnmwxdgs7i4w205jlcq9svsszrghi9-erofs-utils-1.9.4
  /nix/store/ggxml0c5l8z2260xwgccxxk6maq6rp9z-home-manager-generation
  /nix/store/azjnwg3za27ccl8czdfsfz83x7gharz2-xkb-validated
warning: ignoring the client-specified setting 'store', because it is a restricted setting and you are not a trusted user
7pxylmpvgxcnh0666bb1hr7vfd8n4cka-etc-json.drv: error: gRPC AddMultipleToStore on 'nix-store.geninf.io:50051' failed: error: niks3 push: creating pending closures: creating push: server returned 413: <html>
              <head><title>413 Request Entity Too Large</title></head>
              <body>
              <center><h1>413 Request Entity Too Large</h1></center>
              <hr><center>nginx</center>
              </body>
              </html>
              
error: dependency '5jm6z5qlhgljgkxhryij4yhx5xsgwgh5-boot.json.drv' failed
failed checks.x86_64-linux.treefmt 6s
treefmt-check: "${herdrAssets}/omp/herdr-agent-state.ts"; - home.file.".claude/hooks/herdr-agent-state.sh".source = "${herdrAssets}/claude/herdr …
treefmt-check:
         "${herdrAssets}/omp/herdr-agent-state.ts";
 
-      home.file.".claude/hooks/herdr-agent-state.sh".source = "${herdrAssets}/claude/herdr-agent-state.sh";
+      home.file.".claude/hooks/herdr-agent-state.sh".source =
+        "${herdrAssets}/claude/herdr-agent-state.sh";
 
       home.file.".claude/CLAUDE.md".source = ../files/CLAUDE.md;
 
54 succeeded
succeeded attributes
status attribute duration
loading…