nixbot

builds

Enzime/hyperconfig build #941 failed

branch next · PR #1027 · commit 8497e18cf2 · · took 6m 56s · eval 34s

eval warnings 1 kind · 2 occurrences
  • warn A legacy Nextcloud install (from before NixOS 26.11) may be installed. ×2

7 failed ⚠ 1
failed attributes
status attribute duration
failed checks.x86_64-linux.nixos-phi-nixos
  • A legacy Nextcloud install (from before NixOS 26.11) may be installed. After nextcloud33 is installed successfully, you can safely upgrade to 34. The latest version available is Nextcloud35. Please note that Nextcloud doesn't support upgrades across multiple major versions (i.e. an upgrade from 16 is possible to 17, but not 16 to 18). The package can be upgraded by explicitly declaring the service-option `services.nextcloud.package`.
  • A legacy Nextcloud install (from before NixOS 26.11) may be installed. After nextcloud34 is installed successfully, you can safely upgrade to 35. The latest version available is Nextcloud35. Please note that Nextcloud doesn't support upgrades across multiple major versions (i.e. an upgrade from 16 is possible to 17, but not 16 to 18). The package can be upgraded by explicitly declaring the service-option `services.nextcloud.package`.
1m 41s
setup: don't know how to build these paths: /nix/store/9lqx1z6ypy6dk8pfsyr8ymv0shx41wxh-nixos-system-phi-nixos-26.11.20260922.b6c98e9.drv warning: ignoring th …
setup:
don't know how to build these paths:
  /nix/store/9lqx1z6ypy6dk8pfsyr8ymv0shx41wxh-nixos-system-phi-nixos-26.11.20260922.b6c98e9.drv
warning: ignoring the client-specified setting 'store', because it is a restricted setting and you are not a trusted user
error: gRPC QueryValidPaths on 'nix-store.geninf.io:50051' failed: error: unable to download 'https://cache.clan.lol/sj7c5xs2z2iq94s3fzbh7j1fvzz5wryr.narinfo': HTTP error 503

              response body:

              <?xml version="1.0" encoding="UTF-8" standalone="yes"?>
              <Error>
                  <Code>SlowDown</Code>
                  <Message>Your account has made too many requests; try again later.</Message>
              </Error>
failed checks.aarch64-darwin."home-manager-enzime@hyperion-macos" 23s
setup: don't know how to build these paths: /nix/store/hcqnmg2jqfbr798f65zp57h6i2m9vak1-home-manager-generation.drv warning: ignoring the client-specified set …
setup:
don't know how to build these paths:
  /nix/store/hcqnmg2jqfbr798f65zp57h6i2m9vak1-home-manager-generation.drv
warning: ignoring the client-specified setting 'store', because it is a restricted setting and you are not a trusted user
error: gRPC QueryValidPaths on 'nix-store.geninf.io:50051' failed: error: unable to download 'https://cache.geninf.io/1wny4qgf0cvql1d4pzir1yvkfdz26rcx.narinfo': HTTP error 503

              response body:

              <?xml version="1.0" encoding="UTF-8" standalone="yes"?>
              <Error>
                  <Code>SlowDown</Code>
                  <Message>Your account has made too many requests; try again later.</Message>
              </Error>
failed checks.aarch64-darwin.nix-darwin-hyperion-macos 3m 44s
setup: /nix/store/lnzjybhv815v0zvk8jz7kf9qha6rbmjy-home-manager-generation.drv /nix/store/simcc0n89r06smnjnwamcdk53mqjwq2v-etc.drv /nix/store/qw9d90p739wy …
setup:
  /nix/store/lnzjybhv815v0zvk8jz7kf9qha6rbmjy-home-manager-generation.drv
  /nix/store/simcc0n89r06smnjnwamcdk53mqjwq2v-etc.drv
  /nix/store/qw9d90p739wy3z566pz6772ipxwxpfjl-darwin-system-26.11.4cff07d.drv
  /nix/store/wx06v968ybal2mkjan4wz7dwiigv72as-activation-script.drv
this path will be fetched (0.0 KiB download, 0.5 KiB unpacked):
  /nix/store/qx946xyy3kwldmqq2pc19jkaqqm09iz3-shellcheck-0.11.0
warning: ignoring the client-specified setting 'store', because it is a restricted setting and you are not a trusted user
error: gRPC QueryValidPaths on 'nix-store.geninf.io:50051' failed: error: unable to download 'https://cache.clan.lol/8rnnpld2ll1368809b1liwynqhsiq8sd.narinfo': HTTP error 503

              response body:

              <?xml version="1.0" encoding="UTF-8" standalone="yes"?>
              <Error>
                  <Code>SlowDown</Code>
                  <Message>Your account has made too many requests; try again later.</Message>
              </Error>
failed checks.x86_64-linux."home-manager-enzime@phi-nixos" 44s
setup: don't know how to build these paths: /nix/store/ic4vaiqc3pax0m04q1jb5sji49y2kxhj-home-manager-generation.drv warning: ignoring the client-specified set …
setup:
don't know how to build these paths:
  /nix/store/ic4vaiqc3pax0m04q1jb5sji49y2kxhj-home-manager-generation.drv
warning: ignoring the client-specified setting 'store', because it is a restricted setting and you are not a trusted user
error: gRPC QueryValidPaths on 'nix-store.geninf.io:50051' failed: error: unable to download 'https://cache.geninf.io/1b79z5z6xybq4hjmxhz4wsgyi5kprdd4.narinfo': HTTP error 503

              response body:

              <?xml version="1.0" encoding="UTF-8" standalone="yes"?>
              <Error>
                  <Code>SlowDown</Code>
                  <Message>Your account has made too many requests; try again later.</Message>
              </Error>
failed checks.x86_64-linux."home-manager-enzime@sigma" 1m 0s
setup: these 2 derivations will be built: /nix/store/fh9f4kg4a2vxfip3vbgsbnryjm6b5nif-home-manager-generation.drv /nix/store/v2i2mynb5hkl02bh7gbs7rwdc00g4a3 …
setup:
these 2 derivations will be built:
  /nix/store/fh9f4kg4a2vxfip3vbgsbnryjm6b5nif-home-manager-generation.drv
  /nix/store/v2i2mynb5hkl02bh7gbs7rwdc00g4a34-activation-script.drv
warning: ignoring the client-specified setting 'store', because it is a restricted setting and you are not a trusted user
error: gRPC QueryValidPaths on 'nix-store.geninf.io:50051' failed: error: unable to download 'https://cache.clan.lol/pvql15cnjqy6v6ak7q9sm26hqfd71pyz.narinfo': HTTP error 503

              response body:

              <?xml version="1.0" encoding="UTF-8" standalone="yes"?>
              <Error>
                  <Code>SlowDown</Code>
                  <Message>Your account has made too many requests; try again later.</Message>
              </Error>
failed checks.x86_64-linux.nixos-gaia 6m 18s
setup: /nix/store/klqm7x44c27ci8wrx06y9a1c7wz89ad8-dry-activate /nix/store/bhrnmwxdgs7i4w205jlcq9svsszrghi9-erofs-utils-1.9.4 /nix/store/nb2dws4j56b5prgv1 …
setup:
  /nix/store/klqm7x44c27ci8wrx06y9a1c7wz89ad8-dry-activate
  /nix/store/bhrnmwxdgs7i4w205jlcq9svsszrghi9-erofs-utils-1.9.4
  /nix/store/nb2dws4j56b5prgv18p4bmf5ydmmks7d-install-shell-files
  /nix/store/84sggxlzw0adckmzzysvrajmmdl5p6qq-libcap-text-verifier-0-unstable
  /nix/store/4cj18ri8yyjbiragdkxm0q3y6bqr0dqs-lndir-1.0.5
  /nix/store/azjnwg3za27ccl8czdfsfz83x7gharz2-xkb-validated
warning: ignoring the client-specified setting 'store', because it is a restricted setting and you are not a trusted user
error: gRPC QueryValidPaths on 'nix-store.geninf.io:50051' failed: error: unable to download 'https://cache.geninf.io/64xlm9lr6hlmkli4nvp1plpsml48zdav.narinfo': HTTP error 503

              response body:

              <?xml version="1.0" encoding="UTF-8" standalone="yes"?>
              <Error>
                  <Code>SlowDown</Code>
                  <Message>Your account has made too many requests; try again later.</Message>
              </Error>
failed checks.x86_64-linux.nixos-sigma 5m 22s
setup: /nix/store/klqm7x44c27ci8wrx06y9a1c7wz89ad8-dry-activate /nix/store/bhrnmwxdgs7i4w205jlcq9svsszrghi9-erofs-utils-1.9.4 /nix/store/nb2dws4j56b5prgv1 …
setup:
  /nix/store/klqm7x44c27ci8wrx06y9a1c7wz89ad8-dry-activate
  /nix/store/bhrnmwxdgs7i4w205jlcq9svsszrghi9-erofs-utils-1.9.4
  /nix/store/nb2dws4j56b5prgv18p4bmf5ydmmks7d-install-shell-files
  /nix/store/84sggxlzw0adckmzzysvrajmmdl5p6qq-libcap-text-verifier-0-unstable
  /nix/store/4cj18ri8yyjbiragdkxm0q3y6bqr0dqs-lndir-1.0.5
  /nix/store/azjnwg3za27ccl8czdfsfz83x7gharz2-xkb-validated
warning: ignoring the client-specified setting 'store', because it is a restricted setting and you are not a trusted user
error: gRPC QueryValidPaths on 'nix-store.geninf.io:50051' failed: error: unable to download 'https://cache.clan.lol/1p28kxcar15r7h61hl06g6sdcq0ix142.narinfo': HTTP error 503

              response body:

              <?xml version="1.0" encoding="UTF-8" standalone="yes"?>
              <Error>
                  <Code>SlowDown</Code>
                  <Message>Your account has made too many requests; try again later.</Message>
              </Error>
13 succeeded
succeeded attributes
status attribute duration
loading…
39 already built
skipped attributes
status attribute duration
loading…