nixbot

builds

Enzime/hyperconfig build #942 failed

branch next · PR #1028 · commit d53cb45f7f · · took 11m 19s · eval 1m 24s

eval warnings 4 kinds · 10 occurrences
  • error unable to download 'https://cache.clan.lol/…': HTTP error 503 ×1
  • warn unable to download 'https://cache.clan.lol/…': HTTP error 503 ×4
  • warn unable to download 'https://cache.geninf.io/…': HTTP error 503 ×3
  • warn A legacy Nextcloud install (from before NixOS 26.11) may be installed. ×2

11 failed ⚠ 1
failed attributes
status attribute duration
failed checks.x86_64-linux.nixos-phi-nixos
  • A legacy Nextcloud install (from before NixOS 26.11) may be installed. After nextcloud33 is installed successfully, you can safely upgrade to 34. The latest version available is Nextcloud35. Please note that Nextcloud doesn't support upgrades across multiple major versions (i.e. an upgrade from 16 is possible to 17, but not 16 to 18). The package can be upgraded by explicitly declaring the service-option `services.nextcloud.package`.
  • A legacy Nextcloud install (from before NixOS 26.11) may be installed. After nextcloud34 is installed successfully, you can safely upgrade to 35. The latest version available is Nextcloud35. Please note that Nextcloud doesn't support upgrades across multiple major versions (i.e. an upgrade from 16 is possible to 17, but not 16 to 18). The package can be upgraded by explicitly declaring the service-option `services.nextcloud.package`.
8m 29s
setup: /nix/store/84sggxlzw0adckmzzysvrajmmdl5p6qq-libcap-text-verifier-0-unstable /nix/store/4cj18ri8yyjbiragdkxm0q3y6bqr0dqs-lndir-1.0.5 /nix/store/xv8n …
setup:
  /nix/store/84sggxlzw0adckmzzysvrajmmdl5p6qq-libcap-text-verifier-0-unstable
  /nix/store/4cj18ri8yyjbiragdkxm0q3y6bqr0dqs-lndir-1.0.5
  /nix/store/xv8nd43y9zw4vcnilxbagv6zmghfnxjk-nixos-render-docs-0.0
  /nix/store/hx1j4ilpbfjmmv31w0f20agk0asjcjjz-python3.14-markdown-it-py-4.2.0
  /nix/store/ym89dm8b2bpspsk8l22b10fvnpm3h8w9-python3.14-mdit-py-plugins-0.6.1
  /nix/store/azjnwg3za27ccl8czdfsfz83x7gharz2-xkb-validated
warning: ignoring the client-specified setting 'store', because it is a restricted setting and you are not a trusted user
error: gRPC QueryValidPaths on 'nix-store.geninf.io:50051' failed: error: unable to download 'https://cache.geninf.io/m81h08ccagcwkdaacx1qc6y1bvqa8jyn.narinfo': HTTP error 503

              response body:

              <?xml version="1.0" encoding="UTF-8" standalone="yes"?>
              <Error>
                  <Code>SlowDown</Code>
                  <Message>Your account has made too many requests; try again later.</Message>
              </Error>
failed checks.aarch64-darwin.devShell-default 1m 15s
setup: z2wm2ij8mbqhd5dmvkcni4vx64sqn2b3-nix-shell.drv: build04: build04: input not substitutable: error: some references of path '/nix/store/6hbxwipydk9zksdlryw …
setup:
z2wm2ij8mbqhd5dmvkcni4vx64sqn2b3-nix-shell.drv: build04: build04: input not substitutable: error: some references of path '/nix/store/6hbxwipydk9zksdlrywzi6n2y7m5qzam-opentofu-1.12.6' could not be realised, asking the scheduler again
z2wm2ij8mbqhd5dmvkcni4vx64sqn2b3-nix-shell.drv: build04: build04: input not substitutable: error: some references of path '/nix/store/6hbxwipydk9zksdlrywzi6n2y7m5qzam-opentofu-1.12.6' could not be realised, asking the scheduler again
z2wm2ij8mbqhd5dmvkcni4vx64sqn2b3-nix-shell.drv: build04: build04: input not substitutable: error: some references of path '/nix/store/6hbxwipydk9zksdlrywzi6n2y7m5qzam-opentofu-1.12.6' could not be realised, asking the scheduler again
z2wm2ij8mbqhd5dmvkcni4vx64sqn2b3-nix-shell.drv: build04: build04: input not substitutable: error: some references of path '/nix/store/6hbxwipydk9zksdlrywzi6n2y7m5qzam-opentofu-1.12.6' could not be realised, asking the scheduler again
z2wm2ij8mbqhd5dmvkcni4vx64sqn2b3-nix-shell.drv: build04: build04: input not substitutable: error: some references of path '/nix/store/6hbxwipydk9zksdlrywzi6n2y7m5qzam-opentofu-1.12.6' could not be realised, asking the scheduler again
z2wm2ij8mbqhd5dmvkcni4vx64sqn2b3-nix-shell.drv: build04: build04: input not substitutable: error: some references of path '/nix/store/6hbxwipydk9zksdlrywzi6n2y7m5qzam-opentofu-1.12.6' could not be realised, asking the scheduler again
z2wm2ij8mbqhd5dmvkcni4vx64sqn2b3-nix-shell.drv: build04: build04: input not substitutable: error: some references of path '/nix/store/6hbxwipydk9zksdlrywzi6n2y7m5qzam-opentofu-1.12.6' could not be realised, asking the scheduler again
error: gave up after 9 reschedules
failed checks.aarch64-darwin."home-manager-enzime@hyperion-macos" 28s
setup: don't know how to build these paths: /nix/store/nphcwf1kjinx6bm93phrgaldv8lhf3sw-home-manager-generation.drv warning: ignoring the client-specified set …
setup:
don't know how to build these paths:
  /nix/store/nphcwf1kjinx6bm93phrgaldv8lhf3sw-home-manager-generation.drv
warning: ignoring the client-specified setting 'store', because it is a restricted setting and you are not a trusted user
error: gRPC QueryValidPaths on 'nix-store.geninf.io:50051' failed: error: unable to download 'https://cache.geninf.io/2hvz6slzlmw8pgv4miaia6827ffjrrp5.narinfo': HTTP error 503

              response body:

              <?xml version="1.0" encoding="UTF-8" standalone="yes"?>
              <Error>
                  <Code>SlowDown</Code>
                  <Message>Your account has made too many requests; try again later.</Message>
              </Error>
failed checks.aarch64-darwin.nix-darwin-hyperion-macos 2m 34s
setup: don't know how to build these paths: /nix/store/pk6pza6gy7y461l79j8g2yl6y95n2dd1-darwin-system-26.11.4cff07d.drv warning: ignoring the client-specified …
setup:
don't know how to build these paths:
  /nix/store/pk6pza6gy7y461l79j8g2yl6y95n2dd1-darwin-system-26.11.4cff07d.drv
warning: ignoring the client-specified setting 'store', because it is a restricted setting and you are not a trusted user
error: gRPC QueryValidPaths on 'nix-store.geninf.io:50051' failed: error: substituter 'https://cache.clan.lol' is disabled
failed checks.aarch64-darwin.package-sigma-vm 3s
setup: don't know how to build these paths: /nix/store/138qwiqp3if0j5djs7xr2mkdshh4ps8s-run-sigma-vm-on-aarch64-darwin.drv warning: ignoring the client-specif …
setup:
don't know how to build these paths:
  /nix/store/138qwiqp3if0j5djs7xr2mkdshh4ps8s-run-sigma-vm-on-aarch64-darwin.drv
warning: ignoring the client-specified setting 'store', because it is a restricted setting and you are not a trusted user
error: gRPC QueryValidPaths on 'nix-store.geninf.io:50051' failed: error: substituter 'https://cache.clan.lol' is disabled
failed checks.x86_64-linux."home-manager-enzime@phi-nixos" 1m 20s
setup: don't know how to build these paths: /nix/store/jpbwq60p4hq2j1dvdshrwglz959dlrif-home-manager-generation.drv warning: ignoring the client-specified set …
setup:
don't know how to build these paths:
  /nix/store/jpbwq60p4hq2j1dvdshrwglz959dlrif-home-manager-generation.drv
warning: ignoring the client-specified setting 'store', because it is a restricted setting and you are not a trusted user
error: gRPC QueryValidPaths on 'nix-store.geninf.io:50051' failed: error: unable to download 'https://cache.geninf.io/0z2ib68kcb3vb7jcl6dqmv0gvia85y5h.narinfo': HTTP error 503

              response body:

              <?xml version="1.0" encoding="UTF-8" standalone="yes"?>
              <Error>
                  <Code>SlowDown</Code>
                  <Message>Your account has made too many requests; try again later.</Message>
              </Error>
failed checks.x86_64-linux."home-manager-enzime@sigma" 1m 39s
setup: don't know how to build these paths: /nix/store/nnk1qq4l58klxbg3rryabhabnnfw946y-home-manager-generation.drv warning: ignoring the client-specified set …
setup:
don't know how to build these paths:
  /nix/store/nnk1qq4l58klxbg3rryabhabnnfw946y-home-manager-generation.drv
warning: ignoring the client-specified setting 'store', because it is a restricted setting and you are not a trusted user
error: gRPC QueryValidPaths on 'nix-store.geninf.io:50051' failed: error: unable to download 'https://cache.geninf.io/9b622bgb23l3pbsmjysir1ds52cqqfcb.narinfo': HTTP error 503

              response body:

              <?xml version="1.0" encoding="UTF-8" standalone="yes"?>
              <Error>
                  <Code>SlowDown</Code>
                  <Message>Your account has made too many requests; try again later.</Message>
              </Error>
failed checks.x86_64-linux.nixos-gaia 8m 48s
setup: /nix/store/84sggxlzw0adckmzzysvrajmmdl5p6qq-libcap-text-verifier-0-unstable /nix/store/4cj18ri8yyjbiragdkxm0q3y6bqr0dqs-lndir-1.0.5 /nix/store/xv8n …
setup:
  /nix/store/84sggxlzw0adckmzzysvrajmmdl5p6qq-libcap-text-verifier-0-unstable
  /nix/store/4cj18ri8yyjbiragdkxm0q3y6bqr0dqs-lndir-1.0.5
  /nix/store/xv8nd43y9zw4vcnilxbagv6zmghfnxjk-nixos-render-docs-0.0
  /nix/store/hx1j4ilpbfjmmv31w0f20agk0asjcjjz-python3.14-markdown-it-py-4.2.0
  /nix/store/ym89dm8b2bpspsk8l22b10fvnpm3h8w9-python3.14-mdit-py-plugins-0.6.1
  /nix/store/azjnwg3za27ccl8czdfsfz83x7gharz2-xkb-validated
warning: ignoring the client-specified setting 'store', because it is a restricted setting and you are not a trusted user
error: gRPC QueryValidPaths on 'nix-store.geninf.io:50051' failed: error: unable to download 'https://cache.geninf.io/368c2036xg1va9n1a522lil6pgam0w91.narinfo': HTTP error 503

              response body:

              <?xml version="1.0" encoding="UTF-8" standalone="yes"?>
              <Error>
                  <Code>SlowDown</Code>
                  <Message>Your account has made too many requests; try again later.</Message>
              </Error>
failed checks.x86_64-linux.nixos-sigma 9m 53s
setup: /nix/store/84sggxlzw0adckmzzysvrajmmdl5p6qq-libcap-text-verifier-0-unstable /nix/store/4cj18ri8yyjbiragdkxm0q3y6bqr0dqs-lndir-1.0.5 /nix/store/xv8n …
setup:
  /nix/store/84sggxlzw0adckmzzysvrajmmdl5p6qq-libcap-text-verifier-0-unstable
  /nix/store/4cj18ri8yyjbiragdkxm0q3y6bqr0dqs-lndir-1.0.5
  /nix/store/xv8nd43y9zw4vcnilxbagv6zmghfnxjk-nixos-render-docs-0.0
  /nix/store/hx1j4ilpbfjmmv31w0f20agk0asjcjjz-python3.14-markdown-it-py-4.2.0
  /nix/store/ym89dm8b2bpspsk8l22b10fvnpm3h8w9-python3.14-mdit-py-plugins-0.6.1
  /nix/store/azjnwg3za27ccl8czdfsfz83x7gharz2-xkb-validated
warning: ignoring the client-specified setting 'store', because it is a restricted setting and you are not a trusted user
error: gRPC QueryValidPaths on 'nix-store.geninf.io:50051' failed: error: unable to download 'https://cache.geninf.io/387zzplc52yvw3bvjn5jyig0jvjx5x8i.narinfo': HTTP error 503

              response body:

              <?xml version="1.0" encoding="UTF-8" standalone="yes"?>
              <Error>
                  <Code>SlowDown</Code>
                  <Message>Your account has made too many requests; try again later.</Message>
              </Error>
failed checks.x86_64-linux.package-gaia-vm 15s
setup: don't know how to build these paths: /nix/store/wgpfisq7fdl4r7js9qvpljdsppg7jqj1-run-gaia-vm-on-x86_64-linux.drv warning: ignoring the client-specified …
setup:
don't know how to build these paths:
  /nix/store/wgpfisq7fdl4r7js9qvpljdsppg7jqj1-run-gaia-vm-on-x86_64-linux.drv
warning: ignoring the client-specified setting 'store', because it is a restricted setting and you are not a trusted user
wgpfisq7fdl4r7js9qvpljdsppg7jqj1-run-gaia-vm-on-x86_64-linux.drv: error: gRPC QueryValidPaths on 'nix-store.geninf.io:50051' failed: error: substituter 'https://cache.clan.lol' is disabled
error: error: gRPC QueryValidPaths on 'nix-store.geninf.io:50051' failed: error: substituter 'https://cache.clan.lol' is disabled
failed checks.x86_64-linux.package-sigma-vm 2s
setup: don't know how to build these paths: /nix/store/nxlr16y8n33287c2v7070prr2bapci3v-run-sigma-vm-on-x86_64-linux.drv warning: ignoring the client-specifie …
setup:
don't know how to build these paths:
  /nix/store/nxlr16y8n33287c2v7070prr2bapci3v-run-sigma-vm-on-x86_64-linux.drv
warning: ignoring the client-specified setting 'store', because it is a restricted setting and you are not a trusted user
nxlr16y8n33287c2v7070prr2bapci3v-run-sigma-vm-on-x86_64-linux.drv: error: gRPC QueryValidPaths on 'nix-store.geninf.io:50051' failed: error: substituter 'https://cache.clan.lol' is disabled
error: error: gRPC QueryValidPaths on 'nix-store.geninf.io:50051' failed: error: substituter 'https://cache.clan.lol' is disabled
12 succeeded
succeeded attributes
status attribute duration
loading…
36 already built
skipped attributes
status attribute duration
loading…