nixbot

builds

Enzime/hyperconfig build #943 failed

branch next · PR #1029 · commit 648cdada68 · · took 19m 31s · eval 2m 37s

eval warnings 4 kinds · 75 occurrences
  • error unable to download 'https://cache.clan.lol/…': HTTP error 503 ×5
  • warn unable to download 'https://cache.clan.lol/…': HTTP error 503 ×60
  • warn A legacy Nextcloud install (from before NixOS 26.11) may be installed. ×2
  • warn unable to download 'https://cache.geninf.io/…': HTTP error 503 ×8

9 failed ⚠ 1
failed attributes
status attribute duration
failed checks.x86_64-linux.nixos-phi-nixos
  • A legacy Nextcloud install (from before NixOS 26.11) may be installed. After nextcloud33 is installed successfully, you can safely upgrade to 34. The latest version available is Nextcloud35. Please note that Nextcloud doesn't support upgrades across multiple major versions (i.e. an upgrade from 16 is possible to 17, but not 16 to 18). The package can be upgraded by explicitly declaring the service-option `services.nextcloud.package`.
  • A legacy Nextcloud install (from before NixOS 26.11) may be installed. After nextcloud34 is installed successfully, you can safely upgrade to 35. The latest version available is Nextcloud35. Please note that Nextcloud doesn't support upgrades across multiple major versions (i.e. an upgrade from 16 is possible to 17, but not 16 to 18). The package can be upgraded by explicitly declaring the service-option `services.nextcloud.package`.
3m 22s
setup: these 5 paths will be fetched (0.1 KiB download, 52.2 KiB unpacked): /nix/store/c50zz1zkx6bk5nrn1na754yq56pdjj89-check-sshd-config /nix/store/nb2dws4 …
setup:
these 5 paths will be fetched (0.1 KiB download, 52.2 KiB unpacked):
  /nix/store/c50zz1zkx6bk5nrn1na754yq56pdjj89-check-sshd-config
  /nix/store/nb2dws4j56b5prgv18p4bmf5ydmmks7d-install-shell-files
  /nix/store/84sggxlzw0adckmzzysvrajmmdl5p6qq-libcap-text-verifier-0-unstable
  /nix/store/4cj18ri8yyjbiragdkxm0q3y6bqr0dqs-lndir-1.0.5
  /nix/store/azjnwg3za27ccl8czdfsfz83x7gharz2-xkb-validated
warning: ignoring the client-specified setting 'store', because it is a restricted setting and you are not a trusted user
error: gRPC QueryValidPaths on 'nix-store.geninf.io:50051' failed: error: unable to download 'https://cache.geninf.io/xza3krwwq97irpvwjbg5fnrhgll3jk82.narinfo': HTTP error 503

              response body:

              <?xml version="1.0" encoding="UTF-8" standalone="yes"?>
              <Error>
                  <Code>SlowDown</Code>
                  <Message>Your account has made too many requests; try again later.</Message>
              </Error>
failed checks.aarch64-darwin."home-manager-enzime@hyperion-macos" 8m 4s
setup: /nix/store/w1jk2bhvn6sy0qpfr04dgjcy6q9ar5wj-yargs-parser-20.2.9.tgz /nix/store/35678iykcz35ak6km3ks64vgnddfjmhq-yargs-parser-22.0.0.tgz /nix/store/ …
setup:
  /nix/store/w1jk2bhvn6sy0qpfr04dgjcy6q9ar5wj-yargs-parser-20.2.9.tgz
  /nix/store/35678iykcz35ak6km3ks64vgnddfjmhq-yargs-parser-22.0.0.tgz
  /nix/store/5jjnyqgfp65dbxwpz1l1x9xy8k9qh2yb-yocto-queue-0.1.0.tgz
  /nix/store/v3ayf8is5s9c90z6bwqvsjvya4wvmsfk-yq-go-4.53.3
  /nix/store/bra080qgq3g6dn3qaf096c1acjri8gzl-zig-0.16.0
  /nix/store/aa33ni9r31y6lmad4g83iyqj6hgmvkz6-zod-3.25.76.tgz
warning: ignoring the client-specified setting 'store', because it is a restricted setting and you are not a trusted user
error: gRPC QueryValidPaths on 'nix-store.geninf.io:50051' failed: error: unable to download 'https://cache.clan.lol/hhg1jnc4khx1if5f8m09b381j7567rxq.narinfo': HTTP error 503

              response body:

              <?xml version="1.0" encoding="UTF-8" standalone="yes"?>
              <Error>
                  <Code>SlowDown</Code>
                  <Message>Your account has made too many requests; try again later.</Message>
              </Error>
failed checks.aarch64-darwin.nix-darwin-hyperion-macos 16m 52s
setup: 4p8f8y5qmparnq4blvj8iv3y7lndhnp1-home-manager-path.drv: build02: build02: input not substitutable: error: path '/nix/store/2g3gbwyb7km1l8snz1yyv9r6lrgr8z …
setup:
4p8f8y5qmparnq4blvj8iv3y7lndhnp1-home-manager-path.drv: build02: build02: input not substitutable: error: path '/nix/store/2g3gbwyb7km1l8snz1yyv9r6lrgr8zv2-dummy-fc-dir1' is required, but there is no substituter that can build it, asking the scheduler again
9wqq1d46naqakwz0cwpm7ic94xcxnb3d-home-manager-fonts.drv: build02: build02: input not substitutable: error: path '/nix/store/2g3gbwyb7km1l8snz1yyv9r6lrgr8zv2-dummy-fc-dir1' is required, but there is no substituter that can build it, asking the scheduler again
zw9qfg2h0yd76lnsrpfpj85q8xj415mf-home-manager-applications.drv: build02: build02: input not substitutable: error: path '/nix/store/2g3gbwyb7km1l8snz1yyv9r6lrgr8zv2-dummy-fc-dir1' is required, but there is no substituter that can build it, asking the scheduler again
4p8f8y5qmparnq4blvj8iv3y7lndhnp1-home-manager-path.drv: build02: build02: input not substitutable: error: path '/nix/store/2g3gbwyb7km1l8snz1yyv9r6lrgr8zv2-dummy-fc-dir1' is required, but there is no substituter that can build it, asking the scheduler again
9wqq1d46naqakwz0cwpm7ic94xcxnb3d-home-manager-fonts.drv: build02: build02: input not substitutable: error: path '/nix/store/2g3gbwyb7km1l8snz1yyv9r6lrgr8zv2-dummy-fc-dir1' is required, but there is no substituter that can build it, asking the scheduler again
zw9qfg2h0yd76lnsrpfpj85q8xj415mf-home-manager-applications.drv: build02: build02: input not substitutable: error: path '/nix/store/2g3gbwyb7km1l8snz1yyv9r6lrgr8zv2-dummy-fc-dir1' is required, but there is no substituter that can build it, asking the scheduler again
zw9qfg2h0yd76lnsrpfpj85q8xj415mf-home-manager-applications.drv: build02: build02: input not substitutable: error: path '/nix/store/2g3gbwyb7km1l8snz1yyv9r6lrgr8zv2-dummy-fc-dir1' is required, but there is no substituter that can build it, asking the scheduler again
error: dependency 'nk75dzia8mi4h9fwm2l1fnkj3h1swmgh-etc.drv' failed
failed checks.aarch64-darwin.package-gaia-vm 1m 53s
setup: don't know how to build these paths: /nix/store/sjfdblgnkmc98qxy4l51z5fwl1axl1mp-run-gaia-vm-on-aarch64-darwin.drv warning: ignoring the client-specifi …
setup:
don't know how to build these paths:
  /nix/store/sjfdblgnkmc98qxy4l51z5fwl1axl1mp-run-gaia-vm-on-aarch64-darwin.drv
warning: ignoring the client-specified setting 'store', because it is a restricted setting and you are not a trusted user
error: gRPC QueryValidPaths on 'nix-store.geninf.io:50051' failed: error: substituter 'https://cache.geninf.io' is disabled
failed checks.aarch64-linux.treefmt 1m 33s
setup: don't know how to build these paths: /nix/store/gd4cb8p5lx8wmpc7ylrv14ij9c2a830f-treefmt-check.drv warning: ignoring the client-specified setting 'stor …
setup:
don't know how to build these paths:
  /nix/store/gd4cb8p5lx8wmpc7ylrv14ij9c2a830f-treefmt-check.drv
warning: ignoring the client-specified setting 'store', because it is a restricted setting and you are not a trusted user
error: gRPC QueryValidPaths on 'nix-store.geninf.io:50051' failed: error: unable to download 'https://cache.clan.lol/w6bpr1qbcfi1ynr82dy7l2737b8p6wwr.narinfo': HTTP error 503

              response body:

              <?xml version="1.0" encoding="UTF-8" standalone="yes"?>
              <Error>
                  <Code>SlowDown</Code>
                  <Message>Your account has made too many requests; try again later.</Message>
              </Error>
failed checks.x86_64-linux."home-manager-enzime@phi-nixos" 1m 24s
setup: don't know how to build these paths: /nix/store/zp73vy16rrwcx5ygs47qp57irl6y596k-home-manager-generation.drv warning: ignoring the client-specified set …
setup:
don't know how to build these paths:
  /nix/store/zp73vy16rrwcx5ygs47qp57irl6y596k-home-manager-generation.drv
warning: ignoring the client-specified setting 'store', because it is a restricted setting and you are not a trusted user
error: gRPC QueryValidPaths on 'nix-store.geninf.io:50051' failed: error: unable to download 'https://cache.geninf.io/0nrsdkwz5h9d5vqng5dzn4k77rjlzw3a.narinfo': HTTP error 503

              response body:

              <?xml version="1.0" encoding="UTF-8" standalone="yes"?>
              <Error>
                  <Code>SlowDown</Code>
                  <Message>Your account has made too many requests; try again later.</Message>
              </Error>
failed checks.x86_64-linux.nixos-gaia 5m 2s
setup: don't know how to build these paths: /nix/store/q5bl0b93bwvyc7s47w0dda3lavb5ramy-nixos-system-gaia-26.11.20260922.b6c98e9.drv warning: ignoring the cli …
setup:
don't know how to build these paths:
  /nix/store/q5bl0b93bwvyc7s47w0dda3lavb5ramy-nixos-system-gaia-26.11.20260922.b6c98e9.drv
warning: ignoring the client-specified setting 'store', because it is a restricted setting and you are not a trusted user
error: gRPC QueryValidPaths on 'nix-store.geninf.io:50051' failed: error: unable to download 'https://cache.clan.lol/jv6l56vcg8zrz018x06jh8a1ijmj51as.narinfo': HTTP error 503

              response body:

              <?xml version="1.0" encoding="UTF-8" standalone="yes"?>
              <Error>
                  <Code>SlowDown</Code>
                  <Message>Your account has made too many requests; try again later.</Message>
              </Error>
failed checks.x86_64-linux.nixos-sigma 1m 32s
setup: don't know how to build these paths: /nix/store/g3n2ap5n9p01f4ay4kvz8vxkz6krgbdi-nixos-system-sigma-26.11.20260922.b6c98e9.drv warning: ignoring the cl …
setup:
don't know how to build these paths:
  /nix/store/g3n2ap5n9p01f4ay4kvz8vxkz6krgbdi-nixos-system-sigma-26.11.20260922.b6c98e9.drv
warning: ignoring the client-specified setting 'store', because it is a restricted setting and you are not a trusted user
error: gRPC QueryValidPaths on 'nix-store.geninf.io:50051' failed: error: unable to download 'https://cache.geninf.io/0f2qxk7dnsqmswsa0pszdkcha6k45dfn.narinfo': HTTP error 503

              response body:

              <?xml version="1.0" encoding="UTF-8" standalone="yes"?>
              <Error>
                  <Code>SlowDown</Code>
                  <Message>Your account has made too many requests; try again later.</Message>
              </Error>
failed checks.x86_64-linux.treefmt 1m 31s
setup: /nix/store/4ysif77rnvrk7clcy3zagllwgb0kgyvz-treefmt.drv /nix/store/7gjwz9mv9g4xcdijz9s3v2jappi4pgld-treefmt-check.drv these 3 paths will be fetched ( …
setup:
  /nix/store/4ysif77rnvrk7clcy3zagllwgb0kgyvz-treefmt.drv
  /nix/store/7gjwz9mv9g4xcdijz9s3v2jappi4pgld-treefmt-check.drv
these 3 paths will be fetched (0.0 KiB download, 12.9 MiB unpacked):
  /nix/store/znvkn5yky0cq9npv4xnii8dlq400lkr1-git-lfs-3.7.1
  /nix/store/37048jgy1gfkx8kafik6gk1w2yslki72-nil
  /nix/store/8jmv4kv9wmhamjxa91sfmfcn3plli21a-treefmt.toml
warning: ignoring the client-specified setting 'store', because it is a restricted setting and you are not a trusted user
error: gRPC QueryValidPaths on 'nix-store.geninf.io:50051' failed: error: substituter 'https://cache.clan.lol' is disabled
11 succeeded
succeeded attributes
status attribute duration
loading…
39 already built
skipped attributes
status attribute duration
loading…