nixbot

builds

clan/clan-core build #763 failed

branch 26.05 · PR #8138 · commit 5cff4cbdc8 · · took 13m 6s · eval 1m 30s

eval warnings 3 kinds · 9 occurrences
  • error unable to download 'https://cache.clan.lol/…': HTTP error 503 ×1
  • warn unable to download 'https://cache.clan.lol/…': HTTP error 503 ×7
  • warn unable to download 'https://cache.geninf.io/…': HTTP error 503 ×1

6 failed
failed attributes
status attribute duration
failed checks.aarch64-darwin.treefmt 8m 55s
setup: aa716477gi9adki33dm49b0wiwcn1gag-vale-styles.drv: build04: build04: input not substitutable: error: path '/nix/store/k5db0kllrqjdm96gingfmy178zg79iks-sou …
setup:
aa716477gi9adki33dm49b0wiwcn1gag-vale-styles.drv: build04: build04: input not substitutable: error: path '/nix/store/k5db0kllrqjdm96gingfmy178zg79iks-source' is required, but there is no substituter that can build it, asking the scheduler again
aa716477gi9adki33dm49b0wiwcn1gag-vale-styles.drv: build04: build04: input not substitutable: error: path '/nix/store/k5db0kllrqjdm96gingfmy178zg79iks-source' is required, but there is no substituter that can build it, asking the scheduler again
aa716477gi9adki33dm49b0wiwcn1gag-vale-styles.drv: build04: build04: input not substitutable: error: path '/nix/store/k5db0kllrqjdm96gingfmy178zg79iks-source' is required, but there is no substituter that can build it, asking the scheduler again
aa716477gi9adki33dm49b0wiwcn1gag-vale-styles.drv: build04: build04: input not substitutable: error: path '/nix/store/k5db0kllrqjdm96gingfmy178zg79iks-source' is required, but there is no substituter that can build it, asking the scheduler again
aa716477gi9adki33dm49b0wiwcn1gag-vale-styles.drv: build04: build04: input not substitutable: error: path '/nix/store/k5db0kllrqjdm96gingfmy178zg79iks-source' is required, but there is no substituter that can build it, asking the scheduler again
aa716477gi9adki33dm49b0wiwcn1gag-vale-styles.drv: build04: build04: input not substitutable: error: path '/nix/store/k5db0kllrqjdm96gingfmy178zg79iks-source' is required, but there is no substituter that can build it, asking the scheduler again
aa716477gi9adki33dm49b0wiwcn1gag-vale-styles.drv: build04: build04: input not substitutable: error: path '/nix/store/k5db0kllrqjdm96gingfmy178zg79iks-source' is required, but there is no substituter that can build it, asking the scheduler again
error: dependency 'wws6ga8jzcylxh62y5mcihsl27p7hq0n-treefmt.drv' failed
failed checks.aarch64-linux.all-packages 4m 31s
setup: /nix/store/3a3d2w2bgqxgj1cbv4q5ilzf37bgh3y3-rendered.drv /nix/store/17ranj7yz7zd8ai4n3bwv18kbpa459kk-generated-docs.drv /nix/store/5wq6ddmsrbx62ahm …
setup:
  /nix/store/3a3d2w2bgqxgj1cbv4q5ilzf37bgh3y3-rendered.drv
  /nix/store/17ranj7yz7zd8ai4n3bwv18kbpa459kk-generated-docs.drv
  /nix/store/5wq6ddmsrbx62ahmvsgdrjf90fpsmzl1-clan-site-0.0.1.drv
  /nix/store/aa0wx2j1y4bxc18abr3v2cq4w6qj4w7s-deploy-docs-v2.drv
  /nix/store/nrk4dc27b96yfmzahw4dl7pg2ihbvfdw-clan-core-flake.drv
  /nix/store/v4xganz1cxjp4apvxf5d4c28g869zzsj-all-packages.drv
warning: ignoring the client-specified setting 'store', because it is a restricted setting and you are not a trusted user
error: gRPC QueryValidPaths on 'nix-store.geninf.io:50051' failed: error: unable to download 'https://cache.geninf.io/7iz4vj4lff262klm6nbzaqn2qgf4byjf.narinfo': HTTP error 503

              response body:

              <?xml version="1.0" encoding="UTF-8" standalone="yes"?>
              <Error>
                  <Code>SlowDown</Code>
                  <Message>Your account has made too many requests; try again later.</Message>
              </Error>
failed checks.aarch64-linux.nixos-documentation 1m 47s
setup: don't know how to build these paths: /nix/store/vx0mma83ji1il3pzzd6naaqg0b3lc80k-nixos-system-test-documentation-26.05.20260921.1e8bc65.drv warning: ig …
setup:
don't know how to build these paths:
  /nix/store/vx0mma83ji1il3pzzd6naaqg0b3lc80k-nixos-system-test-documentation-26.05.20260921.1e8bc65.drv
warning: ignoring the client-specified setting 'store', because it is a restricted setting and you are not a trusted user
error: gRPC QueryValidPaths on 'nix-store.geninf.io:50051' failed: error: unable to download 'https://cache.geninf.io/c81g0gk1amsvjl6wa1rsh0a8d0436qjh.narinfo': HTTP error 503

              response body:

              <?xml version="1.0" encoding="UTF-8" standalone="yes"?>
              <Error>
                  <Code>SlowDown</Code>
                  <Message>Your account has made too many requests; try again later.</Message>
              </Error>
failed checks.aarch64-linux.treefmt 6m 13s
setup: az6210y6ds6zl7mbx437b89vb1sssl92-vale-styles.drv: build01: build01: input not substitutable: error: path '/nix/store/k5db0kllrqjdm96gingfmy178zg79iks-sou …
setup:
az6210y6ds6zl7mbx437b89vb1sssl92-vale-styles.drv: build01: build01: input not substitutable: error: path '/nix/store/k5db0kllrqjdm96gingfmy178zg79iks-source' is required, but there is no substituter that can build it, asking the scheduler again
az6210y6ds6zl7mbx437b89vb1sssl92-vale-styles.drv: build01: build01: input not substitutable: error: path '/nix/store/k5db0kllrqjdm96gingfmy178zg79iks-source' is required, but there is no substituter that can build it, asking the scheduler again
az6210y6ds6zl7mbx437b89vb1sssl92-vale-styles.drv: build01: build01: input not substitutable: error: path '/nix/store/k5db0kllrqjdm96gingfmy178zg79iks-source' is required, but there is no substituter that can build it, asking the scheduler again
az6210y6ds6zl7mbx437b89vb1sssl92-vale-styles.drv: build01: build01: input not substitutable: error: path '/nix/store/k5db0kllrqjdm96gingfmy178zg79iks-source' is required, but there is no substituter that can build it, asking the scheduler again
az6210y6ds6zl7mbx437b89vb1sssl92-vale-styles.drv: build01: build01: input not substitutable: error: path '/nix/store/k5db0kllrqjdm96gingfmy178zg79iks-source' is required, but there is no substituter that can build it, asking the scheduler again
az6210y6ds6zl7mbx437b89vb1sssl92-vale-styles.drv: build01: build01: input not substitutable: error: path '/nix/store/k5db0kllrqjdm96gingfmy178zg79iks-source' is required, but there is no substituter that can build it, asking the scheduler again
az6210y6ds6zl7mbx437b89vb1sssl92-vale-styles.drv: build01: build01: input not substitutable: error: path '/nix/store/k5db0kllrqjdm96gingfmy178zg79iks-source' is required, but there is no substituter that can build it, asking the scheduler again
error: dependency '58bjz4z5smx2dd7fdy6hlf2ldqq2j7qn-treefmt.drv' failed
failed checks.x86_64-linux.all-packages 6m 39s
setup: don't know how to build these paths: /nix/store/2jbnns0vzbinx076w70ilgrlh5aazfx2-all-packages.drv warning: ignoring the client-specified setting 'store …
setup:
don't know how to build these paths:
  /nix/store/2jbnns0vzbinx076w70ilgrlh5aazfx2-all-packages.drv
warning: ignoring the client-specified setting 'store', because it is a restricted setting and you are not a trusted user
error: gRPC QueryValidPaths on 'nix-store.geninf.io:50051' failed: error: unable to download 'https://cache.clan.lol/wajaxibgdmriq8znvh3b52bpx3yz5ajx.narinfo': HTTP error 503

              response body:

              <?xml version="1.0" encoding="UTF-8" standalone="yes"?>
              <Error>
                  <Code>SlowDown</Code>
                  <Message>Your account has made too many requests; try again later.</Message>
              </Error>
failed checks.x86_64-linux.nixos-documentation 4m 43s
setup: /nix/store/5v0ry3girplfh9hscr81vaynl3c0byrv-user-units.drv /nix/store/ppml32cxlbvd2ycvixym7kv7x1m2p7mr-unit-dbus-broker.service.drv /nix/store/xjbn …
setup:
  /nix/store/5v0ry3girplfh9hscr81vaynl3c0byrv-user-units.drv
  /nix/store/ppml32cxlbvd2ycvixym7kv7x1m2p7mr-unit-dbus-broker.service.drv
  /nix/store/xjbn7vjgpvydvmgjxli7pvrskpi890fy-system-units.drv
  /nix/store/s3921mvkwd504s7rizkqzvig3baq1crv-etc.drv
  /nix/store/fs27c6f36iwr79k1hl7gv8w7lm0c52kr-activate.drv
  /nix/store/vx0mma83ji1il3pzzd6naaqg0b3lc80k-nixos-system-test-documentation-26.05.20260921.1e8bc65.drv
warning: ignoring the client-specified setting 'store', because it is a restricted setting and you are not a trusted user
error: gRPC QueryValidPaths on 'nix-store.geninf.io:50051' failed: error: unable to download 'https://cache.clan.lol/y9gn57qpiwl48dnb5vw0q6yfs51vbwnk.narinfo': HTTP error 503

              response body:

              <?xml version="1.0" encoding="UTF-8" standalone="yes"?>
              <Error>
                  <Code>SlowDown</Code>
                  <Message>Your account has made too many requests; try again later.</Message>
              </Error>
9 succeeded
succeeded attributes
status attribute duration
loading…
150 already built
skipped attributes
status attribute duration
loading…