nixbot

builds

clan/clan-core build #764 failed

branch main · PR #8136 · commit eb0ce70970 · · took 41m 25s · eval 2m 5s

eval warnings 23 kinds · 118 occurrences
  • error Cannot build '/nix/store/…-generator-state-version.drv'. ×9
  • error Cannot build '/nix/store/…-test-vars-generated.drv'. ×11
  • error ×11
  • error Cannot build '/nix/store/…-merged-test-dir-hello-service.drv'. ×1
  • error Cannot build '/nix/store/…-merged-test-dir-localbackup.drv'. ×1
  • error Cannot build '/nix/store/…-generator-machine-id.drv'. ×1
  • error Cannot build '/nix/store/…-merged-test-dir-service-machine-id.drv'. ×1
  • error Cannot build '/nix/store/…-merged-test-dir-kde.drv'. ×1
  • error Cannot build '/nix/store/…-generator-grafana-admin.drv'. ×1
  • error Cannot build '/nix/store/…-merged-test-dir-monitoring.drv'. ×1
  • error Cannot build '/nix/store/…-merged-test-dir-nixos-test-password-store-mounts.drv'. ×1
  • error Cannot build '/nix/store/…-merged-test-dir-service-postgresql.drv'. ×1
  • error Cannot build '/nix/store/…-merged-test-dir-packages.drv'. ×1
  • error Cannot build '/nix/store/…-merged-test-dir-service-state-version.drv'. ×1
  • error Cannot build '/nix/store/…-merged-test-dir-trusted-nix-caches.drv'. ×1
  • error Cannot build '/nix/store/…-merged-test-dir-zerotier-multi-instance.drv'. ×1
  • error unable to download 'https://cache.geninf.io/…': HTTP error 503 ×4
  • warn stdenv.isDarwin is deprecated, use stdenv.hostPlatform.isDarwin instead ×2
  • warn file 'nar/0j4bang2lixa9a7ydxls6ikk2pk1lk191idqafyya1q2z8xqf6lv.nar.zst' does not exist in binary cache 'https://cache.clan.lol/…' ×1
  • warn unable to download 'https://cache.geninf.io/…': HTTP error 503 ×32
  • warn unable to download 'https://cache.clan.lol/…': HTTP error 503 ×33
  • warn file 'nar/13lq8k9a1wkav1djdagvynq8rl60g4fkk5jd0li654x6s0k5z188.nar.zst' does not exist in binary cache 'https://cache.clan.lol/…' ×1
  • warn file 'nar/00mycszhra514cjyzi6k1ldwcpm89cgmgy6r9lainq6rfysqqq0l.nar.zst' does not exist in binary cache 'https://cache.clan.lol/…' ×1

50 failed ⚠ 2
failed attributes
status attribute duration
failed checks.aarch64-linux.all-packages
  • stdenv.isDarwin is deprecated, use stdenv.hostPlatform.isDarwin instead
5m 22s
setup: /nix/store/6h8767n0lmc0r0z3a4fiyz155yxv0980-all-packages.drv warning: ignoring the client-specified setting 'store', because it is a restricted setting …
setup:
  /nix/store/6h8767n0lmc0r0z3a4fiyz155yxv0980-all-packages.drv
warning: ignoring the client-specified setting 'store', because it is a restricted setting and you are not a trusted user
lkqfkqwkz4ak87y0s3yghivpvg5459wm-clan-core-flake.drv: build01: not scheduled here: lkqfkqwkz4ak87y0s3yghivpvg5459wm-clan-core-flake.drv, asking the scheduler again
acc9mh6387wbkgv3lam45k2zvhy8zkw3-nixos-install-tools-26.11pre1078625.00455b0a3690.drv: build01: not scheduled here: acc9mh6387wbkgv3lam45k2zvhy8zkw3-nixos-install-tools-26.11pre1078625.00455b0a3690.drv, asking the scheduler again
kyqnsxnxgz6qyr3ficdbc3sgxfg0r25a-clan-cli-source.drv: error: gRPC QueryValidPaths on 'nix-store.geninf.io:50051' failed: error: substituter 'https://cache.clan.lol' is disabled
c2j5g8dqd647n1y04m1in8kpid3wfcny-disko.drv: error: gRPC QueryValidPaths on 'nix-store.geninf.io:50051' failed: error: unable to download 'https://cache.clan.lol/s2cn801ra94x0v7w2xj7rwdbxfbfbj39.narinfo': HTTP error 503

              response body:

              <?xml version="1.0" encoding="UTF-8" standalone="yes"?>
              <Error>
                  <Code>SlowDown</Code>
                  <Message>Your account has made too many requests; try again later.</Message>
              </Error>
7chran64wlxpijqqsy95zic7w7rjqggg-deploy-docs-v2.drv: error: gRPC QueryValidPaths on 'nix-store.geninf.io:50051' failed: error: substituter 'https://cache.clan.lol' is disabled
error: dependency 'a07g5hck5lx6w577jc5lrczgslnc2lym-clan-cli.drv' failed
failed checks.x86_64-linux.all-packages
  • stdenv.isDarwin is deprecated, use stdenv.hostPlatform.isDarwin instead
2m 2s
setup: /nix/store/q7w8yl0xvv04lzhbafz746mrx7d2am18-python3.14-pytokens-0.4.1 /nix/store/ijsp57jha780sjqxbl3f5phw3sqsyjd5-vscode-extensions /nix/store/7gr8 …
setup:
  /nix/store/q7w8yl0xvv04lzhbafz746mrx7d2am18-python3.14-pytokens-0.4.1
  /nix/store/ijsp57jha780sjqxbl3f5phw3sqsyjd5-vscode-extensions
  /nix/store/7gr880xcssaqc556xp0k1axb9a1357xf-vscode-extensions-json
  /nix/store/yzlpypqfp7z8j9gg6yhgcdkw6xzn1pbi-vscodium-1.126.04524
  /nix/store/81r4a5lqgycm5286rmxbsnw9fg2pyb4n-vscodium-with-extensions-1.126.04524
  /nix/store/bnm3ppcxy786lcfq6lqni25mi9svpj32-wrap-python-hook
warning: ignoring the client-specified setting 'store', because it is a restricted setting and you are not a trusted user
error: gRPC QueryValidPaths on 'nix-store.geninf.io:50051' failed: error: unable to download 'https://cache.clan.lol/hkxkw60wfqncq06m05kl7iy4755wqhb7.narinfo': HTTP error 503

              response body:

              <?xml version="1.0" encoding="UTF-8" standalone="yes"?>
              <Error>
                  <Code>SlowDown</Code>
                  <Message>Your account has made too many requests; try again later.</Message>
              </Error>
failed checks.aarch64-darwin.all-packages 3m 9s
setup: /nix/store/k0nkscni54kaq845jsxl315a7vi09mg0-python3.14-pyyaml-6.0.3 /nix/store/rbjkhfqgm33cgljr0kzbkhb7xg01an49-python3.14-typing-inspection-0.4.3 …
setup:
  /nix/store/k0nkscni54kaq845jsxl315a7vi09mg0-python3.14-pyyaml-6.0.3
  /nix/store/rbjkhfqgm33cgljr0kzbkhb7xg01an49-python3.14-typing-inspection-0.4.3
  /nix/store/3yf71hf8qyh4jdc4rqhc0f1r42xgls7p-python3.14-wheel-0.47.0
  /nix/store/0lb9f2g2qnxmhm00gldwd394l8c646wc-wrap-python-hook
  /nix/store/pzxa63mqffdvnnylzh22xgncrv5zsa3d-zerotier-tools-0.1.0
  /nix/store/pnq5zs7gd74m8vgsq85rdasr5l9lk7c7-zerotierone-1.16.0
warning: ignoring the client-specified setting 'store', because it is a restricted setting and you are not a trusted user
error: gRPC QueryValidPaths on 'nix-store.geninf.io:50051' failed: error: unable to download 'https://cache.clan.lol/81scc6dqqxyl6cdy6m4sz539h4xrgm7n.narinfo': HTTP error 503

              response body:

              <?xml version="1.0" encoding="UTF-8" standalone="yes"?>
              <Error>
                  <Code>SlowDown</Code>
                  <Message>Your account has made too many requests; try again later.</Message>
              </Error>
failed checks.aarch64-darwin.clan-pytest-with-core 3m 49s
setup: don't know how to build these paths: /nix/store/51r7wlxxs8ylsxq8ckis46ifzv6x6gzs-clan-pytest-with-core.drv warning: ignoring the client-specified setti …
setup:
don't know how to build these paths:
  /nix/store/51r7wlxxs8ylsxq8ckis46ifzv6x6gzs-clan-pytest-with-core.drv
warning: ignoring the client-specified setting 'store', because it is a restricted setting and you are not a trusted user
whjfcbqvqvsnylhgg499hiqp2m48j4r2-clan-core-flake.drv: build02: not scheduled here: whjfcbqvqvsnylhgg499hiqp2m48j4r2-clan-core-flake.drv, asking the scheduler again
7bjjhv2c0hirj6hsvvligck12qbbxn8x-closure-info.drv: error: gRPC QueryValidPaths on 'nix-store.geninf.io:50051' failed: error: unable to download 'https://cache.clan.lol/k7ypf8rmjqvarzcwp1aklmwm8xf0f8gb.narinfo': HTTP error 503

              response body:

              <?xml version="1.0" encoding="UTF-8" standalone="yes"?>
              <Error>
                  <Code>SlowDown</Code>
                  <Message>Your account has made too many requests; try again later.</Message>
              </Error>
error: dependency '7bjjhv2c0hirj6hsvvligck12qbbxn8x-closure-info.drv' failed
failed checks.aarch64-darwin.clan-pytest-without-core 7m 15s
setup: don't know how to build these paths: /nix/store/6ydd02gb5cnb055w80cb257gqlrqv71r-clan-pytest-without-core.drv warning: ignoring the client-specified se …
setup:
don't know how to build these paths:
  /nix/store/6ydd02gb5cnb055w80cb257gqlrqv71r-clan-pytest-without-core.drv
warning: ignoring the client-specified setting 'store', because it is a restricted setting and you are not a trusted user
error: gRPC QueryValidPaths on 'nix-store.geninf.io:50051' failed: error: unable to download 'https://cache.clan.lol/fbnjw9bv1d5d1jxg7lly932lzbyqc2cb.narinfo': HTTP error 503

              response body:

              <?xml version="1.0" encoding="UTF-8" standalone="yes"?>
              <Error>
                  <Code>SlowDown</Code>
                  <Message>Your account has made too many requests; try again later.</Message>
              </Error>
failed checks.aarch64-darwin.devshell 53s
setup: don't know how to build these paths: /nix/store/x2ai26xpxz69j2mb6zq4n0zhv3640g3y-check-devshell-not-depends-on-clan-cli.drv warning: ignoring the clien …
setup:
don't know how to build these paths:
  /nix/store/x2ai26xpxz69j2mb6zq4n0zhv3640g3y-check-devshell-not-depends-on-clan-cli.drv
warning: ignoring the client-specified setting 'store', because it is a restricted setting and you are not a trusted user
error: gRPC QueryValidPaths on 'nix-store.geninf.io:50051' failed: error: unable to download 'https://cache.clan.lol/4qnzqfrx8hxlfkz8jvcrwj5z2h7kar1m.narinfo': HTTP error 503

              response body:

              <?xml version="1.0" encoding="UTF-8" standalone="yes"?>
              <Error>
                  <Code>SlowDown</Code>
                  <Message>Your account has made too many requests; try again later.</Message>
              </Error>
failed checks.aarch64-darwin.devShell-clan-site 11m 56s
setup: don't know how to build these paths: /nix/store/prf57q04s526n8m4x8vir1cv5jy7fal0-nix-shell.drv warning: ignoring the client-specified setting 'store', …
setup:
don't know how to build these paths:
  /nix/store/prf57q04s526n8m4x8vir1cv5jy7fal0-nix-shell.drv
warning: ignoring the client-specified setting 'store', because it is a restricted setting and you are not a trusted user
sr2ka4a91ndanwdq2zgklyb32ig96hsp-clan-cli.drv: build04: not scheduled here: sr2ka4a91ndanwdq2zgklyb32ig96hsp-clan-cli.drv, asking the scheduler again
aa69v8yd16p3kqxif68phzcwbxjil61s-generated-docs.drv: error: gRPC QueryValidPaths on 'nix-store.geninf.io:50051' failed: error: substituter 'https://cache.clan.lol' is disabled
error: dependency 'aa69v8yd16p3kqxif68phzcwbxjil61s-generated-docs.drv' failed
failed checks.aarch64-linux.borgbackup 1m 7s
setup: don't know how to build these paths: /nix/store/1blghpf1nmy29f05xqdkycam2a0ifrb9-container-test-run-borgbackup.drv warning: ignoring the client-specifi …
setup:
don't know how to build these paths:
  /nix/store/1blghpf1nmy29f05xqdkycam2a0ifrb9-container-test-run-borgbackup.drv
warning: ignoring the client-specified setting 'store', because it is a restricted setting and you are not a trusted user
error: gRPC QueryValidPaths on 'nix-store.geninf.io:50051' failed: error: unable to download 'https://cache.geninf.io/44brvf1y4n8gmya73b3lrpfwr6aqh7w6.narinfo': HTTP error 503

              response body:

              <?xml version="1.0" encoding="UTF-8" standalone="yes"?>
              <Error>
                  <Code>SlowDown</Code>
                  <Message>Your account has made too many requests; try again later.</Message>
              </Error>
failed checks.aarch64-linux.certificates 1m 4s
setup: don't know how to build these paths: /nix/store/d5y1j2r5j3isln4sm4v65w29z040smc1-container-test-run-certificates.drv warning: ignoring the client-speci …
setup:
don't know how to build these paths:
  /nix/store/d5y1j2r5j3isln4sm4v65w29z040smc1-container-test-run-certificates.drv
warning: ignoring the client-specified setting 'store', because it is a restricted setting and you are not a trusted user
41m3h9xzmvmydjd38xf5kk7w9x64z3yr-unit-acme-order-renew-ca.foo.service.drv: error: gRPC QueryValidPaths on 'nix-store.geninf.io:50051' failed: error: substituter 'https://cache.clan.lol' is disabled
ja1fs0qanzkiawzqsf69ch1pybypbszi-unit-acme-order-renew-test.foo.service.drv: error: gRPC QueryValidPaths on 'nix-store.geninf.io:50051' failed: error: substituter 'https://cache.clan.lol' is disabled
error: dependency '4rnirfxvv89yl1fs71jiq9ywnj0sqicz-nixos-test-driver-certificates.drv' failed
failed checks.aarch64-linux.clan-site-lint 3m 24s
setup: /nix/store/w6vlxkc2wrk8qh4b84xnpdci1mv768ly-clan-site-lint.drv these 4 paths will be fetched (0.0 KiB download, 627.5 MiB unpacked): /nix/store/zhqmr …
setup:
  /nix/store/w6vlxkc2wrk8qh4b84xnpdci1mv768ly-clan-site-lint.drv
these 4 paths will be fetched (0.0 KiB download, 627.5 MiB unpacked):
  /nix/store/zhqmr0m1xdpjawphsg96wmnq63qmpcq7-1b4ce69380eed3a140896ed7995a34c6-pnpm-deps
  /nix/store/h1ca5pafv83mfrm07j9paxd9pxxqkpli-fonts.conf
  /nix/store/x5kgvnqwkmh9xp949p4711kq3d86glzg-generated-docs
  /nix/store/8s643f2yqmr095qn13phwqrilmy8bg5h-mona-sans-2.0.27
warning: ignoring the client-specified setting 'store', because it is a restricted setting and you are not a trusted user
error: gRPC QueryValidPaths on 'nix-store.geninf.io:50051' failed: error: substituter 'https://cache.clan.lol' is disabled
dependency failed checks.aarch64-linux.devshell —
failed checks.aarch64-linux.devShell-clan-cli 1m 33s
setup: don't know how to build these paths: /nix/store/rrc5jmgi3cb6rpcjnaj5dad3s4ipy76k-clan-cli.drv warning: ignoring the client-specified setting 'store', b …
setup:
don't know how to build these paths:
  /nix/store/rrc5jmgi3cb6rpcjnaj5dad3s4ipy76k-clan-cli.drv
warning: ignoring the client-specified setting 'store', because it is a restricted setting and you are not a trusted user
rrc5jmgi3cb6rpcjnaj5dad3s4ipy76k-clan-cli.drv: error: gRPC QueryValidPaths on 'nix-store.geninf.io:50051' failed: error: substituter 'https://cache.clan.lol' is disabled
error: error: gRPC QueryValidPaths on 'nix-store.geninf.io:50051' failed: error: substituter 'https://cache.clan.lol' is disabled
failed checks.aarch64-linux.devShell-default 1m 29s
setup: don't know how to build these paths: /nix/store/xkkxgh1b4mw7d3c1qb4qsam6kxp6mm03-clan.drv warning: ignoring the client-specified setting 'store', becau …
setup:
don't know how to build these paths:
  /nix/store/xkkxgh1b4mw7d3c1qb4qsam6kxp6mm03-clan.drv
warning: ignoring the client-specified setting 'store', because it is a restricted setting and you are not a trusted user
error: gRPC QueryValidPaths on 'nix-store.geninf.io:50051' failed: error: substituter 'https://cache.geninf.io' is disabled
failed checks.aarch64-linux.devShell-docs 1m 20s
setup: don't know how to build these paths: /nix/store/l5v68118kgq7yvxbz4h75xzvrf2bngba-nix-shell.drv warning: ignoring the client-specified setting 'store', …
setup:
don't know how to build these paths:
  /nix/store/l5v68118kgq7yvxbz4h75xzvrf2bngba-nix-shell.drv
warning: ignoring the client-specified setting 'store', because it is a restricted setting and you are not a trusted user
error: gRPC QueryValidPaths on 'nix-store.geninf.io:50051' failed: error: substituter 'https://cache.geninf.io' is disabled
failed checks.aarch64-linux.devShell-inventory-schema 1m 26s
setup: don't know how to build these paths: /nix/store/75wfc7zdhwnznj6r0fylfj8cpp0mxs2i-clan-inventory-schema.drv warning: ignoring the client-specified setti …
setup:
don't know how to build these paths:
  /nix/store/75wfc7zdhwnznj6r0fylfj8cpp0mxs2i-clan-inventory-schema.drv
warning: ignoring the client-specified setting 'store', because it is a restricted setting and you are not a trusted user
error: gRPC QueryValidPaths on 'nix-store.geninf.io:50051' failed: error: substituter 'https://cache.geninf.io' is disabled
failed checks.aarch64-linux.dyndns 1m 15s
setup: don't know how to build these paths: /nix/store/cg58l1ksh84vaiqn0i6q7n0qhg58bh7c-container-test-run-dyndns.drv warning: ignoring the client-specified s …
setup:
don't know how to build these paths:
  /nix/store/cg58l1ksh84vaiqn0i6q7n0qhg58bh7c-container-test-run-dyndns.drv
warning: ignoring the client-specified setting 'store', because it is a restricted setting and you are not a trusted user
error: gRPC QueryValidPaths on 'nix-store.geninf.io:50051' failed: error: substituter 'https://cache.geninf.io' is disabled
failed checks.aarch64-linux.eval-tests 5m 35s
setup: rcqjpk4lfmia2fnl1ggr0jlr56g8iyqr-evalCheck-eval-lib-resolve-module.drv: build01: not scheduled here: rcqjpk4lfmia2fnl1ggr0jlr56g8iyqr-evalCheck-eval-lib- …
setup:
rcqjpk4lfmia2fnl1ggr0jlr56g8iyqr-evalCheck-eval-lib-resolve-module.drv: build01: not scheduled here: rcqjpk4lfmia2fnl1ggr0jlr56g8iyqr-evalCheck-eval-lib-resolve-module.drv, asking the scheduler again
1arfsip6wsd9ynq0qn0lk9g6brz07viy-evalCheck-eval-module-clan-vars.drv: build01: not scheduled here: 1arfsip6wsd9ynq0qn0lk9g6brz07viy-evalCheck-eval-module-clan-vars.drv, asking the scheduler again
2qzhqabwwrb3gd6r7r6navs4z8kmv1i1-evalCheck-eval-lib-relativeDir.drv: build01: not scheduled here: 2qzhqabwwrb3gd6r7r6navs4z8kmv1i1-evalCheck-eval-lib-relativeDir.drv, asking the scheduler again
m62bdbrayxx82x5vk346fnsj27rpmjnv-evalCheck-eval-tests-zerotier.drv: build01: not scheduled here: m62bdbrayxx82x5vk346fnsj27rpmjnv-evalCheck-eval-tests-zerotier.drv, asking the scheduler again
mxr6dl2l62mh97wk73y95mdjcz9q9fzg-evalCheck-eval-tests-types.drv: build01: not scheduled here: mxr6dl2l62mh97wk73y95mdjcz9q9fzg-evalCheck-eval-tests-types.drv, asking the scheduler again
prqd2p2gklzibzpsdq26clz0mysangjj-evalCheck-lib-jsonschema-unit-tests.drv: build01: not scheduled here: prqd2p2gklzibzpsdq26clz0mysangjj-evalCheck-lib-jsonschema-unit-tests.drv, asking the scheduler again
1cpm6axsbsshzr6wgli11jzhv9lx9h8g-evalCheck-eval-tests-installer.drv: build01: not scheduled here: 1cpm6axsbsshzr6wgli11jzhv9lx9h8g-evalCheck-eval-tests-installer.drv, asking the scheduler again
error: dependency 'hx2vbj2pm9584662fmdixg8w8cx6dzb0-evalCheck-eval-tests-syncthing.drv' failed
failed eval checks.aarch64-linux.hello-service —
error: … while evaluating the attribute 'drvPath' at «https://releases.nixos.org/nixpkgs/nixpkgs-26.11pre1078625.00455b0a3690/nixexprs.tar.xz?na …
error:
       … while evaluating the attribute 'drvPath'
         at «https://releases.nixos.org/nixpkgs/nixpkgs-26.11pre1078625.00455b0a3690/nixexprs.tar.xz?narHash=sha256-rjHlujuny2I7z9j8P6RYRYyylenQX5/FXsYYUOK8ddY%3D»/lib/customisation.nix:416:11:
          415|         // {
          416|           drvPath =
             |           ^
          417|             assert condition;

       … while calling the 'derivationStrict' builtin
         at «nix-internal»/derivation-internal.nix:37:12:
           36|
           37|   strict = derivationStrict drvAttrs;
             |            ^
           38|

       … while evaluating the option `driverConfiguration.vlans':

       … while evaluating definitions from `/nix/store/6qdpccb77vmah3jywf8mrskwca05as1z-source/nixos/lib/testing/driver-configuration.nix':

       … while evaluating the option `containers.peer1.networking.interfaces':

       … while evaluating definitions from `/nix/store/6qdpccb77vmah3jywf8mrskwca05as1z-source/nixos/modules/hardware/facter/networking':

       … while evaluating the option `containers.peer1.hardware.facter.enable':

       … while evaluating the option `containers.peer1.hardware.facter.report':

       … while evaluating the option `containers.peer1.hardware.facter.reportPath':

       … while evaluating definitions from `/nix/store/5xq74m2dqmq9y7wi1as7vd989m8rhb48-source/nixosModules/clanCore/nixos-facter.nix':

       (stack trace truncated; use '--show-trace' to show the full, detailed trace)

       error: Cannot build '/nix/store/15a949chgf4lq3gg8afaacqw9ybf94y6-merged-test-dir-hello-service.drv'.
       Reason: 1 dependency failed.
       Output paths:
         /nix/store/j1mhsajhr3hykkmrb0h1pb4fphlz7zmk-merged-test-dir-hello-service
failed eval checks.aarch64-linux.kde —
error: … while evaluating the attribute 'drvPath' at «https://releases.nixos.org/nixpkgs/nixpkgs-26.11pre1078625.00455b0a3690/nixexprs.tar.xz?na …
error:
       … while evaluating the attribute 'drvPath'
         at «https://releases.nixos.org/nixpkgs/nixpkgs-26.11pre1078625.00455b0a3690/nixexprs.tar.xz?narHash=sha256-rjHlujuny2I7z9j8P6RYRYyylenQX5/FXsYYUOK8ddY%3D»/lib/customisation.nix:416:11:
          415|         // {
          416|           drvPath =
             |           ^
          417|             assert condition;

       … while calling the 'derivationStrict' builtin
         at «nix-internal»/derivation-internal.nix:37:12:
           36|
           37|   strict = derivationStrict drvAttrs;
             |            ^
           38|

       … while evaluating the option `driverConfiguration.vlans':

       … while evaluating definitions from `/nix/store/6qdpccb77vmah3jywf8mrskwca05as1z-source/nixos/lib/testing/driver-configuration.nix':

       … while evaluating the option `containers.client.networking.interfaces':

       … while evaluating definitions from `/nix/store/6qdpccb77vmah3jywf8mrskwca05as1z-source/nixos/modules/hardware/facter/networking':

       … while evaluating the option `containers.client.hardware.facter.enable':

       … while evaluating the option `containers.client.hardware.facter.report':

       … while evaluating the option `containers.client.hardware.facter.reportPath':

       … while evaluating definitions from `/nix/store/5xq74m2dqmq9y7wi1as7vd989m8rhb48-source/nixosModules/clanCore/nixos-facter.nix':

       (stack trace truncated; use '--show-trace' to show the full, detailed trace)

       error: Cannot build '/nix/store/nrphaicbbjvdczs7gxg3wxacxnzkd1gg-merged-test-dir-kde.drv'.
       Reason: 1 dependency failed.
       Output paths:
         /nix/store/adrkf0xgnr4l9839z3wkjvdhmd4c8gs1-merged-test-dir-kde
failed eval checks.aarch64-linux.localbackup —
error: … while evaluating the attribute 'drvPath' at «https://releases.nixos.org/nixpkgs/nixpkgs-26.11pre1078625.00455b0a3690/nixexprs.tar.xz?na …
error:
       … while evaluating the attribute 'drvPath'
         at «https://releases.nixos.org/nixpkgs/nixpkgs-26.11pre1078625.00455b0a3690/nixexprs.tar.xz?narHash=sha256-rjHlujuny2I7z9j8P6RYRYyylenQX5/FXsYYUOK8ddY%3D»/lib/customisation.nix:416:11:
          415|         // {
          416|           drvPath =
             |           ^
          417|             assert condition;

       … while calling the 'derivationStrict' builtin
         at «nix-internal»/derivation-internal.nix:37:12:
           36|
           37|   strict = derivationStrict drvAttrs;
             |            ^
           38|

       … while evaluating the option `driverConfiguration.vlans':

       … while evaluating definitions from `/nix/store/6qdpccb77vmah3jywf8mrskwca05as1z-source/nixos/lib/testing/driver-configuration.nix':

       … while evaluating the option `containers.machine.networking.interfaces':

       … while evaluating definitions from `/nix/store/6qdpccb77vmah3jywf8mrskwca05as1z-source/nixos/modules/hardware/facter/networking':

       … while evaluating the option `containers.machine.hardware.facter.enable':

       … while evaluating the option `containers.machine.hardware.facter.report':

       … while evaluating the option `containers.machine.hardware.facter.reportPath':

       … while evaluating definitions from `/nix/store/5xq74m2dqmq9y7wi1as7vd989m8rhb48-source/nixosModules/clanCore/nixos-facter.nix':

       (stack trace truncated; use '--show-trace' to show the full, detailed trace)

       error: Cannot build '/nix/store/3ggbd2jpcfxaba1yc91vvay0p59sl3x4-merged-test-dir-localbackup.drv'.
       Reason: 1 dependency failed.
       Output paths:
         /nix/store/z8h2byqv64ap17iz2cqb0q7175bj07r2-merged-test-dir-localbackup
failed eval checks.aarch64-linux.machine-id —
error: … while evaluating the attribute 'drvPath' at «https://releases.nixos.org/nixpkgs/nixpkgs-26.11pre1078625.00455b0a3690/nixexprs.tar.xz?na …
error:
       … while evaluating the attribute 'drvPath'
         at «https://releases.nixos.org/nixpkgs/nixpkgs-26.11pre1078625.00455b0a3690/nixexprs.tar.xz?narHash=sha256-rjHlujuny2I7z9j8P6RYRYyylenQX5/FXsYYUOK8ddY%3D»/lib/customisation.nix:416:11:
          415|         // {
          416|           drvPath =
             |           ^
          417|             assert condition;

       … while calling the 'derivationStrict' builtin
         at «nix-internal»/derivation-internal.nix:37:12:
           36|
           37|   strict = derivationStrict drvAttrs;
             |            ^
           38|

       … while evaluating the option `driverConfiguration.vlans':

       … while evaluating definitions from `/nix/store/6qdpccb77vmah3jywf8mrskwca05as1z-source/nixos/lib/testing/driver-configuration.nix':

       … while evaluating the option `containers.server.networking.interfaces':

       … while evaluating definitions from `/nix/store/6qdpccb77vmah3jywf8mrskwca05as1z-source/nixos/modules/hardware/facter/networking':

       … while evaluating the option `containers.server.hardware.facter.enable':

       … while evaluating the option `containers.server.hardware.facter.report':

       … while evaluating the option `containers.server.hardware.facter.reportPath':

       … while evaluating definitions from `/nix/store/5xq74m2dqmq9y7wi1as7vd989m8rhb48-source/nixosModules/clanCore/nixos-facter.nix':

       (stack trace truncated; use '--show-trace' to show the full, detailed trace)

       error: Cannot build '/nix/store/9b3gd9v67ffz0vd6h7hqk4nzy4dry8cb-merged-test-dir-service-machine-id.drv'.
       Reason: 1 dependency failed.
       Output paths:
         /nix/store/frx9ga4m7nbqry1ci6n9rxphd8b522al-merged-test-dir-service-machine-id
failed checks.aarch64-linux.matrix-synapse 1m 1s
setup: 73h494m59gflizrw2843ag3i56h597w7-element-web-with-config.drv: error: gRPC QueryValidPaths on 'nix-store.geninf.io:50051' failed: error: substituter 'http …
setup:
73h494m59gflizrw2843ag3i56h597w7-element-web-with-config.drv: error: gRPC QueryValidPaths on 'nix-store.geninf.io:50051' failed: error: substituter 'https://cache.clan.lol' is disabled
4sigs8vlw3hcbzrlfxbydyzcgg1nnbyj-unit-script-postgresql-post-start.drv: error: gRPC QueryValidPaths on 'nix-store.geninf.io:50051' failed: error: substituter 'https://cache.clan.lol' is disabled
46p09n49kmbxzmwhixjfvg7y06d3ryh3-users-groups.json.drv: error: gRPC QueryValidPaths on 'nix-store.geninf.io:50051' failed: error: substituter 'https://cache.clan.lol' is disabled
pp5lvgr73wc0vl7fj9jwx3lgyqj5j50n-generator-matrix-synapse.drv: error: gRPC QueryValidPaths on 'nix-store.geninf.io:50051' failed: error: substituter 'https://cache.clan.lol' is disabled
06b0pps6kqbval7zjgshdx5rdx20hsyr-generator-matrix-password-admin.drv: error: gRPC QueryValidPaths on 'nix-store.geninf.io:50051' failed: error: substituter 'https://cache.clan.lol' is disabled
98yp5brxfhfbxmz7l8c81hlpxysh40bh-extra-hosts.drv: error: gRPC QueryValidPaths on 'nix-store.geninf.io:50051' failed: error: substituter 'https://cache.clan.lol' is disabled
2x78gicxj7ywwal7vn7gh1v9av0n60mw-test-script.drv: error: gRPC QueryValidPaths on 'nix-store.geninf.io:50051' failed: error: substituter 'https://cache.clan.lol' is disabled
error: dependency 'm008vn6rnkhfb98lciqgwigpv80d84w5-nixos-test-driver-matrix-synapse.drv' failed
failed eval checks.aarch64-linux.monitoring —
error: … while evaluating the attribute 'drvPath' at «https://releases.nixos.org/nixpkgs/nixpkgs-26.11pre1078625.00455b0a3690/nixexprs.tar.xz?na …
error:
       … while evaluating the attribute 'drvPath'
         at «https://releases.nixos.org/nixpkgs/nixpkgs-26.11pre1078625.00455b0a3690/nixexprs.tar.xz?narHash=sha256-rjHlujuny2I7z9j8P6RYRYyylenQX5/FXsYYUOK8ddY%3D»/lib/customisation.nix:416:11:
          415|         // {
          416|           drvPath =
             |           ^
          417|             assert condition;

       … while calling the 'derivationStrict' builtin
         at «nix-internal»/derivation-internal.nix:37:12:
           36|
           37|   strict = derivationStrict drvAttrs;
             |            ^
           38|

       … while evaluating the option `driverConfiguration.vlans':

       … while evaluating definitions from `/nix/store/6qdpccb77vmah3jywf8mrskwca05as1z-source/nixos/lib/testing/driver-configuration.nix':

       … while evaluating the option `containers.machine1.networking.interfaces':

       … while evaluating definitions from `/nix/store/6qdpccb77vmah3jywf8mrskwca05as1z-source/nixos/modules/hardware/facter/networking':

       … while evaluating the option `containers.machine1.hardware.facter.enable':

       … while evaluating the option `containers.machine1.hardware.facter.report':

       … while evaluating the option `containers.machine1.hardware.facter.reportPath':

       … while evaluating definitions from `/nix/store/5xq74m2dqmq9y7wi1as7vd989m8rhb48-source/nixosModules/clanCore/nixos-facter.nix':

       (stack trace truncated; use '--show-trace' to show the full, detailed trace)

       error: Cannot build '/nix/store/lla6dvjyh7fry2igkcq6sf5qlrh51gv6-merged-test-dir-monitoring.drv'.
       Reason: 1 dependency failed.
       Output paths:
         /nix/store/px1qlq8mwwdrqaw83smbzz892kj79xba-merged-test-dir-monitoring
failed checks.aarch64-linux.nixos-documentation 9m 33s
setup: don't know how to build these paths: /nix/store/jfw7918ac9lfhxlhazbfvqj39p9qfz29-nixos-system-test-documentation-26.11.20260923.00455b0.drv warning: ig …
setup:
don't know how to build these paths:
  /nix/store/jfw7918ac9lfhxlhazbfvqj39p9qfz29-nixos-system-test-documentation-26.11.20260923.00455b0.drv
warning: ignoring the client-specified setting 'store', because it is a restricted setting and you are not a trusted user
75q2pc2kz7x5vrc1qb4v846jy2n6l05n-boot.json.drv: gi-build-x86-02: not scheduled here: 75q2pc2kz7x5vrc1qb4v846jy2n6l05n-boot.json.drv, asking the scheduler again
0ncyc24gjnxysb790rd81yyqjmswf9n9-issue.drv: error: gRPC QueryValidPaths on 'nix-store.geninf.io:50051' failed: error: substituter 'https://cache.clan.lol' is disabled
b19l21wr5yqlhwc4bz22mv48sx82acml-nixos-configuration-reference-manpage.drv: error: gRPC QueryValidPaths on 'nix-store.geninf.io:50051' failed: error: substituter 'https://cache.clan.lol' is disabled
shjj4nwic57d2ff2yhd6f3wbyw3lic2x-unit-generate-shutdown-ramfs.service.drv: error: gRPC QueryValidPaths on 'nix-store.geninf.io:50051' failed: error: substituter 'https://cache.clan.lol' is disabled
error: dependency '8wj1qwp1xsaryc2mxz93fj0wcah6mfa2-system-path.drv' failed
failed checks.aarch64-linux.nixos-flash-installer 16m 32s
setup: don't know how to build these paths: /nix/store/15w9f7nal46861i4vcx1x441wjlr92iq-nixos-system-flash-installer-26.11.20260923.00455b0.drv warning: ignor …
setup:
don't know how to build these paths:
  /nix/store/15w9f7nal46861i4vcx1x441wjlr92iq-nixos-system-flash-installer-26.11.20260923.00455b0.drv
warning: ignoring the client-specified setting 'store', because it is a restricted setting and you are not a trusted user
rnb56966rwrjb3v2ni8kj1z8182sc234-system-path.drv: error: gRPC QueryValidPaths on 'nix-store.geninf.io:50051' failed: error: substituter 'https://cache.clan.lol' is disabled
error: dependency 'rnb56966rwrjb3v2ni8kj1z8182sc234-system-path.drv' failed
failed eval checks.aarch64-linux.nixos-test-password-store-mounts —
error: … while evaluating the attribute 'drvPath' at «https://releases.nixos.org/nixpkgs/nixpkgs-26.11pre1078625.00455b0a3690/nixexprs.tar.xz?na …
error:
       … while evaluating the attribute 'drvPath'
         at «https://releases.nixos.org/nixpkgs/nixpkgs-26.11pre1078625.00455b0a3690/nixexprs.tar.xz?narHash=sha256-rjHlujuny2I7z9j8P6RYRYyylenQX5/FXsYYUOK8ddY%3D»/lib/customisation.nix:416:11:
          415|         // {
          416|           drvPath =
             |           ^
          417|             assert condition;

       … while calling the 'derivationStrict' builtin
         at «nix-internal»/derivation-internal.nix:37:12:
           36|
           37|   strict = derivationStrict drvAttrs;
             |            ^
           38|

       … while evaluating the option `driverConfiguration.vlans':

       … while evaluating definitions from `/nix/store/6qdpccb77vmah3jywf8mrskwca05as1z-source/nixos/lib/testing/driver-configuration.nix':

       … while evaluating the option `nodes.machine.networking.interfaces':

       … while evaluating definitions from `/nix/store/6qdpccb77vmah3jywf8mrskwca05as1z-source/nixos/modules/hardware/facter/networking':

       … while evaluating the option `nodes.machine.hardware.facter.enable':

       … while evaluating the option `nodes.machine.hardware.facter.report':

       … while evaluating the option `nodes.machine.hardware.facter.reportPath':

       … while evaluating definitions from `/nix/store/5xq74m2dqmq9y7wi1as7vd989m8rhb48-source/nixosModules/clanCore/nixos-facter.nix':

       (stack trace truncated; use '--show-trace' to show the full, detailed trace)

       error: Cannot build '/nix/store/f8dhid1g8f4xyrk2j26mxk00b1y1ad13-merged-test-dir-nixos-test-password-store-mounts.drv'.
       Reason: 1 dependency failed.
       Output paths:
         /nix/store/7z7p2lidw3fvpbqf15h7xr7p03g33jjz-merged-test-dir-nixos-test-password-store-mounts
failed eval checks.aarch64-linux.packages —
error: … while evaluating the attribute 'drvPath' at «https://releases.nixos.org/nixpkgs/nixpkgs-26.11pre1078625.00455b0a3690/nixexprs.tar.xz?na …
error:
       … while evaluating the attribute 'drvPath'
         at «https://releases.nixos.org/nixpkgs/nixpkgs-26.11pre1078625.00455b0a3690/nixexprs.tar.xz?narHash=sha256-rjHlujuny2I7z9j8P6RYRYyylenQX5/FXsYYUOK8ddY%3D»/lib/customisation.nix:416:11:
          415|         // {
          416|           drvPath =
             |           ^
          417|             assert condition;

       … while calling the 'derivationStrict' builtin
         at «nix-internal»/derivation-internal.nix:37:12:
           36|
           37|   strict = derivationStrict drvAttrs;
             |            ^
           38|

       … while evaluating the option `driverConfiguration.vlans':

       … while evaluating definitions from `/nix/store/6qdpccb77vmah3jywf8mrskwca05as1z-source/nixos/lib/testing/driver-configuration.nix':

       … while evaluating the option `containers.server.networking.interfaces':

       … while evaluating definitions from `/nix/store/6qdpccb77vmah3jywf8mrskwca05as1z-source/nixos/modules/hardware/facter/networking':

       … while evaluating the option `containers.server.hardware.facter.enable':

       … while evaluating the option `containers.server.hardware.facter.report':

       … while evaluating the option `containers.server.hardware.facter.reportPath':

       … while evaluating definitions from `/nix/store/5xq74m2dqmq9y7wi1as7vd989m8rhb48-source/nixosModules/clanCore/nixos-facter.nix':

       (stack trace truncated; use '--show-trace' to show the full, detailed trace)

       error: Cannot build '/nix/store/520mx12zld0j5ja9jdvr05lg26zh7xwi-merged-test-dir-packages.drv'.
       Reason: 1 dependency failed.
       Output paths:
         /nix/store/28vmfx1hjzh0g8g6s2vamb1wwa0c4mwk-merged-test-dir-packages
failed eval checks.aarch64-linux.postgresql —
error: … while evaluating the attribute 'drvPath' at «https://releases.nixos.org/nixpkgs/nixpkgs-26.11pre1078625.00455b0a3690/nixexprs.tar.xz?na …
error:
       … while evaluating the attribute 'drvPath'
         at «https://releases.nixos.org/nixpkgs/nixpkgs-26.11pre1078625.00455b0a3690/nixexprs.tar.xz?narHash=sha256-rjHlujuny2I7z9j8P6RYRYyylenQX5/FXsYYUOK8ddY%3D»/lib/customisation.nix:416:11:
          415|         // {
          416|           drvPath =
             |           ^
          417|             assert condition;

       … while calling the 'derivationStrict' builtin
         at «nix-internal»/derivation-internal.nix:37:12:
           36|
           37|   strict = derivationStrict drvAttrs;
             |            ^
           38|

       … while evaluating the option `driverConfiguration.vlans':

       … while evaluating definitions from `/nix/store/6qdpccb77vmah3jywf8mrskwca05as1z-source/nixos/lib/testing/driver-configuration.nix':

       … while evaluating the option `containers.machine.networking.interfaces':

       … while evaluating definitions from `/nix/store/6qdpccb77vmah3jywf8mrskwca05as1z-source/nixos/modules/hardware/facter/networking':

       … while evaluating the option `containers.machine.hardware.facter.enable':

       … while evaluating the option `containers.machine.hardware.facter.report':

       … while evaluating the option `containers.machine.hardware.facter.reportPath':

       … while evaluating definitions from `/nix/store/5xq74m2dqmq9y7wi1as7vd989m8rhb48-source/nixosModules/clanCore/nixos-facter.nix':

       (stack trace truncated; use '--show-trace' to show the full, detailed trace)

       error: Cannot build '/nix/store/za03x3iaia4gkjx2r4s7hhw380cgyhif-merged-test-dir-service-postgresql.drv'.
       Reason: 1 dependency failed.
       Output paths:
         /nix/store/2iqf0d0hz72f6x81s1a2mc9dvnhgiw5p-merged-test-dir-service-postgresql
failed checks.aarch64-linux.service-dummy-test-from-flake 5m 32s
setup: don't know how to build these paths: /nix/store/j8gxgkqj0b3k5ps24f40h2icjvlx9pmg-container-test-run-service-dummy-test-from-flake.drv warning: ignoring …
setup:
don't know how to build these paths:
  /nix/store/j8gxgkqj0b3k5ps24f40h2icjvlx9pmg-container-test-run-service-dummy-test-from-flake.drv
warning: ignoring the client-specified setting 'store', because it is a restricted setting and you are not a trusted user
shv2g4zfzhxh17ga2ac8hr183s7g4xnz-offline-flake-for-test-service-dummy-test-from-flake.drv: error: gRPC QueryValidPaths on 'nix-store.geninf.io:50051' failed: error: substituter 'https://cache.clan.lol' is disabled
error: dependency '6g8hqgkbdjf0zyg9482xx5fzq4s2s7bl-nixos-test-driver-service-dummy-test-from-flake.drv' failed
failed eval checks.aarch64-linux.state-version —
error: … while evaluating the attribute 'drvPath' at «https://releases.nixos.org/nixpkgs/nixpkgs-26.11pre1078625.00455b0a3690/nixexprs.tar.xz?na …
error:
       … while evaluating the attribute 'drvPath'
         at «https://releases.nixos.org/nixpkgs/nixpkgs-26.11pre1078625.00455b0a3690/nixexprs.tar.xz?narHash=sha256-rjHlujuny2I7z9j8P6RYRYyylenQX5/FXsYYUOK8ddY%3D»/lib/customisation.nix:416:11:
          415|         // {
          416|           drvPath =
             |           ^
          417|             assert condition;

       … while calling the 'derivationStrict' builtin
         at «nix-internal»/derivation-internal.nix:37:12:
           36|
           37|   strict = derivationStrict drvAttrs;
             |            ^
           38|

       … while evaluating the option `driverConfiguration.vlans':

       … while evaluating definitions from `/nix/store/6qdpccb77vmah3jywf8mrskwca05as1z-source/nixos/lib/testing/driver-configuration.nix':

       … while evaluating the option `containers.server.networking.interfaces':

       … while evaluating definitions from `/nix/store/6qdpccb77vmah3jywf8mrskwca05as1z-source/nixos/modules/hardware/facter/networking':

       … while evaluating the option `containers.server.hardware.facter.enable':

       … while evaluating the option `containers.server.hardware.facter.report':

       … while evaluating the option `containers.server.hardware.facter.reportPath':

       … while evaluating definitions from `/nix/store/5xq74m2dqmq9y7wi1as7vd989m8rhb48-source/nixosModules/clanCore/nixos-facter.nix':

       (stack trace truncated; use '--show-trace' to show the full, detailed trace)

       error: Cannot build '/nix/store/yb9y787327fibhbqin9m7c4b8iywlbpc-merged-test-dir-service-state-version.drv'.
       Reason: 1 dependency failed.
       Output paths:
         /nix/store/nk9rm7knk8rngd5kpqdp9qj7hcrqqldj-merged-test-dir-service-state-version
failed checks.aarch64-linux.treefmt 1m 14s
setup: this derivation will be built: /nix/store/1bl5qi5p15723wixyb84k1gcx2fka44k-treefmt-check.drv this path will be fetched (0.0 KiB download, 12.0 MiB unpa …
setup:
this derivation will be built:
  /nix/store/1bl5qi5p15723wixyb84k1gcx2fka44k-treefmt-check.drv
this path will be fetched (0.0 KiB download, 12.0 MiB unpacked):
  /nix/store/h5dhbjm8kw8yqqkr38gxbrv0lldby4ww-git-lfs-3.7.1
warning: ignoring the client-specified setting 'store', because it is a restricted setting and you are not a trusted user
1bl5qi5p15723wixyb84k1gcx2fka44k-treefmt-check.drv: error: gRPC QueryValidPaths on 'nix-store.geninf.io:50051' failed: error: substituter 'https://cache.clan.lol' is disabled
error: error: gRPC QueryValidPaths on 'nix-store.geninf.io:50051' failed: error: substituter 'https://cache.clan.lol' is disabled
failed eval checks.aarch64-linux.trusted-nix-caches —
error: … while evaluating the attribute 'drvPath' at «https://releases.nixos.org/nixpkgs/nixpkgs-26.11pre1078625.00455b0a3690/nixexprs.tar.xz?na …
error:
       … while evaluating the attribute 'drvPath'
         at «https://releases.nixos.org/nixpkgs/nixpkgs-26.11pre1078625.00455b0a3690/nixexprs.tar.xz?narHash=sha256-rjHlujuny2I7z9j8P6RYRYyylenQX5/FXsYYUOK8ddY%3D»/lib/customisation.nix:416:11:
          415|         // {
          416|           drvPath =
             |           ^
          417|             assert condition;

       … while calling the 'derivationStrict' builtin
         at «nix-internal»/derivation-internal.nix:37:12:
           36|
           37|   strict = derivationStrict drvAttrs;
             |            ^
           38|

       … while evaluating the option `driverConfiguration.vlans':

       … while evaluating definitions from `/nix/store/6qdpccb77vmah3jywf8mrskwca05as1z-source/nixos/lib/testing/driver-configuration.nix':

       … while evaluating the option `containers.server.networking.interfaces':

       … while evaluating definitions from `/nix/store/6qdpccb77vmah3jywf8mrskwca05as1z-source/nixos/modules/hardware/facter/networking':

       … while evaluating the option `containers.server.hardware.facter.enable':

       … while evaluating the option `containers.server.hardware.facter.report':

       … while evaluating the option `containers.server.hardware.facter.reportPath':

       … while evaluating definitions from `/nix/store/5xq74m2dqmq9y7wi1as7vd989m8rhb48-source/nixosModules/clanCore/nixos-facter.nix':

       (stack trace truncated; use '--show-trace' to show the full, detailed trace)

       error: Cannot build '/nix/store/w4dg2xppmnynkhfpgibi5dfisgf1yyab-merged-test-dir-trusted-nix-caches.drv'.
       Reason: 1 dependency failed.
       Output paths:
         /nix/store/wjyjng3hnwl4ckhpmc6rji40dmxz7j9x-merged-test-dir-trusted-nix-caches
failed eval checks.aarch64-linux.zerotier-multi-instance —
error: … while evaluating the attribute 'drvPath' at «https://releases.nixos.org/nixpkgs/nixpkgs-26.11pre1078625.00455b0a3690/nixexprs.tar.xz?na …
error:
       … while evaluating the attribute 'drvPath'
         at «https://releases.nixos.org/nixpkgs/nixpkgs-26.11pre1078625.00455b0a3690/nixexprs.tar.xz?narHash=sha256-rjHlujuny2I7z9j8P6RYRYyylenQX5/FXsYYUOK8ddY%3D»/lib/customisation.nix:416:11:
          415|         // {
          416|           drvPath =
             |           ^
          417|             assert condition;

       … while calling the 'derivationStrict' builtin
         at «nix-internal»/derivation-internal.nix:37:12:
           36|
           37|   strict = derivationStrict drvAttrs;
             |            ^
           38|

       … while evaluating the option `driverConfiguration.vlans':

       … while evaluating definitions from `/nix/store/6qdpccb77vmah3jywf8mrskwca05as1z-source/nixos/lib/testing/driver-configuration.nix':

       … while evaluating the option `nodes.alpha.networking.interfaces':

       … while evaluating definitions from `/nix/store/6qdpccb77vmah3jywf8mrskwca05as1z-source/nixos/modules/hardware/facter/networking':

       … while evaluating the option `nodes.alpha.hardware.facter.enable':

       … while evaluating the option `nodes.alpha.hardware.facter.report':

       … while evaluating the option `nodes.alpha.hardware.facter.reportPath':

       … while evaluating definitions from `/nix/store/5xq74m2dqmq9y7wi1as7vd989m8rhb48-source/nixosModules/clanCore/nixos-facter.nix':

       (stack trace truncated; use '--show-trace' to show the full, detailed trace)

       error: Cannot build '/nix/store/n5vdssnsa6vrczhzwcfkjws152xaj56j-merged-test-dir-zerotier-multi-instance.drv'.
       Reason: 1 dependency failed.
       Output paths:
         /nix/store/80d1ci4qhghb4kgppg9cpbaw7f4dm1y1-merged-test-dir-zerotier-multi-instance
failed checks.x86_64-linux.clan-pytest-without-core 1m 16s
setup: don't know how to build these paths: /nix/store/c6hdrx8df0mjybr3jjqin229xyysvs9v-clan-pytest-without-core.drv warning: ignoring the client-specified se …
setup:
don't know how to build these paths:
  /nix/store/c6hdrx8df0mjybr3jjqin229xyysvs9v-clan-pytest-without-core.drv
warning: ignoring the client-specified setting 'store', because it is a restricted setting and you are not a trusted user
k3dfvysdby0zqdk0jvs60d9ala2k1jrq-clan-runtime.drv: error: gRPC QueryValidPaths on 'nix-store.geninf.io:50051' failed: error: substituter 'https://cache.clan.lol' is disabled
error: dependency '8bi3vlbzssgapshakr5qjkfxkaxkl0pi-clan-cli-source.drv' failed
failed checks.x86_64-linux.clan-site-lint 6m 37s
setup: don't know how to build these paths: /nix/store/089nz5anyaqpcmmbyy9la1favsaaj1w9-clan-site-lint.drv warning: ignoring the client-specified setting 'sto …
setup:
don't know how to build these paths:
  /nix/store/089nz5anyaqpcmmbyy9la1favsaaj1w9-clan-site-lint.drv
warning: ignoring the client-specified setting 'store', because it is a restricted setting and you are not a trusted user
k3dfvysdby0zqdk0jvs60d9ala2k1jrq-clan-runtime.drv: error: gRPC QueryValidPaths on 'nix-store.geninf.io:50051' failed: error: substituter 'https://cache.clan.lol' is disabled
error: dependency 'mnhhrsg06imdf1qz6zr6925gp7ykr6fh-generated-docs.drv' failed
failed checks.x86_64-linux.clan-test-update 7m 22s
setup: don't know how to build these paths: /nix/store/yai1fxr1hnn6bl5q9nndymn3xc16ygp3-vm-test-run-clan-test-update.drv warning: ignoring the client-specifie …
setup:
don't know how to build these paths:
  /nix/store/yai1fxr1hnn6bl5q9nndymn3xc16ygp3-vm-test-run-clan-test-update.drv
warning: ignoring the client-specified setting 'store', because it is a restricted setting and you are not a trusted user
error: gRPC QueryValidPaths on 'nix-store.geninf.io:50051' failed: error: substituter 'https://cache.clan.lol' is disabled
dependency failed checks.x86_64-linux.devshell —
failed checks.x86_64-linux.devShell-clan-site 1m 57s
setup: don't know how to build these paths: /nix/store/gvcbkkafspib5x6z9fwcq45d1951ykd1-nix-shell.drv warning: ignoring the client-specified setting 'store', …
setup:
don't know how to build these paths:
  /nix/store/gvcbkkafspib5x6z9fwcq45d1951ykd1-nix-shell.drv
warning: ignoring the client-specified setting 'store', because it is a restricted setting and you are not a trusted user
error: gRPC QueryValidPaths on 'nix-store.geninf.io:50051' failed: error: substituter 'https://cache.clan.lol' is disabled
failed checks.x86_64-linux.devShell-default 6m 23s
setup: these 2 derivations will be built: /nix/store/g2ssr795350dch3fq0gghfjw7w6ghsz5-clan.drv /nix/store/k3dfvysdby0zqdk0jvs60d9ala2k1jrq-clan-runtime.drv …
setup:
these 2 derivations will be built:
  /nix/store/g2ssr795350dch3fq0gghfjw7w6ghsz5-clan.drv
  /nix/store/k3dfvysdby0zqdk0jvs60d9ala2k1jrq-clan-runtime.drv
warning: ignoring the client-specified setting 'store', because it is a restricted setting and you are not a trusted user
error: gRPC QueryValidPaths on 'nix-store.geninf.io:50051' failed: error: substituter 'https://cache.clan.lol' is disabled
failed checks.x86_64-linux.devShell-inventory-schema 1m 58s
setup: these 2 derivations will be built: /nix/store/k3dfvysdby0zqdk0jvs60d9ala2k1jrq-clan-runtime.drv /nix/store/c2z60ipp609myy8rwr9cy8r0icwdgg5j-clan-inve …
setup:
these 2 derivations will be built:
  /nix/store/k3dfvysdby0zqdk0jvs60d9ala2k1jrq-clan-runtime.drv
  /nix/store/c2z60ipp609myy8rwr9cy8r0icwdgg5j-clan-inventory-schema.drv
warning: ignoring the client-specified setting 'store', because it is a restricted setting and you are not a trusted user
error: gRPC QueryValidPaths on 'nix-store.geninf.io:50051' failed: error: substituter 'https://cache.clan.lol' is disabled
failed checks.x86_64-linux.dm-dns 21m 4s
setup: spg9qv9frbxrqzqpmh0ic6in6rhw0zn0-dm.toml.drv: error: gRPC QueryValidPaths on 'nix-store.geninf.io:50051' failed: error: substituter 'https://cache.clan.l …
setup:
spg9qv9frbxrqzqpmh0ic6in6rhw0zn0-dm.toml.drv: error: gRPC QueryValidPaths on 'nix-store.geninf.io:50051' failed: error: substituter 'https://cache.clan.lol' is disabled
619yp6azrh2jsi284ihbdn3mabpp439v-unbound.conf.drv: error: gRPC QueryValidPaths on 'nix-store.geninf.io:50051' failed: error: substituter 'https://cache.clan.lol' is disabled
9n5b8hy0w2b3zf3s7agj719nqcbm9hac-generator-data-mesher-network.drv: error: gRPC QueryValidPaths on 'nix-store.geninf.io:50051' failed: error: substituter 'https://cache.clan.lol' is disabled
qx55nqib8k90rp8p13zpz8a436wi2ix7-unbound.conf.drv: error: gRPC QueryValidPaths on 'nix-store.geninf.io:50051' failed: error: substituter 'https://cache.clan.lol' is disabled
jzpbhwygbmlbriq939a6nv6awm395r7k-X-Reload-Triggers-systemd-resolved.drv: gi-build-x86-02: not scheduled here: jzpbhwygbmlbriq939a6nv6awm395r7k-X-Reload-Triggers-systemd-resolved.drv, asking the scheduler again
bxg19m38flywhy21n7d9pvyrsh9vzcim-X-Restart-Triggers-data-mesher.drv: gi-build-x86-02: not scheduled here: bxg19m38flywhy21n7d9pvyrsh9vzcim-X-Restart-Triggers-data-mesher.drv, asking the scheduler again
9c12an8gp48cihnh7sfr3yy2r397xl66-unit-data-mesher.service.drv: error: gRPC QueryValidPaths on 'nix-store.geninf.io:50051' failed: error: substituter 'https://cache.clan.lol' is disabled
error: dependency '4ln05xxp38ysncrrrz6pwjya9afyxn7h-nixos-test-driver-dm-dns.drv' failed
failed checks.x86_64-linux.dyndns 25m 15s
setup: 2qfj9qfpxs30i1f7z4p4zf42vps3nazk-system-units.drv: web01: web01: input not substitutable: error: some references of path '/nix/store/9392s774k2jjhyi7v8dz …
setup:
2qfj9qfpxs30i1f7z4p4zf42vps3nazk-system-units.drv: web01: web01: input not substitutable: error: some references of path '/nix/store/9392s774k2jjhyi7v8dzp2n7nxpnfbbx-unit-acme-setup.service' could not be realised, asking the scheduler again
2qfj9qfpxs30i1f7z4p4zf42vps3nazk-system-units.drv: web01: web01: input not substitutable: error: some references of path '/nix/store/9392s774k2jjhyi7v8dzp2n7nxpnfbbx-unit-acme-setup.service' could not be realised, asking the scheduler again
2qfj9qfpxs30i1f7z4p4zf42vps3nazk-system-units.drv: web01: web01: input not substitutable: error: some references of path '/nix/store/9392s774k2jjhyi7v8dzp2n7nxpnfbbx-unit-acme-setup.service' could not be realised, asking the scheduler again
2qfj9qfpxs30i1f7z4p4zf42vps3nazk-system-units.drv: web01: web01: input not substitutable: error: some references of path '/nix/store/9392s774k2jjhyi7v8dzp2n7nxpnfbbx-unit-acme-setup.service' could not be realised, asking the scheduler again
2qfj9qfpxs30i1f7z4p4zf42vps3nazk-system-units.drv: gi-build-x86-02: gi-build-x86-02: input not substitutable: error: path '/nix/store/9392s774k2jjhyi7v8dzp2n7nxpnfbbx-unit-acme-setup.service' is required, but there is no substituter that can build it, asking the scheduler again
2qfj9qfpxs30i1f7z4p4zf42vps3nazk-system-units.drv: web01: web01: input not substitutable: error: some references of path '/nix/store/9392s774k2jjhyi7v8dzp2n7nxpnfbbx-unit-acme-setup.service' could not be realised, asking the scheduler again
2qfj9qfpxs30i1f7z4p4zf42vps3nazk-system-units.drv: web01: web01: input not substitutable: error: some references of path '/nix/store/9392s774k2jjhyi7v8dzp2n7nxpnfbbx-unit-acme-setup.service' could not be realised, asking the scheduler again
error: dependency 'zcqr71bijvhjfnhqm3a931dhqrmrwvmy-nixos-test-driver-dyndns.drv' failed
failed checks.x86_64-linux.eval-tests 3m 45s
setup: don't know how to build these paths: /nix/store/gyv97z8hlw46jfr1hvbyk5b8psz0laif-eval-tests-x86_64-linux.drv warning: ignoring the client-specified set …
setup:
don't know how to build these paths:
  /nix/store/gyv97z8hlw46jfr1hvbyk5b8psz0laif-eval-tests-x86_64-linux.drv
warning: ignoring the client-specified setting 'store', because it is a restricted setting and you are not a trusted user
error: gRPC QueryValidPaths on 'nix-store.geninf.io:50051' failed: error: substituter 'https://cache.clan.lol' is disabled
failed checks.x86_64-linux.kde 26m 48s
setup: yc9b0r96qw8aqzw2w6bh3niixzmrjnhy-dry-activate.drv: web01: web01: input not substitutable: error: path '/nix/store/zmk72d6ywch0p2icajn9y798ph36wxmg-users- …
setup:
yc9b0r96qw8aqzw2w6bh3niixzmrjnhy-dry-activate.drv: web01: web01: input not substitutable: error: path '/nix/store/zmk72d6ywch0p2icajn9y798ph36wxmg-users-groups.json' is required, but there is no substituter that can build it, asking the scheduler again
yc9b0r96qw8aqzw2w6bh3niixzmrjnhy-dry-activate.drv: build-x86-01: build-x86-01: input not substitutable: error: path '/nix/store/zmk72d6ywch0p2icajn9y798ph36wxmg-users-groups.json' is required, but there is no substituter that can build it, asking the scheduler again
yc9b0r96qw8aqzw2w6bh3niixzmrjnhy-dry-activate.drv: web01: web01: input not substitutable: error: path '/nix/store/zmk72d6ywch0p2icajn9y798ph36wxmg-users-groups.json' is required, but there is no substituter that can build it, asking the scheduler again
yc9b0r96qw8aqzw2w6bh3niixzmrjnhy-dry-activate.drv: gi-build-x86-02: gi-build-x86-02: input not substitutable: error: path '/nix/store/zmk72d6ywch0p2icajn9y798ph36wxmg-users-groups.json' is required, but there is no substituter that can build it, asking the scheduler again
yc9b0r96qw8aqzw2w6bh3niixzmrjnhy-dry-activate.drv: build-x86-01: build-x86-01: input not substitutable: error: path '/nix/store/zmk72d6ywch0p2icajn9y798ph36wxmg-users-groups.json' is required, but there is no substituter that can build it, asking the scheduler again
yc9b0r96qw8aqzw2w6bh3niixzmrjnhy-dry-activate.drv: gi-build-x86-02: gi-build-x86-02: input not substitutable: error: path '/nix/store/zmk72d6ywch0p2icajn9y798ph36wxmg-users-groups.json' is required, but there is no substituter that can build it, asking the scheduler again
yc9b0r96qw8aqzw2w6bh3niixzmrjnhy-dry-activate.drv: gi-build-x86-02: gi-build-x86-02: input not substitutable: error: path '/nix/store/zmk72d6ywch0p2icajn9y798ph36wxmg-users-groups.json' is required, but there is no substituter that can build it, asking the scheduler again
error: dependency '7c2l0kynx1slw2fygjynybk7w80w5kv9-nixos-test-driver-kde.drv' failed
failed checks.x86_64-linux.matrix-synapse 1m 0s
setup: don't know how to build these paths: /nix/store/lm3pimcqcliszgx4f8b60fmzv0a54ga4-container-test-run-matrix-synapse.drv warning: ignoring the client-spe …
setup:
don't know how to build these paths:
  /nix/store/lm3pimcqcliszgx4f8b60fmzv0a54ga4-container-test-run-matrix-synapse.drv
warning: ignoring the client-specified setting 'store', because it is a restricted setting and you are not a trusted user
error: gRPC QueryValidPaths on 'nix-store.geninf.io:50051' failed: error: unable to download 'https://cache.clan.lol/gj73p6jgch6nhdlk6ninw356yrmlc83c.narinfo': HTTP error 503

              response body:

              <?xml version="1.0" encoding="UTF-8" standalone="yes"?>
              <Error>
                  <Code>SlowDown</Code>
                  <Message>Your account has made too many requests; try again later.</Message>
              </Error>
failed checks.x86_64-linux.nixos-flash-installer 6m 18s
setup: don't know how to build these paths: /nix/store/15w9f7nal46861i4vcx1x441wjlr92iq-nixos-system-flash-installer-26.11.20260923.00455b0.drv warning: ignor …
setup:
don't know how to build these paths:
  /nix/store/15w9f7nal46861i4vcx1x441wjlr92iq-nixos-system-flash-installer-26.11.20260923.00455b0.drv
warning: ignoring the client-specified setting 'store', because it is a restricted setting and you are not a trusted user
error: gRPC QueryValidPaths on 'nix-store.geninf.io:50051' failed: error: substituter 'https://cache.clan.lol' is disabled
failed checks.x86_64-linux.nixos-test-installation 12s
setup: don't know how to build these paths: /nix/store/gy3jz2i9qfvpx9pl1crm6a87g050f1rj-vm-test-run-installation.drv warning: ignoring the client-specified se …
setup:
don't know how to build these paths:
  /nix/store/gy3jz2i9qfvpx9pl1crm6a87g050f1rj-vm-test-run-installation.drv
warning: ignoring the client-specified setting 'store', because it is a restricted setting and you are not a trusted user
error: gRPC QueryValidPaths on 'nix-store.geninf.io:50051' failed: error: unable to download 'https://cache.clan.lol/azr1s6fgc5l2qjwpdc44879w3ll2g814.narinfo': HTTP error 503

              response body:

              <?xml version="1.0" encoding="UTF-8" standalone="yes"?>
              <Error>
                  <Code>SlowDown</Code>
                  <Message>Your account has made too many requests; try again later.</Message>
              </Error>
failed checks.x86_64-linux.nixos-test-installation-age 22m 13s
setup: don't know how to build these paths: /nix/store/h3b55r9b0br9c9v2d3nnrip8h4abfllc-vm-test-run-installation.drv warning: ignoring the client-specified se …
setup:
don't know how to build these paths:
  /nix/store/h3b55r9b0br9c9v2d3nnrip8h4abfllc-vm-test-run-installation.drv
warning: ignoring the client-specified setting 'store', because it is a restricted setting and you are not a trusted user
0zfqkqaxaknhgy85bzilrjd2jwa2ljs8-installation-test-flake-x86_64-linux.drv: gi-build-x86-02: not scheduled here: 0zfqkqaxaknhgy85bzilrjd2jwa2ljs8-installation-test-flake-x86_64-linux.drv, asking the scheduler again
gl7gkrz1d21zap2v7kxxig4q4q9fm6xd-clan-runtime.drv: error: gRPC QueryValidPaths on 'nix-store.geninf.io:50051' failed: error: substituter 'https://cache.clan.lol' is disabled
error: dependency 'al27p7zgp4kaxg9wgkcy5lflddhvx7mk-nixos-test-driver-installation.drv' failed
failed checks.x86_64-linux.nixos-test-wayland-proxy-virtwl 1m 58s
setup: don't know how to build these paths: /nix/store/wb8mrb4n11c6mdchmfd8c7gdispwrd26-vm-test-run-wayland-proxy-virtwl.drv warning: ignoring the client-spec …
setup:
don't know how to build these paths:
  /nix/store/wb8mrb4n11c6mdchmfd8c7gdispwrd26-vm-test-run-wayland-proxy-virtwl.drv
warning: ignoring the client-specified setting 'store', because it is a restricted setting and you are not a trusted user
error: gRPC QueryValidPaths on 'nix-store.geninf.io:50051' failed: error: unable to download 'https://cache.geninf.io/fdr43fqph9srg88lvb230rh62vnsyl1f.narinfo': HTTP error 503

              response body:

              <?xml version="1.0" encoding="UTF-8" standalone="yes"?>
              <Error>
                  <Code>SlowDown</Code>
                  <Message>Your account has made too many requests; try again later.</Message>
              </Error>
failed checks.x86_64-linux.service-dummy-test-from-flake 3m 32s
setup: /nix/store/jd0nnjczrfnb0kn6p42lqm26dfiylvyp-python-remove-tests-dir-hook /nix/store/vwpxymga69qm3h5yd920p8iy4xkzpbzb-python-runtime-deps-check-hook.s …
setup:
  /nix/store/jd0nnjczrfnb0kn6p42lqm26dfiylvyp-python-remove-tests-dir-hook
  /nix/store/vwpxymga69qm3h5yd920p8iy4xkzpbzb-python-runtime-deps-check-hook.sh
  /nix/store/lqvxqpqa7yw0qcl5vf7i2hkh00zls5m0-python3.14-build-1.5.1
  /nix/store/4cahraqqkmfws6i3l5kwpayn0i0i12s5-python3.14-installer-1.0.1
  /nix/store/khhd398h6fy0alc7fjfyqssd1bz58xr1-python3.14-pyproject-hooks-1.2.0
  /nix/store/bnm3ppcxy786lcfq6lqni25mi9svpj32-wrap-python-hook
warning: ignoring the client-specified setting 'store', because it is a restricted setting and you are not a trusted user
error: gRPC QueryValidPaths on 'nix-store.geninf.io:50051' failed: error: unable to download 'https://cache.clan.lol/mxrzb352pdr1ib0lgq4yi6v999kmr4d0.narinfo': HTTP error 503

              response body:

              <?xml version="1.0" encoding="UTF-8" standalone="yes"?>
              <Error>
                  <Code>SlowDown</Code>
                  <Message>Your account has made too many requests; try again later.</Message>
              </Error>
28 succeeded
succeeded attributes
status attribute duration
loading…
72 already built
skipped attributes
status attribute duration
loading…