nixbot

builds

clan/clan-core build #765 failed

branch 26.05 · PR #8138 · commit 69a32b85b0 · · took 38m 2s · eval 3m 44s

eval warnings 6 kinds · 1098 occurrences
  • error unable to download 'https://cache.clan.lol/…': HTTP error 503 ×71
  • error unable to download 'https://cache.geninf.io/…': HTTP error 503 ×8
  • error substituter 'https://cache.clan.lol/…' is disabled ×1
  • warn unable to download 'https://cache.clan.lol/…': HTTP error 503 ×916
  • warn /nix/var/nix does not exist, so Nix will use "/homeless-shelter/.local/share/nix/root" as a chroot store ×1
  • warn unable to download 'https://cache.geninf.io/…': HTTP error 503 ×101

102 failed
failed attributes
status attribute duration
failed checks.aarch64-darwin.clan-app-pytest 10m 51s
setup: don't know how to build these paths: /nix/store/v8ac0r27q1nbsakwj8fcllim0q4qn5ik-clan-app-pytest.drv warning: ignoring the client-specified setting 'st …
setup:
don't know how to build these paths:
  /nix/store/v8ac0r27q1nbsakwj8fcllim0q4qn5ik-clan-app-pytest.drv
warning: ignoring the client-specified setting 'store', because it is a restricted setting and you are not a trusted user
error: gRPC QueryValidPaths on 'nix-store.geninf.io:50051' failed: error: substituter 'https://cache.geninf.io' is disabled
failed checks.aarch64-darwin.clan-app-ui-unit-tests 4m 42s
setup: don't know how to build these paths: /nix/store/b2x6zribdm7p58cf7xxlzy23li99kq04-clan-app-ui-unit-tests.drv warning: ignoring the client-specified sett …
setup:
don't know how to build these paths:
  /nix/store/b2x6zribdm7p58cf7xxlzy23li99kq04-clan-app-ui-unit-tests.drv
warning: ignoring the client-specified setting 'store', because it is a restricted setting and you are not a trusted user
error: gRPC QueryValidPaths on 'nix-store.geninf.io:50051' failed: error: unable to download 'https://cache.geninf.io/b0iab5cxczgwkcp2jn4zbzbagv9asm9h.narinfo': HTTP error 503

              response body:

              <?xml version="1.0" encoding="UTF-8" standalone="yes"?>
              <Error>
                  <Code>SlowDown</Code>
                  <Message>Your account has made too many requests; try again later.</Message>
              </Error>
failed checks.aarch64-darwin.clan-deps 3m 35s
setup: this path will be fetched (0.0 KiB download, 0.1 KiB unpacked): /nix/store/1lagjrp87k9vafn3rlsg75dgbm9ibxf3-clan-deps warning: ignoring the client-spec …
setup:
this path will be fetched (0.0 KiB download, 0.1 KiB unpacked):
  /nix/store/1lagjrp87k9vafn3rlsg75dgbm9ibxf3-clan-deps
warning: ignoring the client-specified setting 'store', because it is a restricted setting and you are not a trusted user
ijxdd4bpbfzj9i50nsl508358fqnp966-clan-deps.drv: error: gRPC QueryValidPaths on 'nix-store.geninf.io:50051' failed: error: substituter 'https://cache.clan.lol' is disabled
error: error: gRPC QueryValidPaths on 'nix-store.geninf.io:50051' failed: error: substituter 'https://cache.clan.lol' is disabled
failed checks.aarch64-darwin.clan-pytest-with-core 7m 50s
setup: iyy5v710drjvrwlrsrxwg74644fhxizg-zerotierone-1.16.0.drv: error: gRPC QueryValidPaths on 'nix-store.geninf.io:50051' failed: error: substituter 'https://c …
setup:
iyy5v710drjvrwlrsrxwg74644fhxizg-zerotierone-1.16.0.drv: error: gRPC QueryValidPaths on 'nix-store.geninf.io:50051' failed: error: substituter 'https://cache.clan.lol' is disabled
6kl9730v3w6y7nvlwy0rd5wpmhb06vv9-perl-5.42.0-env.drv: error: gRPC QueryValidPaths on 'nix-store.geninf.io:50051' failed: error: substituter 'https://cache.clan.lol' is disabled
slkpd48bfd2l7gw5css9cn30azhlphrx-closure-info.drv: error: gRPC QueryValidPaths on 'nix-store.geninf.io:50051' failed: error: substituter 'https://cache.clan.lol' is disabled
ykfqgv64z6b70d2kcr5y0xwvz6szrffv-python3-3.13.15-env.drv: error: gRPC QueryValidPaths on 'nix-store.geninf.io:50051' failed: error: substituter 'https://cache.clan.lol' is disabled
qym51kc74k53i2dkrnnwrxjipv4w8alk-clan-core-flake.drv: error: gRPC QueryValidPaths on 'nix-store.geninf.io:50051' failed: error: substituter 'https://cache.clan.lol' is disabled
v8024bkf8n55rxvm5lcwpz1n2s29wp92-clan-cli-source.drv: error: gRPC QueryValidPaths on 'nix-store.geninf.io:50051' failed: error: substituter 'https://cache.clan.lol' is disabled
88w4npbsmv12rba7jsip5k80p1ymfl7w-closure-info.drv: build02: not scheduled here: 88w4npbsmv12rba7jsip5k80p1ymfl7w-closure-info.drv, asking the scheduler again
error: dependency 'ykfqgv64z6b70d2kcr5y0xwvz6szrffv-python3-3.13.15-env.drv' failed
failed checks.aarch64-darwin.clan-pytest-without-core 43s
setup: these 2 paths will be fetched (0.0 KiB download, 5.2 MiB unpacked): /nix/store/9fm74mbn9cy21lkl1bwxv78liwhxqyb5-clan-pytest-without-core /nix/store/k …
setup:
these 2 paths will be fetched (0.0 KiB download, 5.2 MiB unpacked):
  /nix/store/9fm74mbn9cy21lkl1bwxv78liwhxqyb5-clan-pytest-without-core
  /nix/store/kknw77v6hb84zz5hlzbg58xgb2x23x65-clan-runtime
warning: ignoring the client-specified setting 'store', because it is a restricted setting and you are not a trusted user
error: gRPC QueryValidPaths on 'nix-store.geninf.io:50051' failed: error: unable to download 'https://cache.clan.lol/im19js7hd7rlhf06rb8gck8k5r1m5dms.narinfo': HTTP error 503

              response body:

              <?xml version="1.0" encoding="UTF-8" standalone="yes"?>
              <Error>
                  <Code>SlowDown</Code>
                  <Message>Your account has made too many requests; try again later.</Message>
              </Error>
failed checks.aarch64-darwin.darwin-test-darwin-machine 2m 26s
setup: /nix/store/476zsjqic4kbjk43p27m165b5flfqr8l-zlib-1.3.2 /nix/store/5ds9fysxln35sqh4krqw9imr4m5lnr1q-zlib-ng-2.3.3 /nix/store/zwlm8hwl20j12pp7c6dn8dc …
setup:
  /nix/store/476zsjqic4kbjk43p27m165b5flfqr8l-zlib-1.3.2
  /nix/store/5ds9fysxln35sqh4krqw9imr4m5lnr1q-zlib-ng-2.3.3
  /nix/store/zwlm8hwl20j12pp7c6dn8dcyj781krl5-zsh-5.9.1
  /nix/store/1vs1j6bg4n2q9pszgyzbp9p10i0szvc9-zsh-5.9.1-info
  /nix/store/4qzmzkyckdkqc7jpmhlrnj3vjmi0mi68-zsh-5.9.1-man
  /nix/store/mxajghyzvi968fzv2vcwq368mxi92niw-zstd-1.5.7
warning: ignoring the client-specified setting 'store', because it is a restricted setting and you are not a trusted user
error: gRPC QueryValidPaths on 'nix-store.geninf.io:50051' failed: error: unable to download 'https://cache.clan.lol/wgzj68wc748y82yhxfxhama4hbjfb2i5.narinfo': HTTP error 503

              response body:

              <?xml version="1.0" encoding="UTF-8" standalone="yes"?>
              <Error>
                  <Code>SlowDown</Code>
                  <Message>Your account has made too many requests; try again later.</Message>
              </Error>
failed checks.aarch64-darwin.devshell 7m 47s
setup: this path will be fetched (0.0 KiB download, 0.1 KiB unpacked): /nix/store/is97gglswpvzss3sff4lhhxnmzhkksm9-check-devshell-not-depends-on-clan-cli warn …
setup:
this path will be fetched (0.0 KiB download, 0.1 KiB unpacked):
  /nix/store/is97gglswpvzss3sff4lhhxnmzhkksm9-check-devshell-not-depends-on-clan-cli
warning: ignoring the client-specified setting 'store', because it is a restricted setting and you are not a trusted user
aa716477gi9adki33dm49b0wiwcn1gag-vale-styles.drv: error: end of string reached
wh68p338g54gspq5vc8iq7l7bafw17a3-select-shell.drv: build02: not scheduled here: wh68p338g54gspq5vc8iq7l7bafw17a3-select-shell.drv, asking the scheduler again
error: dependency 'll0zjb2s04x10cpdq7rqw95076rdrjik-clan.drv' failed
failed checks.aarch64-darwin.devShell-clan-app 1m 25s
setup: /nix/store/600wx4h47gwbfm2j59v33wj0xy3ni6qz-zlib-1.3.2-static /nix/store/5ds9fysxln35sqh4krqw9imr4m5lnr1q-zlib-ng-2.3.3 /nix/store/mxajghyzvi968fzv …
setup:
  /nix/store/600wx4h47gwbfm2j59v33wj0xy3ni6qz-zlib-1.3.2-static
  /nix/store/5ds9fysxln35sqh4krqw9imr4m5lnr1q-zlib-ng-2.3.3
  /nix/store/mxajghyzvi968fzv2vcwq368mxi92niw-zstd-1.5.7
  /nix/store/sj5gmvy8rr4r60sdfic9w426addgjpq3-zstd-1.5.7-bin
  /nix/store/jjlwnz5xzkxgql1v0dbbj611j6b4m469-zstd-1.5.7-dev
  /nix/store/2im2w9bb1h2gdm1g6j1x9hhjkqmrvs11-zxing-cpp-2.3.0
warning: ignoring the client-specified setting 'store', because it is a restricted setting and you are not a trusted user
error: gRPC QueryValidPaths on 'nix-store.geninf.io:50051' failed: error: substituter 'https://cache.clan.lol' is disabled
failed checks.aarch64-darwin.devShell-clan-cli 2m 39s
setup: don't know how to build these paths: /nix/store/gz692xnrv16a0d0xq1akx6k512v35w9w-clan-cli.drv warning: ignoring the client-specified setting 'store', b …
setup:
don't know how to build these paths:
  /nix/store/gz692xnrv16a0d0xq1akx6k512v35w9w-clan-cli.drv
warning: ignoring the client-specified setting 'store', because it is a restricted setting and you are not a trusted user
error: gRPC QueryValidPaths on 'nix-store.geninf.io:50051' failed: error: unable to download 'https://cache.geninf.io/25nir4v7ml92ximzfrggn24dg7xpphgp.narinfo': HTTP error 503

              response body:

              <?xml version="1.0" encoding="UTF-8" standalone="yes"?>
              <Error>
                  <Code>SlowDown</Code>
                  <Message>Your account has made too many requests; try again later.</Message>
              </Error>
failed checks.aarch64-darwin.devShell-clan-site 8m 48s
setup: don't know how to build these paths: /nix/store/mpjx4a7rxnl85hzns0l93arrzvy1zpng-nix-shell.drv warning: ignoring the client-specified setting 'store', …
setup:
don't know how to build these paths:
  /nix/store/mpjx4a7rxnl85hzns0l93arrzvy1zpng-nix-shell.drv
warning: ignoring the client-specified setting 'store', because it is a restricted setting and you are not a trusted user
error: gRPC QueryValidPaths on 'nix-store.geninf.io:50051' failed: error: unable to download 'https://cache.clan.lol/pk17bp9giqi3i1wdas12qgdfs9gjkq61.narinfo': HTTP error 503

              response body:

              <?xml version="1.0" encoding="UTF-8" standalone="yes"?>
              <Error>
                  <Code>SlowDown</Code>
                  <Message>Your account has made too many requests; try again later.</Message>
              </Error>
failed checks.aarch64-darwin.devShell-default 4m 59s
setup: don't know how to build these paths: /nix/store/ll0zjb2s04x10cpdq7rqw95076rdrjik-clan.drv warning: ignoring the client-specified setting 'store', becau …
setup:
don't know how to build these paths:
  /nix/store/ll0zjb2s04x10cpdq7rqw95076rdrjik-clan.drv
warning: ignoring the client-specified setting 'store', because it is a restricted setting and you are not a trusted user
error: gRPC QueryValidPaths on 'nix-store.geninf.io:50051' failed: error: substituter 'https://cache.clan.lol' is disabled
failed checks.aarch64-darwin.devShell-inventory-schema 49s
setup: don't know how to build these paths: /nix/store/z4p4js1zi81pi47g1y87n57vl6lbcwly-clan-inventory-schema.drv warning: ignoring the client-specified setti …
setup:
don't know how to build these paths:
  /nix/store/z4p4js1zi81pi47g1y87n57vl6lbcwly-clan-inventory-schema.drv
warning: ignoring the client-specified setting 'store', because it is a restricted setting and you are not a trusted user
error: gRPC QueryValidPaths on 'nix-store.geninf.io:50051' failed: error: unable to download 'https://cache.geninf.io/7n4rinw2ix7m3sw9g1c7cwbla2gcqyz1.narinfo': HTTP error 503

              response body:

              <?xml version="1.0" encoding="UTF-8" standalone="yes"?>
              <Error>
                  <Code>SlowDown</Code>
                  <Message>Your account has made too many requests; try again later.</Message>
              </Error>
failed checks.aarch64-darwin.eval-tests 13s
setup: this path will be fetched (0.0 KiB download, 0.1 KiB unpacked): /nix/store/9m1hzmgnpgl1cr2kzbd9nmq6df2adw1g-eval-tests-aarch64-darwin warning: ignoring …
setup:
this path will be fetched (0.0 KiB download, 0.1 KiB unpacked):
  /nix/store/9m1hzmgnpgl1cr2kzbd9nmq6df2adw1g-eval-tests-aarch64-darwin
warning: ignoring the client-specified setting 'store', because it is a restricted setting and you are not a trusted user
error: gRPC QueryValidPaths on 'nix-store.geninf.io:50051' failed: error: substituter 'https://cache.clan.lol' is disabled
failed checks.aarch64-darwin.nixos-flash-installer 22m 31s
setup: m37byma39dgnsd6517g5x89r4446iwpz-etc-nix-registry.json.drv: web01: web01: input not substitutable: error: path '/nix/store/hq6cx345rcflxnadj955s1pgrmq7mr …
setup:
m37byma39dgnsd6517g5x89r4446iwpz-etc-nix-registry.json.drv: web01: web01: input not substitutable: error: path '/nix/store/hq6cx345rcflxnadj955s1pgrmq7mr9m-nixos-26.05.20260921.1e8bc65' is required, but there is no substituter that can build it, asking the scheduler again
c6vsiscbn6h4hrswab2rj13j9i7ndr67-unit-script-nix-channel-init-start.drv: web01: web01: input not substitutable: error: path '/nix/store/hq6cx345rcflxnadj955s1pgrmq7mr9m-nixos-26.05.20260921.1e8bc65' is required, but there is no substituter that can build it, asking the scheduler again
m37byma39dgnsd6517g5x89r4446iwpz-etc-nix-registry.json.drv: web01: web01: input not substitutable: error: path '/nix/store/hq6cx345rcflxnadj955s1pgrmq7mr9m-nixos-26.05.20260921.1e8bc65' is required, but there is no substituter that can build it, asking the scheduler again
c6vsiscbn6h4hrswab2rj13j9i7ndr67-unit-script-nix-channel-init-start.drv: web01: web01: input not substitutable: error: path '/nix/store/hq6cx345rcflxnadj955s1pgrmq7mr9m-nixos-26.05.20260921.1e8bc65' is required, but there is no substituter that can build it, asking the scheduler again
c6vsiscbn6h4hrswab2rj13j9i7ndr67-unit-script-nix-channel-init-start.drv: web01: web01: input not substitutable: error: path '/nix/store/hq6cx345rcflxnadj955s1pgrmq7mr9m-nixos-26.05.20260921.1e8bc65' is required, but there is no substituter that can build it, asking the scheduler again
c6vsiscbn6h4hrswab2rj13j9i7ndr67-unit-script-nix-channel-init-start.drv: web01: web01: input not substitutable: error: path '/nix/store/hq6cx345rcflxnadj955s1pgrmq7mr9m-nixos-26.05.20260921.1e8bc65' is required, but there is no substituter that can build it, asking the scheduler again
8yr1gpa7r6qmj6nr1jx5fs51lx9b75f1-system-path.drv: error: end of string reached
error: dependency '8yr1gpa7r6qmj6nr1jx5fs51lx9b75f1-system-path.drv' failed
failed checks.aarch64-darwin.treefmt 5m 3s
setup: /nix/store/nc18xhxz6k4svwsz72nmh2w3nrwqar7v-zlib-1.3.2-dev /nix/store/600wx4h47gwbfm2j59v33wj0xy3ni6qz-zlib-1.3.2-static /nix/store/5ds9fysxln35sqh …
setup:
  /nix/store/nc18xhxz6k4svwsz72nmh2w3nrwqar7v-zlib-1.3.2-dev
  /nix/store/600wx4h47gwbfm2j59v33wj0xy3ni6qz-zlib-1.3.2-static
  /nix/store/5ds9fysxln35sqh4krqw9imr4m5lnr1q-zlib-ng-2.3.3
  /nix/store/mxajghyzvi968fzv2vcwq368mxi92niw-zstd-1.5.7
  /nix/store/sj5gmvy8rr4r60sdfic9w426addgjpq3-zstd-1.5.7-bin
  /nix/store/jjlwnz5xzkxgql1v0dbbj611j6b4m469-zstd-1.5.7-dev
warning: ignoring the client-specified setting 'store', because it is a restricted setting and you are not a trusted user
error: gRPC QueryValidPaths on 'nix-store.geninf.io:50051' failed: error: substituter 'https://cache.clan.lol' is disabled
failed checks.aarch64-linux.borgbackup 1m 45s
setup: don't know how to build these paths: /nix/store/3v4a8axdh12rn8my7qas4697ys2awsdk-container-test-run-borgbackup.drv warning: ignoring the client-specifi …
setup:
don't know how to build these paths:
  /nix/store/3v4a8axdh12rn8my7qas4697ys2awsdk-container-test-run-borgbackup.drv
warning: ignoring the client-specified setting 'store', because it is a restricted setting and you are not a trusted user
error: gRPC QueryValidPaths on 'nix-store.geninf.io:50051' failed: error: unable to download 'https://cache.geninf.io/229l1yqpj4f0wyyfrii2xafcxm7qy20p.narinfo': HTTP error 503

              response body:

              <?xml version="1.0" encoding="UTF-8" standalone="yes"?>
              <Error>
                  <Code>SlowDown</Code>
                  <Message>Your account has made too many requests; try again later.</Message>
              </Error>
failed checks.aarch64-linux.certificates 4m 9s
setup: don't know how to build these paths: /nix/store/ifkjii7h9dqc28i0dfyznsh906g40k4s-container-test-run-certificates.drv warning: ignoring the client-speci …
setup:
don't know how to build these paths:
  /nix/store/ifkjii7h9dqc28i0dfyznsh906g40k4s-container-test-run-certificates.drv
warning: ignoring the client-specified setting 'store', because it is a restricted setting and you are not a trusted user
error: gRPC QueryValidPaths on 'nix-store.geninf.io:50051' failed: error: unable to download 'https://cache.clan.lol/lzb3l270l6vmdxsfsv54hya9mi3gy335.narinfo': HTTP error 503

              response body:

              <?xml version="1.0" encoding="UTF-8" standalone="yes"?>
              <Error>
                  <Code>SlowDown</Code>
                  <Message>Your account has made too many requests; try again later.</Message>
              </Error>
failed checks.aarch64-linux.clan-app-ui-lint 1m 12s
setup: don't know how to build these paths: /nix/store/axvl7rfiz1gy202g0wgfbwn3gvfiwd9r-clan-app-ui-lint.drv warning: ignoring the client-specified setting 's …
setup:
don't know how to build these paths:
  /nix/store/axvl7rfiz1gy202g0wgfbwn3gvfiwd9r-clan-app-ui-lint.drv
warning: ignoring the client-specified setting 'store', because it is a restricted setting and you are not a trusted user
error: gRPC QueryValidPaths on 'nix-store.geninf.io:50051' failed: error: unable to download 'https://cache.clan.lol/3c976xqflf7kxvnnwl112wm0k76dvg70.narinfo': HTTP error 503

              response body:

              <?xml version="1.0" encoding="UTF-8" standalone="yes"?>
              <Error>
                  <Code>SlowDown</Code>
                  <Message>Your account has made too many requests; try again later.</Message>
              </Error>
failed checks.aarch64-linux.clan-app-ui-unit-tests 2m 43s
setup: don't know how to build these paths: /nix/store/7fr6cxg1aisi1hpazd6lbp82kv6k7fn9-clan-app-ui-unit-tests.drv warning: ignoring the client-specified sett …
setup:
don't know how to build these paths:
  /nix/store/7fr6cxg1aisi1hpazd6lbp82kv6k7fn9-clan-app-ui-unit-tests.drv
warning: ignoring the client-specified setting 'store', because it is a restricted setting and you are not a trusted user
7fr6cxg1aisi1hpazd6lbp82kv6k7fn9-clan-app-ui-unit-tests.drv: error: gRPC QueryValidPaths on 'nix-store.geninf.io:50051' failed: error: substituter 'https://cache.clan.lol' is disabled
error: error: gRPC QueryValidPaths on 'nix-store.geninf.io:50051' failed: error: substituter 'https://cache.clan.lol' is disabled
failed checks.aarch64-linux.clan-deps 1m 32s
setup: don't know how to build these paths: /nix/store/nkd9qk05w4rsn89352j3vwsijfqfna0l-clan-deps.drv warning: ignoring the client-specified setting 'store', …
setup:
don't know how to build these paths:
  /nix/store/nkd9qk05w4rsn89352j3vwsijfqfna0l-clan-deps.drv
warning: ignoring the client-specified setting 'store', because it is a restricted setting and you are not a trusted user
error: gRPC QueryValidPaths on 'nix-store.geninf.io:50051' failed: error: unable to download 'https://cache.clan.lol/x9j6ddyk1ff0fjf974y03723awaw8669.narinfo': HTTP error 503

              response body:

              <?xml version="1.0" encoding="UTF-8" standalone="yes"?>
              <Error>
                  <Code>SlowDown</Code>
                  <Message>Your account has made too many requests; try again later.</Message>
              </Error>
failed checks.aarch64-linux.clan-pytest-with-core 38s
setup: these 2 paths will be fetched (0.0 KiB download, 5.1 MiB unpacked): /nix/store/vgkm8whq425afksa7v8vd5qviywr95l6-clan-pytest-with-core /nix/store/0bqn …
setup:
these 2 paths will be fetched (0.0 KiB download, 5.1 MiB unpacked):
  /nix/store/vgkm8whq425afksa7v8vd5qviywr95l6-clan-pytest-with-core
  /nix/store/0bqnai1ln33rp4x4pspdfnzq4lhwm8n9-clan-runtime
warning: ignoring the client-specified setting 'store', because it is a restricted setting and you are not a trusted user
error: gRPC QueryValidPaths on 'nix-store.geninf.io:50051' failed: error: unable to download 'https://cache.geninf.io/j2lrcbrdgjl2w40k8kxn6l2pz722j7bv.narinfo': HTTP error 503

              response body:

              <?xml version="1.0" encoding="UTF-8" standalone="yes"?>
              <Error>
                  <Code>SlowDown</Code>
                  <Message>Your account has made too many requests; try again later.</Message>
              </Error>
failed checks.aarch64-linux.clan-pytest-without-core 1m 53s
setup: don't know how to build these paths: /nix/store/500i4z8sjhra5rihsyxnz5x8icwkbgn0-clan-pytest-without-core.drv warning: ignoring the client-specified se …
setup:
don't know how to build these paths:
  /nix/store/500i4z8sjhra5rihsyxnz5x8icwkbgn0-clan-pytest-without-core.drv
warning: ignoring the client-specified setting 'store', because it is a restricted setting and you are not a trusted user
error: gRPC QueryValidPaths on 'nix-store.geninf.io:50051' failed: error: unable to download 'https://cache.clan.lol/1m9mqb4lfw8v23h5jfxkd30qlzizll0p.narinfo': HTTP error 503

              response body:

              <?xml version="1.0" encoding="UTF-8" standalone="yes"?>
              <Error>
                  <Code>SlowDown</Code>
                  <Message>Your account has made too many requests; try again later.</Message>
              </Error>
failed checks.aarch64-linux.clan-test-iso 51s
setup: don't know how to build these paths: /nix/store/7sqz7mzpn0wbxwk6q7m597aaqp9ibiiz-container-test-run-clan-test-iso.drv warning: ignoring the client-spec …
setup:
don't know how to build these paths:
  /nix/store/7sqz7mzpn0wbxwk6q7m597aaqp9ibiiz-container-test-run-clan-test-iso.drv
warning: ignoring the client-specified setting 'store', because it is a restricted setting and you are not a trusted user
error: gRPC QueryValidPaths on 'nix-store.geninf.io:50051' failed: error: unable to download 'https://cache.clan.lol/hfgfr5b05jcxnd7cgwq3766cw7rs4hlf.narinfo': HTTP error 503

              response body:

              <?xml version="1.0" encoding="UTF-8" standalone="yes"?>
              <Error>
                  <Code>SlowDown</Code>
                  <Message>Your account has made too many requests; try again later.</Message>
              </Error>
failed checks.aarch64-linux.darwin-test-darwin-machine 1m 11s
setup: /nix/store/476zsjqic4kbjk43p27m165b5flfqr8l-zlib-1.3.2 /nix/store/5ds9fysxln35sqh4krqw9imr4m5lnr1q-zlib-ng-2.3.3 /nix/store/zwlm8hwl20j12pp7c6dn8dc …
setup:
  /nix/store/476zsjqic4kbjk43p27m165b5flfqr8l-zlib-1.3.2
  /nix/store/5ds9fysxln35sqh4krqw9imr4m5lnr1q-zlib-ng-2.3.3
  /nix/store/zwlm8hwl20j12pp7c6dn8dcyj781krl5-zsh-5.9.1
  /nix/store/1vs1j6bg4n2q9pszgyzbp9p10i0szvc9-zsh-5.9.1-info
  /nix/store/4qzmzkyckdkqc7jpmhlrnj3vjmi0mi68-zsh-5.9.1-man
  /nix/store/mxajghyzvi968fzv2vcwq368mxi92niw-zstd-1.5.7
warning: ignoring the client-specified setting 'store', because it is a restricted setting and you are not a trusted user
error: gRPC QueryValidPaths on 'nix-store.geninf.io:50051' failed: error: unable to download 'https://cache.clan.lol/jcaci87617nb5r3ih31iqzpd9hiq5vj0.narinfo': HTTP error 503

              response body:

              <?xml version="1.0" encoding="UTF-8" standalone="yes"?>
              <Error>
                  <Code>SlowDown</Code>
                  <Message>Your account has made too many requests; try again later.</Message>
              </Error>
failed checks.aarch64-linux.devshell 2m 51s
setup: don't know how to build these paths: /nix/store/1qqbn6rz6m4zwkl7irqm20hjnj658qpj-check-devshell-not-depends-on-clan-cli.drv warning: ignoring the clien …
setup:
don't know how to build these paths:
  /nix/store/1qqbn6rz6m4zwkl7irqm20hjnj658qpj-check-devshell-not-depends-on-clan-cli.drv
warning: ignoring the client-specified setting 'store', because it is a restricted setting and you are not a trusted user
1qqbn6rz6m4zwkl7irqm20hjnj658qpj-check-devshell-not-depends-on-clan-cli.drv: error: gRPC QueryValidPaths on 'nix-store.geninf.io:50051' failed: error: substituter 'https://cache.clan.lol' is disabled
error: error: gRPC QueryValidPaths on 'nix-store.geninf.io:50051' failed: error: substituter 'https://cache.clan.lol' is disabled
failed checks.aarch64-linux.devShell-clan-app 15m 24s
setup: don't know how to build these paths: /nix/store/vb8rmcgny2fxqzzbglx6268ylkbwlkmh-ui.drv warning: ignoring the client-specified setting 'store', because …
setup:
don't know how to build these paths:
  /nix/store/vb8rmcgny2fxqzzbglx6268ylkbwlkmh-ui.drv
warning: ignoring the client-specified setting 'store', because it is a restricted setting and you are not a trusted user
az6210y6ds6zl7mbx437b89vb1sssl92-vale-styles.drv: error: end of string reached
ygqr1azjhzn8k0y76j1grg7l643cqwhh-pythoncheck.sh.drv: build01: not scheduled here: ygqr1azjhzn8k0y76j1grg7l643cqwhh-pythoncheck.sh.drv, asking the scheduler again
ncki1iz15s1niz2yfjg17bxm8pfnr4x0-python3-3.13.15-env.drv: build01: not scheduled here: ncki1iz15s1niz2yfjg17bxm8pfnr4x0-python3-3.13.15-env.drv, asking the scheduler again
i61ipa2jkvxb7vlasv7pr6bssbffkiaa-playwright-browsers.drv: build01: not scheduled here: i61ipa2jkvxb7vlasv7pr6bssbffkiaa-playwright-browsers.drv, asking the scheduler again
error: dependency '58bjz4z5smx2dd7fdy6hlf2ldqq2j7qn-treefmt.drv' failed
failed checks.aarch64-linux.devShell-clan-cli 57s
setup: /nix/store/6fhxdm9f25c7h86nadfy8qim4h9hq04d-zlib-ng-2.3.3 /nix/store/i8f26lwk8i93hmiyrmsy752m6nwi4pmk-zstd-1.5.7 /nix/store/01623a8kcyp04gbqsal6fys …
setup:
  /nix/store/6fhxdm9f25c7h86nadfy8qim4h9hq04d-zlib-ng-2.3.3
  /nix/store/i8f26lwk8i93hmiyrmsy752m6nwi4pmk-zstd-1.5.7
  /nix/store/01623a8kcyp04gbqsal6fys34yfigd02-zstd-1.5.7-bin
  /nix/store/3y8mdshg1hkwpcnzhhd1q71p2wps47d4-zstd-1.5.7-dev
  /nix/store/j3zlp8gw0674jlwjy1v6g6d08mri7agz-zvbi-0.2.45
  /nix/store/pfns7xmwpx19sr5nyfpigxf22v2xf9h7-zxing-cpp-2.3.0
warning: ignoring the client-specified setting 'store', because it is a restricted setting and you are not a trusted user
error: gRPC QueryValidPaths on 'nix-store.geninf.io:50051' failed: error: unable to download 'https://cache.geninf.io/43isrzx1n586rz3as42a0i23a0v595bk.narinfo': HTTP error 503

              response body:

              <?xml version="1.0" encoding="UTF-8" standalone="yes"?>
              <Error>
                  <Code>SlowDown</Code>
                  <Message>Your account has made too many requests; try again later.</Message>
              </Error>
failed checks.aarch64-linux.devShell-clan-site 1m 23s
setup: don't know how to build these paths: /nix/store/ln13y9r77yp725bjggnxfhb01rrq4zxf-nix-shell.drv warning: ignoring the client-specified setting 'store', …
setup:
don't know how to build these paths:
  /nix/store/ln13y9r77yp725bjggnxfhb01rrq4zxf-nix-shell.drv
warning: ignoring the client-specified setting 'store', because it is a restricted setting and you are not a trusted user
error: gRPC QueryValidPaths on 'nix-store.geninf.io:50051' failed: error: unable to download 'https://cache.clan.lol/f9hly3m3d30c34hzgpp6ab5psflcvkp9.narinfo': HTTP error 503

              response body:

              <?xml version="1.0" encoding="UTF-8" standalone="yes"?>
              <Error>
                  <Code>SlowDown</Code>
                  <Message>Your account has made too many requests; try again later.</Message>
              </Error>
failed checks.aarch64-linux.devShell-default 2m 18s
setup: don't know how to build these paths: /nix/store/18dd8vgi5w3zw1li602gm2mdh0l5yh9x-clan.drv warning: ignoring the client-specified setting 'store', becau …
setup:
don't know how to build these paths:
  /nix/store/18dd8vgi5w3zw1li602gm2mdh0l5yh9x-clan.drv
warning: ignoring the client-specified setting 'store', because it is a restricted setting and you are not a trusted user
error: gRPC QueryValidPaths on 'nix-store.geninf.io:50051' failed: error: unable to download 'https://cache.geninf.io/31vzs2qz4v2iglpxwjv9bsr96ywsi9d5.narinfo': HTTP error 503

              response body:

              <?xml version="1.0" encoding="UTF-8" standalone="yes"?>
              <Error>
                  <Code>SlowDown</Code>
                  <Message>Your account has made too many requests; try again later.</Message>
              </Error>
failed checks.aarch64-linux.devShell-docs 10m 24s
setup: /nix/store/pwwpmwjdmk34smyfkf61ksyp7h5kdv45-zlib-1.3.2-static /nix/store/6fhxdm9f25c7h86nadfy8qim4h9hq04d-zlib-ng-2.3.3 /nix/store/i8f26lwk8i93hmiy …
setup:
  /nix/store/pwwpmwjdmk34smyfkf61ksyp7h5kdv45-zlib-1.3.2-static
  /nix/store/6fhxdm9f25c7h86nadfy8qim4h9hq04d-zlib-ng-2.3.3
  /nix/store/i8f26lwk8i93hmiyrmsy752m6nwi4pmk-zstd-1.5.7
  /nix/store/01623a8kcyp04gbqsal6fys34yfigd02-zstd-1.5.7-bin
  /nix/store/3y8mdshg1hkwpcnzhhd1q71p2wps47d4-zstd-1.5.7-dev
warning: ignoring the client-specified setting 'store', because it is a restricted setting and you are not a trusted user
9w4z904px9ph1zg2rlyjjy7ar7df7xvy-rendered.drv: error: gRPC QueryValidPaths on 'nix-store.geninf.io:50051' failed: error: substituter 'https://cache.clan.lol' is disabled
error: dependency 'd1ch2jq5j67288yvqh63qlaalw9zlhq4-generated-docs.drv' failed
failed checks.aarch64-linux.devShell-inventory-schema 1m 15s
setup: don't know how to build these paths: /nix/store/3bxkq1z48pj5nvd6fq06k8xaf1b0y2rd-clan-inventory-schema.drv warning: ignoring the client-specified setti …
setup:
don't know how to build these paths:
  /nix/store/3bxkq1z48pj5nvd6fq06k8xaf1b0y2rd-clan-inventory-schema.drv
warning: ignoring the client-specified setting 'store', because it is a restricted setting and you are not a trusted user
error: gRPC QueryValidPaths on 'nix-store.geninf.io:50051' failed: error: unable to download 'https://cache.clan.lol/50p71bmmbwa3ik3k5f11d98qpvcnixmz.narinfo': HTTP error 503

              response body:

              <?xml version="1.0" encoding="UTF-8" standalone="yes"?>
              <Error>
                  <Code>SlowDown</Code>
                  <Message>Your account has made too many requests; try again later.</Message>
              </Error>
failed checks.aarch64-linux.devShell-network-status 2m 59s
setup: don't know how to build these paths: /nix/store/1iyilni0kc2ykw5cigiihy6iclwrcl2d-network-status.drv warning: ignoring the client-specified setting 'sto …
setup:
don't know how to build these paths:
  /nix/store/1iyilni0kc2ykw5cigiihy6iclwrcl2d-network-status.drv
warning: ignoring the client-specified setting 'store', because it is a restricted setting and you are not a trusted user
error: gRPC QueryValidPaths on 'nix-store.geninf.io:50051' failed: error: unable to download 'https://cache.clan.lol/k270d0h79fs24zazln9nc2n7gdwjmdhc.narinfo': HTTP error 503

              response body:

              <?xml version="1.0" encoding="UTF-8" standalone="yes"?>
              <Error>
                  <Code>SlowDown</Code>
                  <Message>Your account has made too many requests; try again later.</Message>
              </Error>
failed checks.aarch64-linux.dm-dns 12m 39s
setup: 4hz3h27684m3lv5rfqlrgh7ijlffy99k-testScript.drv: error: gRPC QueryValidPaths on 'nix-store.geninf.io:50051' failed: error: substituter 'https://cache.cla …
setup:
4hz3h27684m3lv5rfqlrgh7ijlffy99k-testScript.drv: error: gRPC QueryValidPaths on 'nix-store.geninf.io:50051' failed: error: substituter 'https://cache.clan.lol' is disabled
mpfzdvhwg5hwcf8ylnqf85qxmn1sqcbq-string-hosts.drv: error: gRPC QueryValidPaths on 'nix-store.geninf.io:50051' failed: error: substituter 'https://cache.clan.lol' is disabled
6h2fpryhpa04rhanj16g5m0w6nx1x8hz-unit-unbound-reload-zones.path.drv: error: gRPC QueryValidPaths on 'nix-store.geninf.io:50051' failed: error: substituter 'https://cache.clan.lol' is disabled
3qzp601rfwpg71vfdrzw2sq4fvjhlww4-generator-dm-dns.drv: build-x86-01: not scheduled here: 3qzp601rfwpg71vfdrzw2sq4fvjhlww4-generator-dm-dns.drv, asking the scheduler again
sgrw26g9hgc6k993cnwp5cmb0sqk8pxy-generator-dm-dns-signing-key.drv: build-x86-01: not scheduled here: sgrw26g9hgc6k993cnwp5cmb0sqk8pxy-generator-dm-dns-signing-key.drv, asking the scheduler again
xizhabb6qvdf80xxzkq9gnpc0ma8zz6l-decrypt-age-secrets.drv: build01: not scheduled here: xizhabb6qvdf80xxzkq9gnpc0ma8zz6l-decrypt-age-secrets.drv, asking the scheduler again
rf7gz856c89bc730b6xbskz5wqjppfia-decrypt-age-secrets.drv: build01: not scheduled here: rf7gz856c89bc730b6xbskz5wqjppfia-decrypt-age-secrets.drv, asking the scheduler again
error: dependency '039dqhnr360bnharc7iwrq0qbzqrphmr-nixos-test-driver-dm-dns.drv' failed
failed checks.aarch64-linux.dyndns 2m 2s
setup: this path will be fetched (0.0 KiB download, 0.1 KiB unpacked): /nix/store/pfh198k8snhdfp4jhhl6f0irh4m9m6im-container-test-run-dyndns warning: ignoring …
setup:
this path will be fetched (0.0 KiB download, 0.1 KiB unpacked):
  /nix/store/pfh198k8snhdfp4jhhl6f0irh4m9m6im-container-test-run-dyndns
warning: ignoring the client-specified setting 'store', because it is a restricted setting and you are not a trusted user
error: gRPC QueryValidPaths on 'nix-store.geninf.io:50051' failed: error: unable to download 'https://cache.geninf.io/34gnq79x8qkkl896b7mmr2hzak0zf9v0.narinfo': HTTP error 503

              response body:

              <?xml version="1.0" encoding="UTF-8" standalone="yes"?>
              <Error>
                  <Code>SlowDown</Code>
                  <Message>Your account has made too many requests; try again later.</Message>
              </Error>
failed checks.aarch64-linux.eval-tests 37s
setup: this path will be fetched (0.0 KiB download, 0.1 KiB unpacked): /nix/store/y82cq4f08aww5bbxbcapbjjwb71nxdh3-eval-tests-aarch64-linux warning: ignoring …
setup:
this path will be fetched (0.0 KiB download, 0.1 KiB unpacked):
  /nix/store/y82cq4f08aww5bbxbcapbjjwb71nxdh3-eval-tests-aarch64-linux
warning: ignoring the client-specified setting 'store', because it is a restricted setting and you are not a trusted user
error: gRPC QueryValidPaths on 'nix-store.geninf.io:50051' failed: error: substituter 'https://cache.clan.lol' is disabled
failed checks.aarch64-linux.hello-service 30m 43s
setup: d8byj98pl6hscbwaqr6cyrv2268hxcvm-system-path.drv: build01: not scheduled here: d8byj98pl6hscbwaqr6cyrv2268hxcvm-system-path.drv, asking the scheduler aga …
setup:
d8byj98pl6hscbwaqr6cyrv2268hxcvm-system-path.drv: build01: not scheduled here: d8byj98pl6hscbwaqr6cyrv2268hxcvm-system-path.drv, asking the scheduler again
d4gk02rd7mp9i86r94xqmzwi8cav6yhl-dbus-1.drv: build01: not scheduled here: d4gk02rd7mp9i86r94xqmzwi8cav6yhl-dbus-1.drv, asking the scheduler again
d4gk02rd7mp9i86r94xqmzwi8cav6yhl-dbus-1.drv: build01: not scheduled here: d4gk02rd7mp9i86r94xqmzwi8cav6yhl-dbus-1.drv, asking the scheduler again
qfhryrryi2d8lqm7vvzhyv9gqnj74fh1-X-Restart-Triggers-dbus-broker.drv: build01: not scheduled here: qfhryrryi2d8lqm7vvzhyv9gqnj74fh1-X-Restart-Triggers-dbus-broker.drv, asking the scheduler again
35dgh79p2j33idwv67s94v0lk57pv91q-unit-dbus-broker.service.drv: build01: not scheduled here: 35dgh79p2j33idwv67s94v0lk57pv91q-unit-dbus-broker.service.drv, asking the scheduler again
cp6xva1rgmiwzq1ql4984ksxjl1g3iyk-system-units.drv: build01: not scheduled here: cp6xva1rgmiwzq1ql4984ksxjl1g3iyk-system-units.drv, asking the scheduler again
ximcgwh3k5yw3bq4mfkwyzjabm7byhhl-etc.drv: build01: not scheduled here: ximcgwh3k5yw3bq4mfkwyzjabm7byhhl-etc.drv, asking the scheduler again
error: dependency 'mskazydjwj5nrfavc8h412r0d5mxfl0r-nixos-test-driver-hello-service.drv' failed
failed checks.aarch64-linux.kde 3m 3s
setup: this path will be fetched (0.0 KiB download, 0.1 KiB unpacked): /nix/store/jnnmbhmbwbwjxlcm4cf91fgvl306b85z-container-test-run-kde warning: ignoring th …
setup:
this path will be fetched (0.0 KiB download, 0.1 KiB unpacked):
  /nix/store/jnnmbhmbwbwjxlcm4cf91fgvl306b85z-container-test-run-kde
warning: ignoring the client-specified setting 'store', because it is a restricted setting and you are not a trusted user
error: gRPC QueryValidPaths on 'nix-store.geninf.io:50051' failed: error: unable to download 'https://cache.geninf.io/bgmpkln78p7vf7dxxmshc6zi03r40f6j.narinfo': HTTP error 503

              response body:

              <?xml version="1.0" encoding="UTF-8" standalone="yes"?>
              <Error>
                  <Code>SlowDown</Code>
                  <Message>Your account has made too many requests; try again later.</Message>
              </Error>
failed checks.aarch64-linux.lib-jsonschema-example-valid 1m 18s
setup: don't know how to build these paths: /nix/store/w54xwmxi8mrbbfhcsrav08p87zkbssh8-lib-jsonschema-example-valid.drv warning: ignoring the client-specifie …
setup:
don't know how to build these paths:
  /nix/store/w54xwmxi8mrbbfhcsrav08p87zkbssh8-lib-jsonschema-example-valid.drv
warning: ignoring the client-specified setting 'store', because it is a restricted setting and you are not a trusted user
error: gRPC QueryValidPaths on 'nix-store.geninf.io:50051' failed: error: substituter 'https://cache.clan.lol' is disabled
failed checks.aarch64-linux.localbackup 12s
setup: don't know how to build these paths: /nix/store/v8555pndyp0mii09psg1bwx6h6160i46-container-test-run-localbackup.drv warning: ignoring the client-specif …
setup:
don't know how to build these paths:
  /nix/store/v8555pndyp0mii09psg1bwx6h6160i46-container-test-run-localbackup.drv
warning: ignoring the client-specified setting 'store', because it is a restricted setting and you are not a trusted user
error: gRPC QueryValidPaths on 'nix-store.geninf.io:50051' failed: error: unable to download 'https://cache.geninf.io/69psjm50jr3s3mnydzcsvjcif40ldcwy.narinfo': HTTP error 503

              response body:

              <?xml version="1.0" encoding="UTF-8" standalone="yes"?>
              <Error>
                  <Code>SlowDown</Code>
                  <Message>Your account has made too many requests; try again later.</Message>
              </Error>
failed checks.aarch64-linux.machine-id 4m 12s
setup: don't know how to build these paths: /nix/store/4d7k4fhgidn4jimpmqpz8phs6kp32vfy-container-test-run-service-machine-id.drv warning: ignoring the client …
setup:
don't know how to build these paths:
  /nix/store/4d7k4fhgidn4jimpmqpz8phs6kp32vfy-container-test-run-service-machine-id.drv
warning: ignoring the client-specified setting 'store', because it is a restricted setting and you are not a trusted user
error: gRPC QueryValidPaths on 'nix-store.geninf.io:50051' failed: error: substituter 'https://cache.clan.lol' is disabled
failed checks.aarch64-linux.matrix-synapse 9m 26s
setup: don't know how to build these paths: /nix/store/alh6y5jh7pri2jwybij7qbw6lpb2qqfl-container-test-run-matrix-synapse.drv warning: ignoring the client-spe …
setup:
don't know how to build these paths:
  /nix/store/alh6y5jh7pri2jwybij7qbw6lpb2qqfl-container-test-run-matrix-synapse.drv
warning: ignoring the client-specified setting 'store', because it is a restricted setting and you are not a trusted user
error: gRPC QueryValidPaths on 'nix-store.geninf.io:50051' failed: error: substituter 'https://cache.clan.lol' is disabled
failed checks.aarch64-linux.monitoring 1m 56s
setup: don't know how to build these paths: /nix/store/zy2igmm173zi6z92nc78n9iwsi44l8aw-container-test-run-monitoring.drv warning: ignoring the client-specifi …
setup:
don't know how to build these paths:
  /nix/store/zy2igmm173zi6z92nc78n9iwsi44l8aw-container-test-run-monitoring.drv
warning: ignoring the client-specified setting 'store', because it is a restricted setting and you are not a trusted user
error: gRPC QueryValidPaths on 'nix-store.geninf.io:50051' failed: error: substituter 'https://cache.clan.lol' is disabled
failed checks.aarch64-linux.mycelium 35s
setup: don't know how to build these paths: /nix/store/18sji0ckq8lsda97425mqxm4rq9xw83l-vm-test-run-mycelium.drv warning: ignoring the client-specified settin …
setup:
don't know how to build these paths:
  /nix/store/18sji0ckq8lsda97425mqxm4rq9xw83l-vm-test-run-mycelium.drv
warning: ignoring the client-specified setting 'store', because it is a restricted setting and you are not a trusted user
error: gRPC QueryValidPaths on 'nix-store.geninf.io:50051' failed: error: unable to download 'https://cache.geninf.io/1rqmrabls6h8zlik1yqxsiy6cg2d0vij.narinfo': HTTP error 503

              response body:

              <?xml version="1.0" encoding="UTF-8" standalone="yes"?>
              <Error>
                  <Code>SlowDown</Code>
                  <Message>Your account has made too many requests; try again later.</Message>
              </Error>
failed checks.aarch64-linux.nixos-documentation 2m 33s
setup: don't know how to build these paths: /nix/store/wfqlly7gd8gl8dk8jc8y4g8g619ricbf-nixos-system-test-documentation-26.05.20260921.1e8bc65.drv warning: ig …
setup:
don't know how to build these paths:
  /nix/store/wfqlly7gd8gl8dk8jc8y4g8g619ricbf-nixos-system-test-documentation-26.05.20260921.1e8bc65.drv
warning: ignoring the client-specified setting 'store', because it is a restricted setting and you are not a trusted user
error: gRPC QueryValidPaths on 'nix-store.geninf.io:50051' failed: error: unable to download 'https://cache.geninf.io/4xh75n3pcr9nhzxk5fc695h1yg6bxbpn.narinfo': HTTP error 503

              response body:

              <?xml version="1.0" encoding="UTF-8" standalone="yes"?>
              <Error>
                  <Code>SlowDown</Code>
                  <Message>Your account has made too many requests; try again later.</Message>
              </Error>
failed checks.aarch64-linux.nixos-flash-installer 22m 31s
setup: m37byma39dgnsd6517g5x89r4446iwpz-etc-nix-registry.json.drv: web01: web01: input not substitutable: error: path '/nix/store/hq6cx345rcflxnadj955s1pgrmq7mr …
setup:
m37byma39dgnsd6517g5x89r4446iwpz-etc-nix-registry.json.drv: web01: web01: input not substitutable: error: path '/nix/store/hq6cx345rcflxnadj955s1pgrmq7mr9m-nixos-26.05.20260921.1e8bc65' is required, but there is no substituter that can build it, asking the scheduler again
m37byma39dgnsd6517g5x89r4446iwpz-etc-nix-registry.json.drv: web01: web01: input not substitutable: error: path '/nix/store/hq6cx345rcflxnadj955s1pgrmq7mr9m-nixos-26.05.20260921.1e8bc65' is required, but there is no substituter that can build it, asking the scheduler again
m37byma39dgnsd6517g5x89r4446iwpz-etc-nix-registry.json.drv: web01: web01: input not substitutable: error: path '/nix/store/hq6cx345rcflxnadj955s1pgrmq7mr9m-nixos-26.05.20260921.1e8bc65' is required, but there is no substituter that can build it, asking the scheduler again
m37byma39dgnsd6517g5x89r4446iwpz-etc-nix-registry.json.drv: web01: web01: input not substitutable: error: path '/nix/store/hq6cx345rcflxnadj955s1pgrmq7mr9m-nixos-26.05.20260921.1e8bc65' is required, but there is no substituter that can build it, asking the scheduler again
m37byma39dgnsd6517g5x89r4446iwpz-etc-nix-registry.json.drv: web01: web01: input not substitutable: error: path '/nix/store/hq6cx345rcflxnadj955s1pgrmq7mr9m-nixos-26.05.20260921.1e8bc65' is required, but there is no substituter that can build it, asking the scheduler again
8yr1gpa7r6qmj6nr1jx5fs51lx9b75f1-system-path.drv: gi-build-x86-02: gi-build-x86-02: input not substitutable: error: path '/nix/store/mgnnfwf5bsjq2yjwnlinkrllr3msyjql-nixos-version' is required, but there is no substituter that can build it, asking the scheduler again
8yr1gpa7r6qmj6nr1jx5fs51lx9b75f1-system-path.drv: build-x86-01: build-x86-01: input not substitutable: error: path '/nix/store/mgnnfwf5bsjq2yjwnlinkrllr3msyjql-nixos-version' is required, but there is no substituter that can build it, asking the scheduler again
error: dependency 'r0x3bpr6b0b4liayx1rrincgizm0lwid-boot.json.drv' failed
failed checks.aarch64-linux.nixos-systemd-abstraction 10m 45s
setup: this path will be fetched (0.0 KiB download, 0.1 KiB unpacked): /nix/store/a8c62n0yxd9g0swcsv0sm8znabisq090-container-test-run-systemd-abstraction warn …
setup:
this path will be fetched (0.0 KiB download, 0.1 KiB unpacked):
  /nix/store/a8c62n0yxd9g0swcsv0sm8znabisq090-container-test-run-systemd-abstraction
warning: ignoring the client-specified setting 'store', because it is a restricted setting and you are not a trusted user
error: gRPC QueryValidPaths on 'nix-store.geninf.io:50051' failed: error: unable to download 'https://cache.clan.lol/g9psm1sdk87zhr6gxq16yksba9azp7z5.narinfo': HTTP error 503

              response body:

              <?xml version="1.0" encoding="UTF-8" standalone="yes"?>
              <Error>
                  <Code>SlowDown</Code>
                  <Message>Your account has made too many requests; try again later.</Message>
              </Error>
failed checks.aarch64-linux.nixos-test-age-backend 1m 52s
setup: this path will be fetched (0.0 KiB download, 0.1 KiB unpacked): /nix/store/q5kca25bcgy137f0b0qsv1qzr4cpyvyf-vm-test-run-nixos-test-age-backend warning: …
setup:
this path will be fetched (0.0 KiB download, 0.1 KiB unpacked):
  /nix/store/q5kca25bcgy137f0b0qsv1qzr4cpyvyf-vm-test-run-nixos-test-age-backend
warning: ignoring the client-specified setting 'store', because it is a restricted setting and you are not a trusted user
error: gRPC QueryValidPaths on 'nix-store.geninf.io:50051' failed: error: substituter 'https://cache.clan.lol' is disabled
failed checks.aarch64-linux.nixos-test-container 3m 34s
setup: don't know how to build these paths: /nix/store/wirjv5qxd3pwb694a3wd3qxzfsx2hia4-container-test-run-container.drv warning: ignoring the client-specifie …
setup:
don't know how to build these paths:
  /nix/store/wirjv5qxd3pwb694a3wd3qxzfsx2hia4-container-test-run-container.drv
warning: ignoring the client-specified setting 'store', because it is a restricted setting and you are not a trusted user
error: gRPC QueryValidPaths on 'nix-store.geninf.io:50051' failed: error: unable to download 'https://cache.clan.lol/5yh155rah34kz5v9bpsq40fymvrl821j.narinfo': HTTP error 503

              response body:

              <?xml version="1.0" encoding="UTF-8" standalone="yes"?>
              <Error>
                  <Code>SlowDown</Code>
                  <Message>Your account has made too many requests; try again later.</Message>
              </Error>
failed checks.aarch64-linux.nixos-test-extra-python-packages 9m 39s
setup: this path will be fetched (0.0 KiB download, 0.1 KiB unpacked): /nix/store/kksizsd7qxyrn10wzzzxbsxg77pvkxjs-container-test-run-test-extra-python-packag …
setup:
this path will be fetched (0.0 KiB download, 0.1 KiB unpacked):
  /nix/store/kksizsd7qxyrn10wzzzxbsxg77pvkxjs-container-test-run-test-extra-python-packages
warning: ignoring the client-specified setting 'store', because it is a restricted setting and you are not a trusted user
error: gRPC QueryValidPaths on 'nix-store.geninf.io:50051' failed: error: substituter 'https://cache.clan.lol' is disabled
failed checks.aarch64-linux.nixos-test-password-store-mounts 2m 5s
setup: this path will be fetched (0.0 KiB download, 0.1 KiB unpacked): /nix/store/sgqvbvps31hbb0x9pp6xbyvi693d1gvm-vm-test-run-nixos-test-password-store-mount …
setup:
this path will be fetched (0.0 KiB download, 0.1 KiB unpacked):
  /nix/store/sgqvbvps31hbb0x9pp6xbyvi693d1gvm-vm-test-run-nixos-test-password-store-mounts
warning: ignoring the client-specified setting 'store', because it is a restricted setting and you are not a trusted user
error: gRPC QueryValidPaths on 'nix-store.geninf.io:50051' failed: error: unable to download 'https://cache.clan.lol/gdql6j0v6wys75snwffp2lndba695613.narinfo': HTTP error 503

              response body:

              <?xml version="1.0" encoding="UTF-8" standalone="yes"?>
              <Error>
                  <Code>SlowDown</Code>
                  <Message>Your account has made too many requests; try again later.</Message>
              </Error>
failed checks.aarch64-linux.nixos-test-secrets 26m 33s
setup: 5gg3avkwj4my96rxsdsar4mpicqs637z-sops-install-secrets-0.0.1.drv: build01: build01: input not substitutable: error: path '/nix/store/hn9wcixixbixw05zyvc9i …
setup:
5gg3avkwj4my96rxsdsar4mpicqs637z-sops-install-secrets-0.0.1.drv: build01: build01: input not substitutable: error: path '/nix/store/hn9wcixixbixw05zyvc9iaqr0lnq9bpv-sops-install-secrets-0.0.1-go-modules' is required, but there is no substituter that can build it, asking the scheduler again
5gg3avkwj4my96rxsdsar4mpicqs637z-sops-install-secrets-0.0.1.drv: build01: build01: input not substitutable: error: path '/nix/store/hn9wcixixbixw05zyvc9iaqr0lnq9bpv-sops-install-secrets-0.0.1-go-modules' is required, but there is no substituter that can build it, asking the scheduler again
fj0zmw741blim0nf0xzmg6c9v14s02ld-etc-secret-sops-file.drv: error: gRPC AddMultipleToStore on 'nix-store.geninf.io:50051' failed: error: path '/nix/store/5zaaslyrm079i7vf74ap6r18klyn513f-secret' is required, but there is no substituter that can build it
5gg3avkwj4my96rxsdsar4mpicqs637z-sops-install-secrets-0.0.1.drv: build01: build01: input not substitutable: error: path '/nix/store/hn9wcixixbixw05zyvc9iaqr0lnq9bpv-sops-install-secrets-0.0.1-go-modules' is required, but there is no substituter that can build it, asking the scheduler again
5gg3avkwj4my96rxsdsar4mpicqs637z-sops-install-secrets-0.0.1.drv: build01: build01: input not substitutable: error: path '/nix/store/hn9wcixixbixw05zyvc9iaqr0lnq9bpv-sops-install-secrets-0.0.1-go-modules' is required, but there is no substituter that can build it, asking the scheduler again
5gg3avkwj4my96rxsdsar4mpicqs637z-sops-install-secrets-0.0.1.drv: build01: build01: input not substitutable: error: path '/nix/store/hn9wcixixbixw05zyvc9iaqr0lnq9bpv-sops-install-secrets-0.0.1-go-modules' is required, but there is no substituter that can build it, asking the scheduler again
5gg3avkwj4my96rxsdsar4mpicqs637z-sops-install-secrets-0.0.1.drv: build01: build01: input not substitutable: error: path '/nix/store/hn9wcixixbixw05zyvc9iaqr0lnq9bpv-sops-install-secrets-0.0.1-go-modules' is required, but there is no substituter that can build it, asking the scheduler again
error: dependency 'ihnlfr3qf9xwfpj0iddx2j68srlcyr3v-nixos-test-driver-secrets.drv' failed
failed checks.aarch64-linux.nixos-test-user-firewall-nftables 2m 33s
setup: this path will be fetched (0.0 KiB download, 0.1 KiB unpacked): /nix/store/g4k19rg6bw2bx1anl7yibd983q0faxvm-container-test-run-user-firewall-nftables w …
setup:
this path will be fetched (0.0 KiB download, 0.1 KiB unpacked):
  /nix/store/g4k19rg6bw2bx1anl7yibd983q0faxvm-container-test-run-user-firewall-nftables
warning: ignoring the client-specified setting 'store', because it is a restricted setting and you are not a trusted user
error: gRPC QueryValidPaths on 'nix-store.geninf.io:50051' failed: error: unable to download 'https://cache.clan.lol/1g4i497zsrh5frbq5d41hk9bq9hvsv6s.narinfo': HTTP error 503

              response body:

              <?xml version="1.0" encoding="UTF-8" standalone="yes"?>
              <Error>
                  <Code>SlowDown</Code>
                  <Message>Your account has made too many requests; try again later.</Message>
              </Error>
failed checks.aarch64-linux.nixos-test-wayland-proxy-virtwl 48s
setup: don't know how to build these paths: /nix/store/q39ghmz4rv2gb92d7aynin57q5lx215y-vm-test-run-wayland-proxy-virtwl.drv warning: ignoring the client-spec …
setup:
don't know how to build these paths:
  /nix/store/q39ghmz4rv2gb92d7aynin57q5lx215y-vm-test-run-wayland-proxy-virtwl.drv
warning: ignoring the client-specified setting 'store', because it is a restricted setting and you are not a trusted user
error: gRPC QueryValidPaths on 'nix-store.geninf.io:50051' failed: error: unable to download 'https://cache.clan.lol/4mwq8hbyz3xpzpx0rwd4qivgr1462rng.narinfo': HTTP error 503

              response body:

              <?xml version="1.0" encoding="UTF-8" standalone="yes"?>
              <Error>
                  <Code>SlowDown</Code>
                  <Message>Your account has made too many requests; try again later.</Message>
              </Error>
failed checks.aarch64-linux.pytest 1m 52s
setup: this path will be fetched (0.0 KiB download, 0.1 KiB unpacked): /nix/store/phgsd2nklm6pb50v65mz7ib7f2z5mca7-network-status-pytest warning: ignoring the …
setup:
this path will be fetched (0.0 KiB download, 0.1 KiB unpacked):
  /nix/store/phgsd2nklm6pb50v65mz7ib7f2z5mca7-network-status-pytest
warning: ignoring the client-specified setting 'store', because it is a restricted setting and you are not a trusted user
error: gRPC QueryValidPaths on 'nix-store.geninf.io:50051' failed: error: substituter 'https://cache.clan.lol' is disabled
failed checks.aarch64-linux.service-dummy-test-from-flake 22s
setup: don't know how to build these paths: /nix/store/a5gnkvy7hjahp5axvpqj5gkrsqk9sq9w-container-test-run-service-dummy-test-from-flake.drv warning: ignoring …
setup:
don't know how to build these paths:
  /nix/store/a5gnkvy7hjahp5axvpqj5gkrsqk9sq9w-container-test-run-service-dummy-test-from-flake.drv
warning: ignoring the client-specified setting 'store', because it is a restricted setting and you are not a trusted user
error: gRPC QueryValidPaths on 'nix-store.geninf.io:50051' failed: error: unable to download 'https://cache.clan.lol/xqqlcnznnvf8cn1jxrmwbnv7zdivcmry.narinfo': HTTP error 503

              response body:

              <?xml version="1.0" encoding="UTF-8" standalone="yes"?>
              <Error>
                  <Code>SlowDown</Code>
                  <Message>Your account has made too many requests; try again later.</Message>
              </Error>
failed checks.aarch64-linux.syncthing-service 1m 27s
setup: don't know how to build these paths: /nix/store/7d73dyx53g4vcgmzpd82z57yiny5rpax-container-test-run-syncthing-service.drv warning: ignoring the client- …
setup:
don't know how to build these paths:
  /nix/store/7d73dyx53g4vcgmzpd82z57yiny5rpax-container-test-run-syncthing-service.drv
warning: ignoring the client-specified setting 'store', because it is a restricted setting and you are not a trusted user
error: gRPC QueryValidPaths on 'nix-store.geninf.io:50051' failed: error: unable to download 'https://cache.geninf.io/6yy3pdfnmxi3yympy4xa6m4c7p8qlng2.narinfo': HTTP error 503

              response body:

              <?xml version="1.0" encoding="UTF-8" standalone="yes"?>
              <Error>
                  <Code>SlowDown</Code>
                  <Message>Your account has made too many requests; try again later.</Message>
              </Error>
failed checks.aarch64-linux.treefmt 9m 18s
setup: az6210y6ds6zl7mbx437b89vb1sssl92-vale-styles.drv: build01: build01: input not substitutable: error: path '/nix/store/k5db0kllrqjdm96gingfmy178zg79iks-sou …
setup:
az6210y6ds6zl7mbx437b89vb1sssl92-vale-styles.drv: build01: build01: input not substitutable: error: path '/nix/store/k5db0kllrqjdm96gingfmy178zg79iks-source' is required, but there is no substituter that can build it, asking the scheduler again
az6210y6ds6zl7mbx437b89vb1sssl92-vale-styles.drv: build01: build01: input not substitutable: error: path '/nix/store/k5db0kllrqjdm96gingfmy178zg79iks-source' is required, but there is no substituter that can build it, asking the scheduler again
az6210y6ds6zl7mbx437b89vb1sssl92-vale-styles.drv: build01: build01: input not substitutable: error: path '/nix/store/k5db0kllrqjdm96gingfmy178zg79iks-source' is required, but there is no substituter that can build it, asking the scheduler again
az6210y6ds6zl7mbx437b89vb1sssl92-vale-styles.drv: build01: build01: input not substitutable: error: path '/nix/store/k5db0kllrqjdm96gingfmy178zg79iks-source' is required, but there is no substituter that can build it, asking the scheduler again
az6210y6ds6zl7mbx437b89vb1sssl92-vale-styles.drv: build01: build01: input not substitutable: error: path '/nix/store/k5db0kllrqjdm96gingfmy178zg79iks-source' is required, but there is no substituter that can build it, asking the scheduler again
az6210y6ds6zl7mbx437b89vb1sssl92-vale-styles.drv: build01: build01: input not substitutable: error: path '/nix/store/k5db0kllrqjdm96gingfmy178zg79iks-source' is required, but there is no substituter that can build it, asking the scheduler again
az6210y6ds6zl7mbx437b89vb1sssl92-vale-styles.drv: build01: build01: input not substitutable: error: path '/nix/store/k5db0kllrqjdm96gingfmy178zg79iks-source' is required, but there is no substituter that can build it, asking the scheduler again
error: dependency '58bjz4z5smx2dd7fdy6hlf2ldqq2j7qn-treefmt.drv' failed
failed checks.aarch64-linux.trusted-nix-caches 2m 30s
setup: this path will be fetched (0.0 KiB download, 0.1 KiB unpacked): /nix/store/i15n1bj6g4ixciw2gpmkpjzl537sbbm0-container-test-run-trusted-nix-caches warni …
setup:
this path will be fetched (0.0 KiB download, 0.1 KiB unpacked):
  /nix/store/i15n1bj6g4ixciw2gpmkpjzl537sbbm0-container-test-run-trusted-nix-caches
warning: ignoring the client-specified setting 'store', because it is a restricted setting and you are not a trusted user
error: gRPC QueryValidPaths on 'nix-store.geninf.io:50051' failed: error: unable to download 'https://cache.clan.lol/d5yzh5niiawcn7n62dvicb1jvjsp27j2.narinfo': HTTP error 503

              response body:

              <?xml version="1.0" encoding="UTF-8" standalone="yes"?>
              <Error>
                  <Code>SlowDown</Code>
                  <Message>Your account has made too many requests; try again later.</Message>
              </Error>
failed checks.aarch64-linux.users 3m 36s
setup: don't know how to build these paths: /nix/store/p4l44z2h6qmmwymi1d2w1c2k68w90kkq-container-test-run-users.drv warning: ignoring the client-specified se …
setup:
don't know how to build these paths:
  /nix/store/p4l44z2h6qmmwymi1d2w1c2k68w90kkq-container-test-run-users.drv
warning: ignoring the client-specified setting 'store', because it is a restricted setting and you are not a trusted user
error: gRPC QueryValidPaths on 'nix-store.geninf.io:50051' failed: error: substituter 'https://cache.clan.lol' is disabled
failed checks.aarch64-linux.wifi 1m 54s
setup: this path will be fetched (0.0 KiB download, 0.1 KiB unpacked): /nix/store/577q148k97jw88lq29gppx40yscjv9g2-vm-test-run-wifi warning: ignoring the clie …
setup:
this path will be fetched (0.0 KiB download, 0.1 KiB unpacked):
  /nix/store/577q148k97jw88lq29gppx40yscjv9g2-vm-test-run-wifi
warning: ignoring the client-specified setting 'store', because it is a restricted setting and you are not a trusted user
error: gRPC QueryValidPaths on 'nix-store.geninf.io:50051' failed: error: substituter 'https://cache.clan.lol' is disabled
failed checks.aarch64-linux.yggdrasil 21m 34s
vm-test-run-yggdrasil: File "/nix/store/bx2f2mvw7byg1lw3sjx9ya00n556icn7-nixos-test-driver-1.1/lib/python3.13/site-packages/test_driver/driver.py", line 434, …
vm-test-run-yggdrasil:
  File "/nix/store/bx2f2mvw7byg1lw3sjx9ya00n556icn7-nixos-test-driver-1.1/lib/python3.13/site-packages/test_driver/driver.py", line 434, in run_tests
    self.test_script()
    ~~~~~~~~~~~~~~~~^^
  File "/nix/store/bx2f2mvw7byg1lw3sjx9ya00n556icn7-nixos-test-driver-1.1/lib/python3.13/site-packages/test_driver/driver.py", line 392, in test_script
    exec(self.tests, symbols, None)
    ~~~~^^^^^^^^^^^^^^^^^^^^^^^^^^^
  File "<string>", line 45, in <module>
AssertionError: peer1 runtime IP 200:831b:fc02:fab1:af5f:20a9:2ddb:446 != expected IP 200:afed:dc25:49ee:51c5:a18d:d964:3025
failed checks.aarch64-linux.zerotier-multi-instance 2m 40s
setup: /nix/store/1fi2g4hr5rmllzml6f68bq3yrjjijj0j-zlib-1.3.2-dev /nix/store/pwwpmwjdmk34smyfkf61ksyp7h5kdv45-zlib-1.3.2-static /nix/store/6fhxdm9f25c7h86 …
setup:
  /nix/store/1fi2g4hr5rmllzml6f68bq3yrjjijj0j-zlib-1.3.2-dev
  /nix/store/pwwpmwjdmk34smyfkf61ksyp7h5kdv45-zlib-1.3.2-static
  /nix/store/6fhxdm9f25c7h86nadfy8qim4h9hq04d-zlib-ng-2.3.3
  /nix/store/i8f26lwk8i93hmiyrmsy752m6nwi4pmk-zstd-1.5.7
  /nix/store/01623a8kcyp04gbqsal6fys34yfigd02-zstd-1.5.7-bin
  /nix/store/9h8n7h5kayw8i7800jxjgm53q5jgdxpw-zstd-1.5.7-man
warning: ignoring the client-specified setting 'store', because it is a restricted setting and you are not a trusted user
error: gRPC QueryValidPaths on 'nix-store.geninf.io:50051' failed: error: unable to download 'https://cache.clan.lol/5lqbai60vdhy30xgnab17c31f6bp2lfs.narinfo': HTTP error 503

              response body:

              <?xml version="1.0" encoding="UTF-8" standalone="yes"?>
              <Error>
                  <Code>SlowDown</Code>
                  <Message>Your account has made too many requests; try again later.</Message>
              </Error>
failed checks.aarch64-linux.zerotier-tools-pytest 3m 27s
setup: this path will be fetched (0.0 KiB download, 0.1 KiB unpacked): /nix/store/xrwmhni6y2b4cy63pg90jplqblsmf5xm-zerotier-tools-pytest warning: ignoring the …
setup:
this path will be fetched (0.0 KiB download, 0.1 KiB unpacked):
  /nix/store/xrwmhni6y2b4cy63pg90jplqblsmf5xm-zerotier-tools-pytest
warning: ignoring the client-specified setting 'store', because it is a restricted setting and you are not a trusted user
qhaiqv2jwazh5d9g74v1ririyicmczy1-python3-3.13.15-env.drv: error: gRPC QueryValidPaths on 'nix-store.geninf.io:50051' failed: error: substituter 'https://cache.clan.lol' is disabled
error: dependency 'qhaiqv2jwazh5d9g74v1ririyicmczy1-python3-3.13.15-env.drv' failed
failed checks.x86_64-linux.admin 11m 36s
setup: 3sq1gk0ympdgpwy6p69fqbwp7h0jm8r2-unit-sshd-keygen.service.drv: build-x86-01: not scheduled here: 3sq1gk0ympdgpwy6p69fqbwp7h0jm8r2-unit-sshd-keygen.servic …
setup:
3sq1gk0ympdgpwy6p69fqbwp7h0jm8r2-unit-sshd-keygen.service.drv: build-x86-01: not scheduled here: 3sq1gk0ympdgpwy6p69fqbwp7h0jm8r2-unit-sshd-keygen.service.drv, asking the scheduler again
jypnrv5z6fzscx3wllpl4ynr53k4my8k-vars-check-admin.drv: gi-build-x86-02: not scheduled here: jypnrv5z6fzscx3wllpl4ynr53k4my8k-vars-check-admin.drv, asking the scheduler again
80lb0fwxm1rbfb7a7qxzr4lzfiplcyq4-test-vars-generated.drv: gi-build-x86-02: not scheduled here: 80lb0fwxm1rbfb7a7qxzr4lzfiplcyq4-test-vars-generated.drv, asking the scheduler again
lclmyp4ma2vgpcjyw73bynagbv5r1mg6-dbus-1.drv: build-x86-01: not scheduled here: lclmyp4ma2vgpcjyw73bynagbv5r1mg6-dbus-1.drv, asking the scheduler again
rsh70vpj55r6na39bbrwjamm7gzdhbam-sshd.conf-final.drv: gi-build-x86-02: not scheduled here: rsh70vpj55r6na39bbrwjamm7gzdhbam-sshd.conf-final.drv, asking the scheduler again
zmyms1ppigwfi2xmkypmbpccr04mficc-unit-dbus-broker.service.drv: gi-build-x86-02: not scheduled here: zmyms1ppigwfi2xmkypmbpccr04mficc-unit-dbus-broker.service.drv, asking the scheduler again
29i6g211ym31z9l5hhhgnrlxvrmqx6ph-check-sshd-config.drv: gi-build-x86-02: not scheduled here: 29i6g211ym31z9l5hhhgnrlxvrmqx6ph-check-sshd-config.drv, asking the scheduler again
error: dependency 'ahvcp2gyqywnhqblzvpqyay7mdcps8im-nixos-test-driver-admin.drv' failed
failed checks.x86_64-linux.all-packages 15s
setup: don't know how to build these paths: /nix/store/r1j8vnfw053b3igy2h8pm8yyznnqxx08-all-packages.drv warning: ignoring the client-specified setting 'store …
setup:
don't know how to build these paths:
  /nix/store/r1j8vnfw053b3igy2h8pm8yyznnqxx08-all-packages.drv
warning: ignoring the client-specified setting 'store', because it is a restricted setting and you are not a trusted user
error: gRPC QueryValidPaths on 'nix-store.geninf.io:50051' failed: error: unable to download 'https://cache.geninf.io/1qw7x29n0h6b0xsvyckwwisj4acydywi.narinfo': HTTP error 503

              response body:

              <?xml version="1.0" encoding="UTF-8" standalone="yes"?>
              <Error>
                  <Code>SlowDown</Code>
                  <Message>Your account has made too many requests; try again later.</Message>
              </Error>
failed checks.x86_64-linux.borgbackup 14m 32s
container-test-run-borgbackup: exec(self.testscript, self.test_symbols(), None) # noqa: S102 ~~~~^^^^^^^^^^^^^^^^^^^^^^^^^^^^^^^^^^^^^^^^^^^^ File "< …
container-test-run-borgbackup:
    exec(self.testscript, self.test_symbols(), None)  # noqa: S102
    ~~~~^^^^^^^^^^^^^^^^^^^^^^^^^^^^^^^^^^^^^^^^^^^^
  File "<string>", line 26, in <module>
  File "/nix/store/7pcwg3l52sff9p90k03qhavpaqk1zhfi-test-driver-0.0.1/lib/python3.13/site-packages/test_driver/__init__.py", line 475, in succeed
    raise RuntimeError(msg)
RuntimeError: Failed to run command borg-job-serverone list --json
Exit code: 2
Stdout: 
failed checks.x86_64-linux.clan-app-ui-lint 3m 22s
setup: don't know how to build these paths: /nix/store/34m06j46s1f3pvsg7rgmgh6xfpjwhfy6-clan-app-ui-lint.drv warning: ignoring the client-specified setting 's …
setup:
don't know how to build these paths:
  /nix/store/34m06j46s1f3pvsg7rgmgh6xfpjwhfy6-clan-app-ui-lint.drv
warning: ignoring the client-specified setting 'store', because it is a restricted setting and you are not a trusted user
error: gRPC QueryValidPaths on 'nix-store.geninf.io:50051' failed: error: unable to download 'https://cache.geninf.io/3nbqagrbm5210kdcxqg6hpb70y46ja4h.narinfo': HTTP error 503

              response body:

              <?xml version="1.0" encoding="UTF-8" standalone="yes"?>
              <Error>
                  <Code>SlowDown</Code>
                  <Message>Your account has made too many requests; try again later.</Message>
              </Error>
failed checks.x86_64-linux.clan-app-ui-unit-tests 2m 50s
setup: don't know how to build these paths: /nix/store/sbbskmsy1q9ybq4ix55d71xm4jqv7k5k-clan-app-ui-unit-tests.drv warning: ignoring the client-specified sett …
setup:
don't know how to build these paths:
  /nix/store/sbbskmsy1q9ybq4ix55d71xm4jqv7k5k-clan-app-ui-unit-tests.drv
warning: ignoring the client-specified setting 'store', because it is a restricted setting and you are not a trusted user
error: gRPC QueryValidPaths on 'nix-store.geninf.io:50051' failed: error: substituter 'https://cache.clan.lol' is disabled
failed checks.x86_64-linux.clan-deps 10m 46s
setup: don't know how to build these paths: /nix/store/fpshqizkgy7szqwhnawjn4d95n1jnr8n-clan-deps.drv warning: ignoring the client-specified setting 'store', …
setup:
don't know how to build these paths:
  /nix/store/fpshqizkgy7szqwhnawjn4d95n1jnr8n-clan-deps.drv
warning: ignoring the client-specified setting 'store', because it is a restricted setting and you are not a trusted user
fpshqizkgy7szqwhnawjn4d95n1jnr8n-clan-deps.drv: error: gRPC QueryValidPaths on 'nix-store.geninf.io:50051' failed: error: substituter 'https://cache.clan.lol' is disabled
error: error: gRPC QueryValidPaths on 'nix-store.geninf.io:50051' failed: error: substituter 'https://cache.clan.lol' is disabled
failed checks.x86_64-linux.clan-pytest-with-core 3m 22s
setup: don't know how to build these paths: /nix/store/2ia1g8wjdzbmckyr9fk9s5kkd9xncm8l-clan-pytest-with-core.drv warning: ignoring the client-specified setti …
setup:
don't know how to build these paths:
  /nix/store/2ia1g8wjdzbmckyr9fk9s5kkd9xncm8l-clan-pytest-with-core.drv
warning: ignoring the client-specified setting 'store', because it is a restricted setting and you are not a trusted user
error: gRPC QueryValidPaths on 'nix-store.geninf.io:50051' failed: error: unable to download 'https://cache.geninf.io/3c2brdlvvc5mpzc3g93dkw44d68zzsnx.narinfo': HTTP error 503

              response body:

              <?xml version="1.0" encoding="UTF-8" standalone="yes"?>
              <Error>
                  <Code>SlowDown</Code>
                  <Message>Your account has made too many requests; try again later.</Message>
              </Error>
failed checks.x86_64-linux.clan-pytest-without-core 4m 45s
setup: don't know how to build these paths: /nix/store/j2w68qdyw2nx3r6m5c922532a6c2zkfw-clan-pytest-without-core.drv warning: ignoring the client-specified se …
setup:
don't know how to build these paths:
  /nix/store/j2w68qdyw2nx3r6m5c922532a6c2zkfw-clan-pytest-without-core.drv
warning: ignoring the client-specified setting 'store', because it is a restricted setting and you are not a trusted user
error: gRPC QueryValidPaths on 'nix-store.geninf.io:50051' failed: error: unable to download 'https://cache.clan.lol/845s94q6g7iv6kc51hi88lw72b2pfxp4.narinfo': HTTP error 503

              response body:

              <?xml version="1.0" encoding="UTF-8" standalone="yes"?>
              <Error>
                  <Code>SlowDown</Code>
                  <Message>Your account has made too many requests; try again later.</Message>
              </Error>
failed checks.x86_64-linux.clan-release-diff-pytest 36s
setup: don't know how to build these paths: /nix/store/pwbkrl17x6f8a9c4pvi6hbgarah380bv-clan-release-diff-pytest.drv warning: ignoring the client-specified se …
setup:
don't know how to build these paths:
  /nix/store/pwbkrl17x6f8a9c4pvi6hbgarah380bv-clan-release-diff-pytest.drv
warning: ignoring the client-specified setting 'store', because it is a restricted setting and you are not a trusted user
error: gRPC QueryValidPaths on 'nix-store.geninf.io:50051' failed: error: unable to download 'https://cache.clan.lol/qy6458cj5788f9x3fg6hc7gsz0a3yjjn.narinfo': HTTP error 503

              response body:

              <?xml version="1.0" encoding="UTF-8" standalone="yes"?>
              <Error>
                  <Code>SlowDown</Code>
                  <Message>Your account has made too many requests; try again later.</Message>
              </Error>
failed checks.x86_64-linux.clan-site-lint 21s
setup: don't know how to build these paths: /nix/store/b828plifshz7kk47c5lrrw46fnzjnwv2-clan-site-lint.drv warning: ignoring the client-specified setting 'sto …
setup:
don't know how to build these paths:
  /nix/store/b828plifshz7kk47c5lrrw46fnzjnwv2-clan-site-lint.drv
warning: ignoring the client-specified setting 'store', because it is a restricted setting and you are not a trusted user
error: gRPC QueryValidPaths on 'nix-store.geninf.io:50051' failed: error: unable to download 'https://cache.geninf.io/072b1yl40061im1qar3m77zvwfps5xkm.narinfo': HTTP error 503

              response body:

              <?xml version="1.0" encoding="UTF-8" standalone="yes"?>
              <Error>
                  <Code>SlowDown</Code>
                  <Message>Your account has made too many requests; try again later.</Message>
              </Error>
failed checks.x86_64-linux.clan-test-iso 2m 46s
setup: don't know how to build these paths: /nix/store/k4bzgp7iz351hx3rgy0yvv9gm45ayh4a-container-test-run-clan-test-iso.drv warning: ignoring the client-spec …
setup:
don't know how to build these paths:
  /nix/store/k4bzgp7iz351hx3rgy0yvv9gm45ayh4a-container-test-run-clan-test-iso.drv
warning: ignoring the client-specified setting 'store', because it is a restricted setting and you are not a trusted user
error: gRPC QueryValidPaths on 'nix-store.geninf.io:50051' failed: error: substituter 'https://cache.clan.lol' is disabled
failed checks.x86_64-linux.clan-test-update 5m 28s
setup: don't know how to build these paths: /nix/store/p3kahkmiml70xk10zymva97yqpgb26lr-container-test-run-clan-test-update.drv warning: ignoring the client-s …
setup:
don't know how to build these paths:
  /nix/store/p3kahkmiml70xk10zymva97yqpgb26lr-container-test-run-clan-test-update.drv
warning: ignoring the client-specified setting 'store', because it is a restricted setting and you are not a trusted user
error: gRPC QueryValidPaths on 'nix-store.geninf.io:50051' failed: error: unable to download 'https://cache.clan.lol/gjmjjkj153hi1rp8r0ilgfqdcm89iqln.narinfo': HTTP error 503

              response body:

              <?xml version="1.0" encoding="UTF-8" standalone="yes"?>
              <Error>
                  <Code>SlowDown</Code>
                  <Message>Your account has made too many requests; try again later.</Message>
              </Error>
failed checks.x86_64-linux.darwin-test-darwin-machine 14s
setup: don't know how to build these paths: /nix/store/30s2h5rahc5lpqixa852igy5xfwrr5n5-darwin-system-26.05.c3e90c8.drv warning: ignoring the client-specified …
setup:
don't know how to build these paths:
  /nix/store/30s2h5rahc5lpqixa852igy5xfwrr5n5-darwin-system-26.05.c3e90c8.drv
warning: ignoring the client-specified setting 'store', because it is a restricted setting and you are not a trusted user
error: gRPC QueryValidPaths on 'nix-store.geninf.io:50051' failed: error: unable to download 'https://cache.clan.lol/qzjbgabhwxfhfd3pf6w68pmpvdmqzknn.narinfo': HTTP error 503

              response body:

              <?xml version="1.0" encoding="UTF-8" standalone="yes"?>
              <Error>
                  <Code>SlowDown</Code>
                  <Message>Your account has made too many requests; try again later.</Message>
              </Error>
failed checks.x86_64-linux.devshell 1m 16s
setup: don't know how to build these paths: /nix/store/lns84jglc84zh81bpsbshn9yd3w22lx8-check-devshell-not-depends-on-clan-cli.drv warning: ignoring the clien …
setup:
don't know how to build these paths:
  /nix/store/lns84jglc84zh81bpsbshn9yd3w22lx8-check-devshell-not-depends-on-clan-cli.drv
warning: ignoring the client-specified setting 'store', because it is a restricted setting and you are not a trusted user
error: gRPC QueryValidPaths on 'nix-store.geninf.io:50051' failed: error: unable to download 'https://cache.clan.lol/ycnygiaqh0nmpgjpflm16yxsbxmi3f67.narinfo': HTTP error 503

              response body:

              <?xml version="1.0" encoding="UTF-8" standalone="yes"?>
              <Error>
                  <Code>SlowDown</Code>
                  <Message>Your account has made too many requests; try again later.</Message>
              </Error>
failed checks.x86_64-linux.devShell-clan-app 16m 47s
setup: qh2mlh6dcxh613vxxn1nmjwvqdg9wls4-ui.drv: build-x86-01: build-x86-01: input not substitutable: error: path '/nix/store/6v4s8awvp8bk37qlk1y1ypms3apw3z7p-pl …
setup:
qh2mlh6dcxh613vxxn1nmjwvqdg9wls4-ui.drv: build-x86-01: build-x86-01: input not substitutable: error: path '/nix/store/6v4s8awvp8bk37qlk1y1ypms3apw3z7p-playwright-browsers' is required, but there is no substituter that can build it, asking the scheduler again
qh2mlh6dcxh613vxxn1nmjwvqdg9wls4-ui.drv: build-x86-01: build-x86-01: input not substitutable: error: path '/nix/store/6v4s8awvp8bk37qlk1y1ypms3apw3z7p-playwright-browsers' is required, but there is no substituter that can build it, asking the scheduler again
qh2mlh6dcxh613vxxn1nmjwvqdg9wls4-ui.drv: gi-build-x86-01: gi-build-x86-01: input not substitutable: error: path '/nix/store/6v4s8awvp8bk37qlk1y1ypms3apw3z7p-playwright-browsers' is required, but there is no substituter that can build it, asking the scheduler again
qh2mlh6dcxh613vxxn1nmjwvqdg9wls4-ui.drv: gi-build-x86-01: gi-build-x86-01: input not substitutable: error: path '/nix/store/6v4s8awvp8bk37qlk1y1ypms3apw3z7p-playwright-browsers' is required, but there is no substituter that can build it, asking the scheduler again
qh2mlh6dcxh613vxxn1nmjwvqdg9wls4-ui.drv: gi-build-x86-01: gi-build-x86-01: input not substitutable: error: path '/nix/store/6v4s8awvp8bk37qlk1y1ypms3apw3z7p-playwright-browsers' is required, but there is no substituter that can build it, asking the scheduler again
qh2mlh6dcxh613vxxn1nmjwvqdg9wls4-ui.drv: build-x86-01: build-x86-01: input not substitutable: error: path '/nix/store/6v4s8awvp8bk37qlk1y1ypms3apw3z7p-playwright-browsers' is required, but there is no substituter that can build it, asking the scheduler again
qh2mlh6dcxh613vxxn1nmjwvqdg9wls4-ui.drv: build-x86-01: build-x86-01: input not substitutable: error: path '/nix/store/6v4s8awvp8bk37qlk1y1ypms3apw3z7p-playwright-browsers' is required, but there is no substituter that can build it, asking the scheduler again
error: gave up after 9 reschedules
failed checks.x86_64-linux.devShell-clan-site 55s
setup: don't know how to build these paths: /nix/store/w4kg6kpz76nqhkbkk9x0hpxc64rlynvn-nix-shell.drv warning: ignoring the client-specified setting 'store', …
setup:
don't know how to build these paths:
  /nix/store/w4kg6kpz76nqhkbkk9x0hpxc64rlynvn-nix-shell.drv
warning: ignoring the client-specified setting 'store', because it is a restricted setting and you are not a trusted user
error: gRPC QueryValidPaths on 'nix-store.geninf.io:50051' failed: error: unable to download 'https://cache.geninf.io/5vnd9ip0dpns0xcvwayvh58lkghxq6pq.narinfo': HTTP error 503

              response body:

              <?xml version="1.0" encoding="UTF-8" standalone="yes"?>
              <Error>
                  <Code>SlowDown</Code>
                  <Message>Your account has made too many requests; try again later.</Message>
              </Error>
failed checks.x86_64-linux.devShell-default 48s
setup: don't know how to build these paths: /nix/store/biz38cnjiiq4fc2mbn5gcc08gdxvssy1-clan.drv warning: ignoring the client-specified setting 'store', becau …
setup:
don't know how to build these paths:
  /nix/store/biz38cnjiiq4fc2mbn5gcc08gdxvssy1-clan.drv
warning: ignoring the client-specified setting 'store', because it is a restricted setting and you are not a trusted user
error: gRPC QueryValidPaths on 'nix-store.geninf.io:50051' failed: error: unable to download 'https://cache.geninf.io/4q4gz3r87w32pcgkbg0f9dgq20vrkzzg.narinfo': HTTP error 503

              response body:

              <?xml version="1.0" encoding="UTF-8" standalone="yes"?>
              <Error>
                  <Code>SlowDown</Code>
                  <Message>Your account has made too many requests; try again later.</Message>
              </Error>
failed checks.x86_64-linux.devShell-inventory-schema 2m 7s
setup: /nix/store/ldf4dxl1crdj8fxa8a4ahwazrbrxaxwi-typos-1.46.3 /nix/store/55m9xi6q1mxb0l5yi1mbn4acd4yasxvs-uvwasi-0.0.23 /nix/store/r3qbka2idxbgjbml9r29k …
setup:
  /nix/store/ldf4dxl1crdj8fxa8a4ahwazrbrxaxwi-typos-1.46.3
  /nix/store/55m9xi6q1mxb0l5yi1mbn4acd4yasxvs-uvwasi-0.0.23
  /nix/store/r3qbka2idxbgjbml9r29ky48mxgi97jw-vale-3.14.2
  /nix/store/bnzip44jrgc40l6g0hll58zkim8x40n1-vale-styles
  /nix/store/ii8k5v4xjnqyga18ynhg9dnfyjqik5ys-vale.ini
  /nix/store/gcnz8knkrpjdnhhi8asmjanlabsw7ydm-zstd-1.5.7-dev
warning: ignoring the client-specified setting 'store', because it is a restricted setting and you are not a trusted user
error: gRPC QueryValidPaths on 'nix-store.geninf.io:50051' failed: error: unable to download 'https://cache.clan.lol/b26wci7rfiyrg67c2c1zcgcykilqa6q9.narinfo': HTTP error 503

              response body:

              <?xml version="1.0" encoding="UTF-8" standalone="yes"?>
              <Error>
                  <Code>SlowDown</Code>
                  <Message>Your account has made too many requests; try again later.</Message>
              </Error>
failed checks.x86_64-linux.devShell-network-status 2m 35s
setup: /nix/store/w0lnm1nja9kgghl79ba2ry2jknr8440s-python3.13-mypy-extensions-1.1.0 /nix/store/69p1q122vql0vj56g3h80qy74f4j9nqd-python3.13-pathspec-1.0.4 …
setup:
  /nix/store/w0lnm1nja9kgghl79ba2ry2jknr8440s-python3.13-mypy-extensions-1.1.0
  /nix/store/69p1q122vql0vj56g3h80qy74f4j9nqd-python3.13-pathspec-1.0.4
  /nix/store/mszvgr96y40182ghhyjyzcsrgjaisqxd-python3.13-pluggy-1.6.0
  /nix/store/1n12907wwhigs9r317gxx305gw2bvrq5-python3.13-pytest-9.0.3
  /nix/store/wq7pxczxcp4hrxmwnvw360sc1g8ls554-python3.13-typing-extensions-4.15.0
  /nix/store/m9crnajd0y08vlx3y0zsw9fllan36amx-ruff-0.15.14
warning: ignoring the client-specified setting 'store', because it is a restricted setting and you are not a trusted user
error: gRPC QueryValidPaths on 'nix-store.geninf.io:50051' failed: error: substituter 'https://cache.clan.lol' is disabled
failed checks.x86_64-linux.dyndns 15m 25s
setup: 3d8nk44hbvin4xzm9dqpin1qkfnplnj2-unit-acme-renew-test.example.com.timer.drv: build-x86-01: not scheduled here: 3d8nk44hbvin4xzm9dqpin1qkfnplnj2-unit-acme …
setup:
3d8nk44hbvin4xzm9dqpin1qkfnplnj2-unit-acme-renew-test.example.com.timer.drv: build-x86-01: not scheduled here: 3d8nk44hbvin4xzm9dqpin1qkfnplnj2-unit-acme-renew-test.example.com.timer.drv, asking the scheduler again
w61lq94j4x2fi7pzw82y65frnwvr75ps-generator-dyndns-namecheap-example.com.drv: build-x86-01: not scheduled here: w61lq94j4x2fi7pzw82y65frnwvr75ps-generator-dyndns-namecheap-example.com.drv, asking the scheduler again
25pyiqd3cvlxl07vzbv7xqksif7cs08h-acme-postrun.drv: build-x86-01: not scheduled here: 25pyiqd3cvlxl07vzbv7xqksif7cs08h-acme-postrun.drv, asking the scheduler again
8x9gn46xvvl2p3nd1ixb6ilsnpwvqgdq-unit-nginx-config-reload.service.drv: gi-build-x86-02: not scheduled here: 8x9gn46xvvl2p3nd1ixb6ilsnpwvqgdq-unit-nginx-config-reload.service.drv, asking the scheduler again
f108jqzld364piq7i41bv0hl3syi4y71-test-vars-generated.drv: build-x86-01: not scheduled here: f108jqzld364piq7i41bv0hl3syi4y71-test-vars-generated.drv, asking the scheduler again
imjlhdvzvxwh72i8fk8gryh69699jv4x-tmpfiles.d.drv: gi-build-x86-02: not scheduled here: imjlhdvzvxwh72i8fk8gryh69699jv4x-tmpfiles.d.drv, asking the scheduler again
wig6rw9js6nsh5lk5z78hcff7krwrs0a-decrypt-age-secrets.drv: build-x86-01: not scheduled here: wig6rw9js6nsh5lk5z78hcff7krwrs0a-decrypt-age-secrets.drv, asking the scheduler again
error: dependency '5y3bya16m6ajhdbb1ia2y7zlwm83fpi6-nixos-test-driver-dyndns.drv' failed
failed checks.x86_64-linux.eval-tests 1m 35s
setup: this path will be fetched (0.0 KiB download, 0.1 KiB unpacked): /nix/store/083k0v3ac1yklsqrhzcq1yjdd4isxm58-eval-tests-x86_64-linux warning: ignoring t …
setup:
this path will be fetched (0.0 KiB download, 0.1 KiB unpacked):
  /nix/store/083k0v3ac1yklsqrhzcq1yjdd4isxm58-eval-tests-x86_64-linux
warning: ignoring the client-specified setting 'store', because it is a restricted setting and you are not a trusted user
error: gRPC QueryValidPaths on 'nix-store.geninf.io:50051' failed: error: unable to download 'https://cache.clan.lol/3p8jcd4asfb8cybz7887lc0dc6gx55q7.narinfo': HTTP error 503

              response body:

              <?xml version="1.0" encoding="UTF-8" standalone="yes"?>
              <Error>
                  <Code>SlowDown</Code>
                  <Message>Your account has made too many requests; try again later.</Message>
              </Error>
failed checks.x86_64-linux.inventory-classes-up-to-date 1m 31s
setup: this path will be fetched (0.0 KiB download, 0.1 KiB unpacked): /nix/store/9ni1n322clsv0x4adhl720ldiwdq0w9f-inventory-classes-up-to-date warning: ignor …
setup:
this path will be fetched (0.0 KiB download, 0.1 KiB unpacked):
  /nix/store/9ni1n322clsv0x4adhl720ldiwdq0w9f-inventory-classes-up-to-date
warning: ignoring the client-specified setting 'store', because it is a restricted setting and you are not a trusted user
error: gRPC QueryValidPaths on 'nix-store.geninf.io:50051' failed: error: unable to download 'https://cache.geninf.io/790xw9p4jyym8bz2ldscvcryxb1jqqwn.narinfo': HTTP error 503

              response body:

              <?xml version="1.0" encoding="UTF-8" standalone="yes"?>
              <Error>
                  <Code>SlowDown</Code>
                  <Message>Your account has made too many requests; try again later.</Message>
              </Error>
failed checks.x86_64-linux.localbackup 2m 12s
setup: don't know how to build these paths: /nix/store/dzj12p4ylyf4yps2zybd1z5rg4mbfx7l-container-test-run-localbackup.drv warning: ignoring the client-specif …
setup:
don't know how to build these paths:
  /nix/store/dzj12p4ylyf4yps2zybd1z5rg4mbfx7l-container-test-run-localbackup.drv
warning: ignoring the client-specified setting 'store', because it is a restricted setting and you are not a trusted user
error: gRPC QueryValidPaths on 'nix-store.geninf.io:50051' failed: error: unable to download 'https://cache.geninf.io/9wdxa5cl8n0b3yc1qnsjnbj0gld2xbls.narinfo': HTTP error 503

              response body:

              <?xml version="1.0" encoding="UTF-8" standalone="yes"?>
              <Error>
                  <Code>SlowDown</Code>
                  <Message>Your account has made too many requests; try again later.</Message>
              </Error>
failed checks.x86_64-linux.matrix-synapse 14m 34s
setup: ia3lqimqf3pihmhq0sg6my24hjchp3bk-decrypt-age-secrets.drv: build-x86-01: not scheduled here: ia3lqimqf3pihmhq0sg6my24hjchp3bk-decrypt-age-secrets.drv, ask …
setup:
ia3lqimqf3pihmhq0sg6my24hjchp3bk-decrypt-age-secrets.drv: build-x86-01: not scheduled here: ia3lqimqf3pihmhq0sg6my24hjchp3bk-decrypt-age-secrets.drv, asking the scheduler again
fkkd2s5ynzal03sqxvm8l9r4sdq9xi43-unit-script-matrix-synapse-pre-start.drv: build-x86-01: not scheduled here: fkkd2s5ynzal03sqxvm8l9r4sdq9xi43-unit-script-matrix-synapse-pre-start.drv, asking the scheduler again
v60nwd2z7x6m0dz7i3fnwzs9qq6346bm-element-web-with-config.drv: gi-build-x86-02: not scheduled here: v60nwd2z7x6m0dz7i3fnwzs9qq6346bm-element-web-with-config.drv, asking the scheduler again
gd8niak0d6snwxsb25alcfkqxbbk4h8b-unit-firewall.service.drv: gi-build-x86-02: not scheduled here: gd8niak0d6snwxsb25alcfkqxbbk4h8b-unit-firewall.service.drv, asking the scheduler again
v7d8h6ai99kls170kifyag8frqb6ghwy-unit-acme-setup.service.drv: gi-build-x86-02: not scheduled here: v7d8h6ai99kls170kifyag8frqb6ghwy-unit-acme-setup.service.drv, asking the scheduler again
si5qz4sfkj3mjy1l1lnn6swna8pr10v7-unit-acme-clan.test.service.drv: gi-build-x86-02: not scheduled here: si5qz4sfkj3mjy1l1lnn6swna8pr10v7-unit-acme-clan.test.service.drv, asking the scheduler again
zkzcmcrvwrsld1j6n7bs7iay1zdl3fcw-unit-acme-order-renew-clan.test.service.drv: gi-build-x86-02: not scheduled here: zkzcmcrvwrsld1j6n7bs7iay1zdl3fcw-unit-acme-order-renew-clan.test.service.drv, asking the scheduler again
error: dependency 'zdy7fvrykmggc1f46bpjwiwk5q696ca0-nixos-test-driver-matrix-synapse.drv' failed
failed checks.x86_64-linux.mycelium 1m 57s
setup: don't know how to build these paths: /nix/store/kif0rpqkkflbil5nb8fp68fqczyhawsg-vm-test-run-mycelium.drv warning: ignoring the client-specified settin …
setup:
don't know how to build these paths:
  /nix/store/kif0rpqkkflbil5nb8fp68fqczyhawsg-vm-test-run-mycelium.drv
warning: ignoring the client-specified setting 'store', because it is a restricted setting and you are not a trusted user
error: gRPC QueryValidPaths on 'nix-store.geninf.io:50051' failed: error: unable to download 'https://cache.clan.lol/a2kpb3s7yxb4f78z37wfk7hd9zwpfshb.narinfo': HTTP error 503

              response body:

              <?xml version="1.0" encoding="UTF-8" standalone="yes"?>
              <Error>
                  <Code>SlowDown</Code>
                  <Message>Your account has made too many requests; try again later.</Message>
              </Error>
failed checks.x86_64-linux.nixos-documentation 17m 15s
setup: bkpjk17lvigp3jqiprgnbj89yn870sy7-system-path.drv: gi-build-x86-02: gi-build-x86-02: input not substitutable: error: path '/nix/store/mgnnfwf5bsjq2yjwnlin …
setup:
bkpjk17lvigp3jqiprgnbj89yn870sy7-system-path.drv: gi-build-x86-02: gi-build-x86-02: input not substitutable: error: path '/nix/store/mgnnfwf5bsjq2yjwnlinkrllr3msyjql-nixos-version' is required, but there is no substituter that can build it, asking the scheduler again
bkpjk17lvigp3jqiprgnbj89yn870sy7-system-path.drv: gi-build-x86-02: gi-build-x86-02: input not substitutable: error: path '/nix/store/mgnnfwf5bsjq2yjwnlinkrllr3msyjql-nixos-version' is required, but there is no substituter that can build it, asking the scheduler again
bkpjk17lvigp3jqiprgnbj89yn870sy7-system-path.drv: gi-build-x86-02: gi-build-x86-02: input not substitutable: error: path '/nix/store/mgnnfwf5bsjq2yjwnlinkrllr3msyjql-nixos-version' is required, but there is no substituter that can build it, asking the scheduler again
bkpjk17lvigp3jqiprgnbj89yn870sy7-system-path.drv: gi-build-x86-02: gi-build-x86-02: input not substitutable: error: path '/nix/store/mgnnfwf5bsjq2yjwnlinkrllr3msyjql-nixos-version' is required, but there is no substituter that can build it, asking the scheduler again
bkpjk17lvigp3jqiprgnbj89yn870sy7-system-path.drv: gi-build-x86-02: gi-build-x86-02: input not substitutable: error: path '/nix/store/mgnnfwf5bsjq2yjwnlinkrllr3msyjql-nixos-version' is required, but there is no substituter that can build it, asking the scheduler again
bkpjk17lvigp3jqiprgnbj89yn870sy7-system-path.drv: gi-build-x86-02: gi-build-x86-02: input not substitutable: error: path '/nix/store/mgnnfwf5bsjq2yjwnlinkrllr3msyjql-nixos-version' is required, but there is no substituter that can build it, asking the scheduler again
bkpjk17lvigp3jqiprgnbj89yn870sy7-system-path.drv: gi-build-x86-02: gi-build-x86-02: input not substitutable: error: path '/nix/store/mgnnfwf5bsjq2yjwnlinkrllr3msyjql-nixos-version' is required, but there is no substituter that can build it, asking the scheduler again
error: dependency 'bkpjk17lvigp3jqiprgnbj89yn870sy7-system-path.drv' failed
failed checks.x86_64-linux.nixos-flash-installer 22m 33s
setup: 8yr1gpa7r6qmj6nr1jx5fs51lx9b75f1-system-path.drv: gi-build-x86-01: gi-build-x86-01: input not substitutable: error: path '/nix/store/mgnnfwf5bsjq2yjwnlin …
setup:
8yr1gpa7r6qmj6nr1jx5fs51lx9b75f1-system-path.drv: gi-build-x86-01: gi-build-x86-01: input not substitutable: error: path '/nix/store/mgnnfwf5bsjq2yjwnlinkrllr3msyjql-nixos-version' is required, but there is no substituter that can build it, asking the scheduler again
8yr1gpa7r6qmj6nr1jx5fs51lx9b75f1-system-path.drv: gi-build-x86-01: gi-build-x86-01: input not substitutable: error: path '/nix/store/mgnnfwf5bsjq2yjwnlinkrllr3msyjql-nixos-version' is required, but there is no substituter that can build it, asking the scheduler again
8yr1gpa7r6qmj6nr1jx5fs51lx9b75f1-system-path.drv: gi-build-x86-01: gi-build-x86-01: input not substitutable: error: path '/nix/store/mgnnfwf5bsjq2yjwnlinkrllr3msyjql-nixos-version' is required, but there is no substituter that can build it, asking the scheduler again
8yr1gpa7r6qmj6nr1jx5fs51lx9b75f1-system-path.drv: gi-build-x86-01: gi-build-x86-01: input not substitutable: error: path '/nix/store/mgnnfwf5bsjq2yjwnlinkrllr3msyjql-nixos-version' is required, but there is no substituter that can build it, asking the scheduler again
8yr1gpa7r6qmj6nr1jx5fs51lx9b75f1-system-path.drv: gi-build-x86-01: gi-build-x86-01: input not substitutable: error: path '/nix/store/mgnnfwf5bsjq2yjwnlinkrllr3msyjql-nixos-version' is required, but there is no substituter that can build it, asking the scheduler again
8yr1gpa7r6qmj6nr1jx5fs51lx9b75f1-system-path.drv: gi-build-x86-01: gi-build-x86-01: input not substitutable: error: path '/nix/store/mgnnfwf5bsjq2yjwnlinkrllr3msyjql-nixos-version' is required, but there is no substituter that can build it, asking the scheduler again
8yr1gpa7r6qmj6nr1jx5fs51lx9b75f1-system-path.drv: gi-build-x86-01: gi-build-x86-01: input not substitutable: error: path '/nix/store/mgnnfwf5bsjq2yjwnlinkrllr3msyjql-nixos-version' is required, but there is no substituter that can build it, asking the scheduler again
error: dependency '8yr1gpa7r6qmj6nr1jx5fs51lx9b75f1-system-path.drv' failed
failed checks.x86_64-linux.nixos-test-age-backend 1m 40s
setup: don't know how to build these paths: /nix/store/zj3drr9y8a9wk5nzx164v9jky9iwqqxx-vm-test-run-nixos-test-age-backend.drv warning: ignoring the client-sp …
setup:
don't know how to build these paths:
  /nix/store/zj3drr9y8a9wk5nzx164v9jky9iwqqxx-vm-test-run-nixos-test-age-backend.drv
warning: ignoring the client-specified setting 'store', because it is a restricted setting and you are not a trusted user
error: gRPC QueryValidPaths on 'nix-store.geninf.io:50051' failed: error: substituter 'https://cache.clan.lol' is disabled
failed checks.x86_64-linux.nixos-test-extra-python-packages 8m 13s
setup: don't know how to build these paths: /nix/store/vw1d8i13ygchh242fjlx51xxdq8w8ij0-container-test-run-test-extra-python-packages.drv warning: ignoring th …
setup:
don't know how to build these paths:
  /nix/store/vw1d8i13ygchh242fjlx51xxdq8w8ij0-container-test-run-test-extra-python-packages.drv
warning: ignoring the client-specified setting 'store', because it is a restricted setting and you are not a trusted user
error: gRPC QueryValidPaths on 'nix-store.geninf.io:50051' failed: error: substituter 'https://cache.clan.lol' is disabled
failed checks.x86_64-linux.nixos-test-flash-installer-boot 15m 48s
setup: cl9dgc4rv6hzbvcyd9hda2wgim26y0nw-unit-reload-systemd-vconsole-setup.service.drv: gi-build-x86-02: not scheduled here: cl9dgc4rv6hzbvcyd9hda2wgim26y0nw-un …
setup:
cl9dgc4rv6hzbvcyd9hda2wgim26y0nw-unit-reload-systemd-vconsole-setup.service.drv: gi-build-x86-02: not scheduled here: cl9dgc4rv6hzbvcyd9hda2wgim26y0nw-unit-reload-systemd-vconsole-setup.service.drv, asking the scheduler again
zrwq3w7jvvw534xr2vp9l2xk35a5rqw4-initrd-linux-7.2.6.drv: gi-build-x86-01: not scheduled here: zrwq3w7jvvw534xr2vp9l2xk35a5rqw4-initrd-linux-7.2.6.drv, asking the scheduler again
bfgxlwj2vxqfyy67zbb4xmqw1hzjj14k-unit-nix-daemon.service.drv: build-x86-01: not scheduled here: bfgxlwj2vxqfyy67zbb4xmqw1hzjj14k-unit-nix-daemon.service.drv, asking the scheduler again
zgqwghrjbibb3x85mhi4sr25vjpq5vqq-unit-nix-channel-init.service.drv: gi-build-x86-02: not scheduled here: zgqwghrjbibb3x85mhi4sr25vjpq5vqq-unit-nix-channel-init.service.drv, asking the scheduler again
arzcragl97jrqmasr1jvayg4lcf5lq3c-unit-systemd-udevd.service.drv: gi-build-x86-02: not scheduled here: arzcragl97jrqmasr1jvayg4lcf5lq3c-unit-systemd-udevd.service.drv, asking the scheduler again
75afjss6gbswg7bbgcw37dj235vri04d-X-Restart-Triggers-systemd-sysctl.drv: gi-build-x86-02: not scheduled here: 75afjss6gbswg7bbgcw37dj235vri04d-X-Restart-Triggers-systemd-sysctl.drv, asking the scheduler again
19575qc43s27r8yi0lvi2fmgsk94ar7b-X-Restart-Triggers-dbus-broker.drv: build-x86-01: not scheduled here: 19575qc43s27r8yi0lvi2fmgsk94ar7b-X-Restart-Triggers-dbus-broker.drv, asking the scheduler again
error: dependency 'd75d1r5clw9338rq6rjz1qfc9cwzrdgj-nixos-test-driver-flash-installer-boot.drv' failed
failed checks.x86_64-linux.nixos-test-installation-age 2m 35s
setup: this path will be fetched (0.0 KiB download, 0.1 KiB unpacked): /nix/store/izvjs9svfmmnshcc0wc0wzjii8wqxbix-vm-test-run-installation warning: ignoring …
setup:
this path will be fetched (0.0 KiB download, 0.1 KiB unpacked):
  /nix/store/izvjs9svfmmnshcc0wc0wzjii8wqxbix-vm-test-run-installation
warning: ignoring the client-specified setting 'store', because it is a restricted setting and you are not a trusted user
error: gRPC QueryValidPaths on 'nix-store.geninf.io:50051' failed: error: unable to download 'https://cache.geninf.io/58cwwg3k650151dsnm2rsy1vzc8j62dp.narinfo': HTTP error 503

              response body:

              <?xml version="1.0" encoding="UTF-8" standalone="yes"?>
              <Error>
                  <Code>SlowDown</Code>
                  <Message>Your account has made too many requests; try again later.</Message>
              </Error>
failed checks.x86_64-linux.nixos-test-installation-password-store 1m 56s
setup: this path will be fetched (0.0 KiB download, 0.1 KiB unpacked): /nix/store/va19bm0fvbxqr08b3hx3rqdgmnbw1n3n-vm-test-run-installation warning: ignoring …
setup:
this path will be fetched (0.0 KiB download, 0.1 KiB unpacked):
  /nix/store/va19bm0fvbxqr08b3hx3rqdgmnbw1n3n-vm-test-run-installation
warning: ignoring the client-specified setting 'store', because it is a restricted setting and you are not a trusted user
error: gRPC QueryValidPaths on 'nix-store.geninf.io:50051' failed: error: unable to download 'https://cache.geninf.io/4nm4phbk6fslbm9wa640xhaxysia3clg.narinfo': HTTP error 503

              response body:

              <?xml version="1.0" encoding="UTF-8" standalone="yes"?>
              <Error>
                  <Code>SlowDown</Code>
                  <Message>Your account has made too many requests; try again later.</Message>
              </Error>
failed checks.x86_64-linux.nixos-test-password-store-mounts 6m 34s
setup: don't know how to build these paths: /nix/store/78di627k6pm5h7m7ma3npficj8jlzcca-vm-test-run-nixos-test-password-store-mounts.drv warning: ignoring the …
setup:
don't know how to build these paths:
  /nix/store/78di627k6pm5h7m7ma3npficj8jlzcca-vm-test-run-nixos-test-password-store-mounts.drv
warning: ignoring the client-specified setting 'store', because it is a restricted setting and you are not a trusted user
error: gRPC QueryValidPaths on 'nix-store.geninf.io:50051' failed: error: unable to download 'https://cache.clan.lol/fq4bs6ryxgczk19z6jjggiqiyd749sm0.narinfo': HTTP error 503

              response body:

              <?xml version="1.0" encoding="UTF-8" standalone="yes"?>
              <Error>
                  <Code>SlowDown</Code>
                  <Message>Your account has made too many requests; try again later.</Message>
              </Error>
failed checks.x86_64-linux.nixos-test-secrets 16m 19s
setup: 8s1sqhxw2cgbgy9cqihhdrjjncx4q078-sops-install-secrets-0.0.1.drv: gi-build-x86-02: gi-build-x86-02: input not substitutable: error: path '/nix/store/hn9wc …
setup:
8s1sqhxw2cgbgy9cqihhdrjjncx4q078-sops-install-secrets-0.0.1.drv: gi-build-x86-02: gi-build-x86-02: input not substitutable: error: path '/nix/store/hn9wcixixbixw05zyvc9iaqr0lnq9bpv-sops-install-secrets-0.0.1-go-modules' is required, but there is no substituter that can build it, asking the scheduler again
8s1sqhxw2cgbgy9cqihhdrjjncx4q078-sops-install-secrets-0.0.1.drv: gi-build-x86-02: gi-build-x86-02: input not substitutable: error: path '/nix/store/hn9wcixixbixw05zyvc9iaqr0lnq9bpv-sops-install-secrets-0.0.1-go-modules' is required, but there is no substituter that can build it, asking the scheduler again
8s1sqhxw2cgbgy9cqihhdrjjncx4q078-sops-install-secrets-0.0.1.drv: build-x86-01: build-x86-01: input not substitutable: error: path '/nix/store/hn9wcixixbixw05zyvc9iaqr0lnq9bpv-sops-install-secrets-0.0.1-go-modules' is required, but there is no substituter that can build it, asking the scheduler again
8s1sqhxw2cgbgy9cqihhdrjjncx4q078-sops-install-secrets-0.0.1.drv: web01: web01: input not substitutable: error: path '/nix/store/hn9wcixixbixw05zyvc9iaqr0lnq9bpv-sops-install-secrets-0.0.1-go-modules' is required, but there is no substituter that can build it, asking the scheduler again
8s1sqhxw2cgbgy9cqihhdrjjncx4q078-sops-install-secrets-0.0.1.drv: web01: web01: input not substitutable: error: path '/nix/store/hn9wcixixbixw05zyvc9iaqr0lnq9bpv-sops-install-secrets-0.0.1-go-modules' is required, but there is no substituter that can build it, asking the scheduler again
8s1sqhxw2cgbgy9cqihhdrjjncx4q078-sops-install-secrets-0.0.1.drv: build-x86-01: build-x86-01: input not substitutable: error: path '/nix/store/hn9wcixixbixw05zyvc9iaqr0lnq9bpv-sops-install-secrets-0.0.1-go-modules' is required, but there is no substituter that can build it, asking the scheduler again
8s1sqhxw2cgbgy9cqihhdrjjncx4q078-sops-install-secrets-0.0.1.drv: build-x86-01: build-x86-01: input not substitutable: error: path '/nix/store/hn9wcixixbixw05zyvc9iaqr0lnq9bpv-sops-install-secrets-0.0.1-go-modules' is required, but there is no substituter that can build it, asking the scheduler again
error: dependency '3qj9a7pnz2zcwsy3f6zfni3pbzw1ha45-nixos-test-driver-secrets.drv' failed
failed checks.x86_64-linux.state-version 2m 22s
setup: this path will be fetched (0.0 KiB download, 0.1 KiB unpacked): /nix/store/d3df43kq7hpbz8v6v7i58hgbsckvcvwg-container-test-run-service-state-version wa …
setup:
this path will be fetched (0.0 KiB download, 0.1 KiB unpacked):
  /nix/store/d3df43kq7hpbz8v6v7i58hgbsckvcvwg-container-test-run-service-state-version
warning: ignoring the client-specified setting 'store', because it is a restricted setting and you are not a trusted user
error: gRPC QueryValidPaths on 'nix-store.geninf.io:50051' failed: error: unable to download 'https://cache.geninf.io/g9kcz98zlmgdb8s0h7mgyamsphngc6m2.narinfo': HTTP error 503

              response body:

              <?xml version="1.0" encoding="UTF-8" standalone="yes"?>
              <Error>
                  <Code>SlowDown</Code>
                  <Message>Your account has made too many requests; try again later.</Message>
              </Error>
failed checks.x86_64-linux.template-minimal 16m 21s
setup: xlzp1xlvg1cciz5z64scgjjclf26mkmd-system-path.drv: web01: web01: input not substitutable: error: path '/nix/store/mgnnfwf5bsjq2yjwnlinkrllr3msyjql-nixos-v …
setup:
xlzp1xlvg1cciz5z64scgjjclf26mkmd-system-path.drv: web01: web01: input not substitutable: error: path '/nix/store/mgnnfwf5bsjq2yjwnlinkrllr3msyjql-nixos-version' is required, but there is no substituter that can build it, asking the scheduler again
xlzp1xlvg1cciz5z64scgjjclf26mkmd-system-path.drv: web01: web01: input not substitutable: error: path '/nix/store/mgnnfwf5bsjq2yjwnlinkrllr3msyjql-nixos-version' is required, but there is no substituter that can build it, asking the scheduler again
xlzp1xlvg1cciz5z64scgjjclf26mkmd-system-path.drv: web01: web01: input not substitutable: error: path '/nix/store/mgnnfwf5bsjq2yjwnlinkrllr3msyjql-nixos-version' is required, but there is no substituter that can build it, asking the scheduler again
xlzp1xlvg1cciz5z64scgjjclf26mkmd-system-path.drv: web01: web01: input not substitutable: error: path '/nix/store/mgnnfwf5bsjq2yjwnlinkrllr3msyjql-nixos-version' is required, but there is no substituter that can build it, asking the scheduler again
xlzp1xlvg1cciz5z64scgjjclf26mkmd-system-path.drv: web01: web01: input not substitutable: error: path '/nix/store/mgnnfwf5bsjq2yjwnlinkrllr3msyjql-nixos-version' is required, but there is no substituter that can build it, asking the scheduler again
xlzp1xlvg1cciz5z64scgjjclf26mkmd-system-path.drv: web01: web01: input not substitutable: error: path '/nix/store/mgnnfwf5bsjq2yjwnlinkrllr3msyjql-nixos-version' is required, but there is no substituter that can build it, asking the scheduler again
xlzp1xlvg1cciz5z64scgjjclf26mkmd-system-path.drv: web01: web01: input not substitutable: error: path '/nix/store/mgnnfwf5bsjq2yjwnlinkrllr3msyjql-nixos-version' is required, but there is no substituter that can build it, asking the scheduler again
error: dependency 'xlzp1xlvg1cciz5z64scgjjclf26mkmd-system-path.drv' failed
failed checks.x86_64-linux.wifi 19m 1s
setup: qypzi8m02qy250dafx1pnwj8jq1v8kj1-wifi-secrets.drv: gi-build-x86-02: not scheduled here: qypzi8m02qy250dafx1pnwj8jq1v8kj1-wifi-secrets.drv, asking the sch …
setup:
qypzi8m02qy250dafx1pnwj8jq1v8kj1-wifi-secrets.drv: gi-build-x86-02: not scheduled here: qypzi8m02qy250dafx1pnwj8jq1v8kj1-wifi-secrets.drv, asking the scheduler again
fvqs5d0a0nmjjpajd4vbzqv6iy1qfjpi-dry-activate.drv: gi-build-x86-02: not scheduled here: fvqs5d0a0nmjjpajd4vbzqv6iy1qfjpi-dry-activate.drv, asking the scheduler again
shs63lxj1hj0676z34md518fj0kdksf9-X-Restart-Triggers-systemd-udevd.drv: gi-build-x86-02: not scheduled here: shs63lxj1hj0676z34md518fj0kdksf9-X-Restart-Triggers-systemd-udevd.drv, asking the scheduler again
w6473kgfnw6wh3b2xykxnkhi8scv6wq6-X-Restart-Triggers-polkit.drv: gi-build-x86-02: not scheduled here: w6473kgfnw6wh3b2xykxnkhi8scv6wq6-X-Restart-Triggers-polkit.drv, asking the scheduler again
kmy9wpp72188x77n4wcsqlppgjb20hhp-X-Restart-Triggers-dbus-broker.drv: gi-build-x86-02: not scheduled here: kmy9wpp72188x77n4wcsqlppgjb20hhp-X-Restart-Triggers-dbus-broker.drv, asking the scheduler again
s4dca0vqw47s04bh0a0svl9vmb2y51p5-unit-systemd-udevd.service.drv: gi-build-x86-02: not scheduled here: s4dca0vqw47s04bh0a0svl9vmb2y51p5-unit-systemd-udevd.service.drv, asking the scheduler again
193ql7kfkwzxsx76wnfr0ig7ic4a0svp-unit-dbus-broker.service.drv: build-x86-01: not scheduled here: 193ql7kfkwzxsx76wnfr0ig7ic4a0svp-unit-dbus-broker.service.drv, asking the scheduler again
error: dependency 'zgal5kkr6b94rq50j810ajc3qfrlfkil-nixos-test-driver-wifi.drv' failed
failed checks.x86_64-linux.yggdrasil 13m 37s
vm-test-run-yggdrasil: File "/nix/store/5gla70yh1jf2h11bxm4w6ggkz5sxnn95-nixos-test-driver-1.1/lib/python3.13/site-packages/test_driver/driver.py", line 434, …
vm-test-run-yggdrasil:
  File "/nix/store/5gla70yh1jf2h11bxm4w6ggkz5sxnn95-nixos-test-driver-1.1/lib/python3.13/site-packages/test_driver/driver.py", line 434, in run_tests
    self.test_script()
    ~~~~~~~~~~~~~~~~^^
  File "/nix/store/5gla70yh1jf2h11bxm4w6ggkz5sxnn95-nixos-test-driver-1.1/lib/python3.13/site-packages/test_driver/driver.py", line 392, in test_script
    exec(self.tests, symbols, None)
    ~~~~^^^^^^^^^^^^^^^^^^^^^^^^^^^
  File "<string>", line 45, in <module>
AssertionError: peer1 runtime IP 200:831b:fc02:fab1:af5f:20a9:2ddb:446 != expected IP 200:afed:dc25:49ee:51c5:a18d:d964:3025
failed checks.x86_64-linux.zerotier-multi-instance 16s
setup: don't know how to build these paths: /nix/store/clji03h3hzvy2f00c0a2hhwjb9k39rmb-vm-test-run-zerotier-multi-instance.drv warning: ignoring the client-s …
setup:
don't know how to build these paths:
  /nix/store/clji03h3hzvy2f00c0a2hhwjb9k39rmb-vm-test-run-zerotier-multi-instance.drv
warning: ignoring the client-specified setting 'store', because it is a restricted setting and you are not a trusted user
error: gRPC QueryValidPaths on 'nix-store.geninf.io:50051' failed: error: unable to download 'https://cache.clan.lol/x9wr6h5jicddwjwqfvbhz960k8q1x3ww.narinfo': HTTP error 503

              response body:

              <?xml version="1.0" encoding="UTF-8" standalone="yes"?>
              <Error>
                  <Code>SlowDown</Code>
                  <Message>Your account has made too many requests; try again later.</Message>
              </Error>
63 succeeded
succeeded attributes
status attribute duration
loading…