nixbot

builds

clan/clan-core build #766 failed

branch 26.05 · PR #8138 · commit a13d77d1be · · took 16m 4s · eval 3m 8s

eval warnings 9 kinds · 537 occurrences
  • error unable to download 'https://cache.clan.lol/…': HTTP error 503 ×48
  • error unable to download 'https://cache.geninf.io/…': HTTP error 503 ×7
  • warn unable to download 'https://cache-local.geninf.io/…': Failed sending data to the peer (55) Send failure: Broken pipe ×4
  • warn unable to download 'https://cache-local.geninf.io/…': SSL connect error (35) TLS connect error: error:0A000126:SSL routines::unexpected eof while reading ×12
  • warn unable to download 'https://cache-local.geninf.io/…': SSL connect error (35) Recv failure: Connection reset by peer ×4
  • warn unable to download 'https://cache-local.geninf.io/…': HTTP error 500 ×102
  • warn unable to download 'https://cache-local.geninf.io/…': HTTP error 500 (curl error: Failed sending data to the peer) ×1
  • warn unable to download 'https://cache.clan.lol/…': HTTP error 503 ×235
  • warn unable to download 'https://cache.geninf.io/…': HTTP error 503 ×124

118 failed
failed attributes
status attribute duration
failed checks.aarch64-darwin.all-packages 5m 36s
setup: don't know how to build these paths: /nix/store/m4yijby0qysjcarmfzahwpd5q6pz8rx5-all-packages.drv warning: ignoring the client-specified setting 'store …
setup:
don't know how to build these paths:
  /nix/store/m4yijby0qysjcarmfzahwpd5q6pz8rx5-all-packages.drv
warning: ignoring the client-specified setting 'store', because it is a restricted setting and you are not a trusted user
error: gRPC QueryValidPaths on 'nix-store.geninf.io:50051' failed: error: substituter 'https://cache.clan.lol' is disabled
failed checks.aarch64-darwin.clan-deps 1m 0s
setup: don't know how to build these paths: /nix/store/ijxdd4bpbfzj9i50nsl508358fqnp966-clan-deps.drv warning: ignoring the client-specified setting 'store', …
setup:
don't know how to build these paths:
  /nix/store/ijxdd4bpbfzj9i50nsl508358fqnp966-clan-deps.drv
warning: ignoring the client-specified setting 'store', because it is a restricted setting and you are not a trusted user
error: gRPC QueryValidPaths on 'nix-store.geninf.io:50051' failed: error: unable to download 'https://cache.clan.lol/agnjrfrki2qrms95klhrdnpq9r32gp6g.narinfo': HTTP error 503

              response body:

              <?xml version="1.0" encoding="UTF-8" standalone="yes"?>
              <Error>
                  <Code>SlowDown</Code>
                  <Message>Your account has made too many requests; try again later.</Message>
              </Error>
failed checks.aarch64-darwin.clan-pytest-with-core 26s
setup: these 2 paths will be fetched (0.0 KiB download, 5.2 MiB unpacked): /nix/store/dyvjg5rdky27rmy95h6h370y5rsib9h7-clan-pytest-with-core /nix/store/kknw …
setup:
these 2 paths will be fetched (0.0 KiB download, 5.2 MiB unpacked):
  /nix/store/dyvjg5rdky27rmy95h6h370y5rsib9h7-clan-pytest-with-core
  /nix/store/kknw77v6hb84zz5hlzbg58xgb2x23x65-clan-runtime
warning: ignoring the client-specified setting 'store', because it is a restricted setting and you are not a trusted user
error: gRPC QueryValidPaths on 'nix-store.geninf.io:50051' failed: error: unable to download 'https://cache.geninf.io/47mvj57lwl1054k9cpcjgiz41zpn3zbm.narinfo': HTTP error 503

              response body:

              <?xml version="1.0" encoding="UTF-8" standalone="yes"?>
              <Error>
                  <Code>SlowDown</Code>
                  <Message>Your account has made too many requests; try again later.</Message>
              </Error>
failed checks.aarch64-darwin.clan-pytest-without-core 2m 15s
setup: don't know how to build these paths: /nix/store/0byblbwasf6hvw7wxjigs5i681lxplcx-clan-pytest-without-core.drv warning: ignoring the client-specified se …
setup:
don't know how to build these paths:
  /nix/store/0byblbwasf6hvw7wxjigs5i681lxplcx-clan-pytest-without-core.drv
warning: ignoring the client-specified setting 'store', because it is a restricted setting and you are not a trusted user
error: gRPC QueryValidPaths on 'nix-store.geninf.io:50051' failed: error: unable to download 'https://cache.clan.lol/wbf10dhkz5g5l6rnbzcy3glwh6753s51.narinfo': HTTP error 503

              response body:

              <?xml version="1.0" encoding="UTF-8" standalone="yes"?>
              <Error>
                  <Code>SlowDown</Code>
                  <Message>Your account has made too many requests; try again later.</Message>
              </Error>
failed checks.aarch64-darwin.darwin-test-darwin-machine 1m 14s
setup: don't know how to build these paths: /nix/store/30s2h5rahc5lpqixa852igy5xfwrr5n5-darwin-system-26.05.c3e90c8.drv warning: ignoring the client-specified …
setup:
don't know how to build these paths:
  /nix/store/30s2h5rahc5lpqixa852igy5xfwrr5n5-darwin-system-26.05.c3e90c8.drv
warning: ignoring the client-specified setting 'store', because it is a restricted setting and you are not a trusted user
error: gRPC QueryValidPaths on 'nix-store.geninf.io:50051' failed: error: unable to download 'https://cache.clan.lol/4y4lcgph9vg82nccmyyn3xkzfd6ipd9q.narinfo': HTTP error 503

              response body:

              <?xml version="1.0" encoding="UTF-8" standalone="yes"?>
              <Error>
                  <Code>SlowDown</Code>
                  <Message>Your account has made too many requests; try again later.</Message>
              </Error>
failed checks.aarch64-darwin.devshell 8m 14s
setup: don't know how to build these paths: /nix/store/j91g9c4rzag1c4rspq8c6b8y8rmac04d-check-devshell-not-depends-on-clan-cli.drv warning: ignoring the clien …
setup:
don't know how to build these paths:
  /nix/store/j91g9c4rzag1c4rspq8c6b8y8rmac04d-check-devshell-not-depends-on-clan-cli.drv
warning: ignoring the client-specified setting 'store', because it is a restricted setting and you are not a trusted user
error: gRPC QueryValidPaths on 'nix-store.geninf.io:50051' failed: error: unable to download 'https://cache.geninf.io/d8n7sglfwwp4qnq2dnzbfnxfy3nylrjm.narinfo': HTTP error 503

              response body:

              <?xml version="1.0" encoding="UTF-8" standalone="yes"?>
              <Error>
                  <Code>SlowDown</Code>
                  <Message>Your account has made too many requests; try again later.</Message>
              </Error>
failed checks.aarch64-darwin.devShell-clan-app 11m 47s
setup: aa716477gi9adki33dm49b0wiwcn1gag-vale-styles.drv: build04: build04: input not substitutable: error: path '/nix/store/k5db0kllrqjdm96gingfmy178zg79iks-sou …
setup:
aa716477gi9adki33dm49b0wiwcn1gag-vale-styles.drv: build04: build04: input not substitutable: error: path '/nix/store/k5db0kllrqjdm96gingfmy178zg79iks-source' is required, but there is no substituter that can build it, asking the scheduler again
aa716477gi9adki33dm49b0wiwcn1gag-vale-styles.drv: build04: build04: input not substitutable: error: path '/nix/store/k5db0kllrqjdm96gingfmy178zg79iks-source' is required, but there is no substituter that can build it, asking the scheduler again
aa716477gi9adki33dm49b0wiwcn1gag-vale-styles.drv: build04: build04: input not substitutable: error: path '/nix/store/k5db0kllrqjdm96gingfmy178zg79iks-source' is required, but there is no substituter that can build it, asking the scheduler again
aa716477gi9adki33dm49b0wiwcn1gag-vale-styles.drv: build04: build04: input not substitutable: error: path '/nix/store/k5db0kllrqjdm96gingfmy178zg79iks-source' is required, but there is no substituter that can build it, asking the scheduler again
aa716477gi9adki33dm49b0wiwcn1gag-vale-styles.drv: build04: build04: input not substitutable: error: path '/nix/store/k5db0kllrqjdm96gingfmy178zg79iks-source' is required, but there is no substituter that can build it, asking the scheduler again
aa716477gi9adki33dm49b0wiwcn1gag-vale-styles.drv: build04: build04: input not substitutable: error: path '/nix/store/k5db0kllrqjdm96gingfmy178zg79iks-source' is required, but there is no substituter that can build it, asking the scheduler again
aa716477gi9adki33dm49b0wiwcn1gag-vale-styles.drv: build04: build04: input not substitutable: error: path '/nix/store/k5db0kllrqjdm96gingfmy178zg79iks-source' is required, but there is no substituter that can build it, asking the scheduler again
error: dependency 'wws6ga8jzcylxh62y5mcihsl27p7hq0n-treefmt.drv' failed
failed checks.aarch64-darwin.devShell-clan-cli 1m 17s
setup: don't know how to build these paths: /nix/store/gz692xnrv16a0d0xq1akx6k512v35w9w-clan-cli.drv warning: ignoring the client-specified setting 'store', b …
setup:
don't know how to build these paths:
  /nix/store/gz692xnrv16a0d0xq1akx6k512v35w9w-clan-cli.drv
warning: ignoring the client-specified setting 'store', because it is a restricted setting and you are not a trusted user
error: gRPC QueryValidPaths on 'nix-store.geninf.io:50051' failed: error: unable to download 'https://cache.clan.lol/6kjsnd6jm816xhi6a75rn8vcxcvk5531.narinfo': HTTP error 503

              response body:

              <?xml version="1.0" encoding="UTF-8" standalone="yes"?>
              <Error>
                  <Code>SlowDown</Code>
                  <Message>Your account has made too many requests; try again later.</Message>
              </Error>
failed checks.aarch64-darwin.devShell-clan-site 6m 58s
setup: don't know how to build these paths: /nix/store/gxf59nvfx4pvmsprjsgp7rhz3cfwd9gk-nix-shell.drv warning: ignoring the client-specified setting 'store', …
setup:
don't know how to build these paths:
  /nix/store/gxf59nvfx4pvmsprjsgp7rhz3cfwd9gk-nix-shell.drv
warning: ignoring the client-specified setting 'store', because it is a restricted setting and you are not a trusted user
error: gRPC QueryValidPaths on 'nix-store.geninf.io:50051' failed: error: unable to download 'https://cache.clan.lol/y10bmglczv8c1d273i981nq3jzchhdy9.narinfo': HTTP error 503

              response body:

              <?xml version="1.0" encoding="UTF-8" standalone="yes"?>
              <Error>
                  <Code>SlowDown</Code>
                  <Message>Your account has made too many requests; try again later.</Message>
              </Error>
failed checks.aarch64-darwin.devShell-default 4m 53s
setup: don't know how to build these paths: /nix/store/ll0zjb2s04x10cpdq7rqw95076rdrjik-clan.drv warning: ignoring the client-specified setting 'store', becau …
setup:
don't know how to build these paths:
  /nix/store/ll0zjb2s04x10cpdq7rqw95076rdrjik-clan.drv
warning: ignoring the client-specified setting 'store', because it is a restricted setting and you are not a trusted user
error: gRPC QueryValidPaths on 'nix-store.geninf.io:50051' failed: error: substituter 'https://cache.clan.lol' is disabled
failed checks.aarch64-darwin.devShell-inventory-schema 53s
setup: don't know how to build these paths: /nix/store/z4p4js1zi81pi47g1y87n57vl6lbcwly-clan-inventory-schema.drv warning: ignoring the client-specified setti …
setup:
don't know how to build these paths:
  /nix/store/z4p4js1zi81pi47g1y87n57vl6lbcwly-clan-inventory-schema.drv
warning: ignoring the client-specified setting 'store', because it is a restricted setting and you are not a trusted user
error: gRPC QueryValidPaths on 'nix-store.geninf.io:50051' failed: error: unable to download 'https://cache.geninf.io/54n9acvy5qd1qm7g77xh1g7a3a3kxvs7.narinfo': HTTP error 503

              response body:

              <?xml version="1.0" encoding="UTF-8" standalone="yes"?>
              <Error>
                  <Code>SlowDown</Code>
                  <Message>Your account has made too many requests; try again later.</Message>
              </Error>
failed checks.aarch64-darwin.eval-tests 28s
setup: don't know how to build these paths: /nix/store/dxwwmy44l7gqjvkwl2kjjqxrs1l8gjpd-eval-tests-aarch64-darwin.drv warning: ignoring the client-specified s …
setup:
don't know how to build these paths:
  /nix/store/dxwwmy44l7gqjvkwl2kjjqxrs1l8gjpd-eval-tests-aarch64-darwin.drv
warning: ignoring the client-specified setting 'store', because it is a restricted setting and you are not a trusted user
error: gRPC QueryValidPaths on 'nix-store.geninf.io:50051' failed: error: unable to download 'https://cache.clan.lol/qx4j96g3hx15q212yy9wszcbw7wbas10.narinfo': HTTP error 503

              response body:

              <?xml version="1.0" encoding="UTF-8" standalone="yes"?>
              <Error>
                  <Code>SlowDown</Code>
                  <Message>Your account has made too many requests; try again later.</Message>
              </Error>
failed checks.aarch64-darwin.inventory-classes-up-to-date 17s
setup: don't know how to build these paths: /nix/store/g06yn485pmlzq7irq3mii7clvwmrhxc7-inventory-classes-up-to-date.drv warning: ignoring the client-specifie …
setup:
don't know how to build these paths:
  /nix/store/g06yn485pmlzq7irq3mii7clvwmrhxc7-inventory-classes-up-to-date.drv
warning: ignoring the client-specified setting 'store', because it is a restricted setting and you are not a trusted user
error: gRPC QueryValidPaths on 'nix-store.geninf.io:50051' failed: error: unable to download 'https://cache.clan.lol/hqsmggnzrh4q00kqmhqp6g46hrsnpw0s.narinfo': HTTP error 503

              response body:

              <?xml version="1.0" encoding="UTF-8" standalone="yes"?>
              <Error>
                  <Code>SlowDown</Code>
                  <Message>Your account has made too many requests; try again later.</Message>
              </Error>
failed checks.aarch64-darwin.lib-jsonschema-example-valid 1m 8s
setup: this path will be fetched (0.0 KiB download, 0.1 KiB unpacked): /nix/store/r8cxgcd0qi69dj227ss498r551rqjbnd-lib-jsonschema-example-valid warning: ignor …
setup:
this path will be fetched (0.0 KiB download, 0.1 KiB unpacked):
  /nix/store/r8cxgcd0qi69dj227ss498r551rqjbnd-lib-jsonschema-example-valid
warning: ignoring the client-specified setting 'store', because it is a restricted setting and you are not a trusted user
error: gRPC QueryValidPaths on 'nix-store.geninf.io:50051' failed: error: unable to download 'https://cache.clan.lol/pcpsh5cgyh4h8v9m5vygrz82wdh3hnhq.narinfo': HTTP error 503

              response body:

              <?xml version="1.0" encoding="UTF-8" standalone="yes"?>
              <Error>
                  <Code>SlowDown</Code>
                  <Message>Your account has made too many requests; try again later.</Message>
              </Error>
failed checks.aarch64-darwin.nixos-flash-installer 11m 34s
setup: m37byma39dgnsd6517g5x89r4446iwpz-etc-nix-registry.json.drv: build-x86-01: build-x86-01: input not substitutable: error: path '/nix/store/hq6cx345rcflxnad …
setup:
m37byma39dgnsd6517g5x89r4446iwpz-etc-nix-registry.json.drv: build-x86-01: build-x86-01: input not substitutable: error: path '/nix/store/hq6cx345rcflxnadj955s1pgrmq7mr9m-nixos-26.05.20260921.1e8bc65' is required, but there is no substituter that can build it, asking the scheduler again
8yr1gpa7r6qmj6nr1jx5fs51lx9b75f1-system-path.drv: build-x86-01: build-x86-01: input not substitutable: error: path '/nix/store/mgnnfwf5bsjq2yjwnlinkrllr3msyjql-nixos-version' is required, but there is no substituter that can build it, asking the scheduler again
8yr1gpa7r6qmj6nr1jx5fs51lx9b75f1-system-path.drv: build-x86-01: build-x86-01: input not substitutable: error: path '/nix/store/mgnnfwf5bsjq2yjwnlinkrllr3msyjql-nixos-version' is required, but there is no substituter that can build it, asking the scheduler again
8yr1gpa7r6qmj6nr1jx5fs51lx9b75f1-system-path.drv: gi-build-x86-02: gi-build-x86-02: input not substitutable: error: path '/nix/store/mgnnfwf5bsjq2yjwnlinkrllr3msyjql-nixos-version' is required, but there is no substituter that can build it, asking the scheduler again
8yr1gpa7r6qmj6nr1jx5fs51lx9b75f1-system-path.drv: gi-build-x86-02: gi-build-x86-02: input not substitutable: error: path '/nix/store/mgnnfwf5bsjq2yjwnlinkrllr3msyjql-nixos-version' is required, but there is no substituter that can build it, asking the scheduler again
8yr1gpa7r6qmj6nr1jx5fs51lx9b75f1-system-path.drv: gi-build-x86-02: gi-build-x86-02: input not substitutable: error: path '/nix/store/mgnnfwf5bsjq2yjwnlinkrllr3msyjql-nixos-version' is required, but there is no substituter that can build it, asking the scheduler again
8yr1gpa7r6qmj6nr1jx5fs51lx9b75f1-system-path.drv: gi-build-x86-02: gi-build-x86-02: input not substitutable: error: path '/nix/store/mgnnfwf5bsjq2yjwnlinkrllr3msyjql-nixos-version' is required, but there is no substituter that can build it, asking the scheduler again
error: dependency '8yr1gpa7r6qmj6nr1jx5fs51lx9b75f1-system-path.drv' failed
failed checks.aarch64-darwin.treefmt 37s
setup: don't know how to build these paths: /nix/store/xm528r618lhg4vkpzl8jy8z2ll4x8yzv-treefmt-check.drv warning: ignoring the client-specified setting 'stor …
setup:
don't know how to build these paths:
  /nix/store/xm528r618lhg4vkpzl8jy8z2ll4x8yzv-treefmt-check.drv
warning: ignoring the client-specified setting 'store', because it is a restricted setting and you are not a trusted user
error: gRPC QueryValidPaths on 'nix-store.geninf.io:50051' failed: error: unable to download 'https://cache.clan.lol/imjzkyk84zkpci9mfvwi25wz3jmdkcx7.narinfo': HTTP error 503

              response body:

              <?xml version="1.0" encoding="UTF-8" standalone="yes"?>
              <Error>
                  <Code>SlowDown</Code>
                  <Message>Your account has made too many requests; try again later.</Message>
              </Error>
failed checks.aarch64-darwin.zerotier-tools-pytest 32s
setup: don't know how to build these paths: /nix/store/y0k57dwx98i4valrs472p32a4262yvn7-zerotier-tools-pytest.drv warning: ignoring the client-specified setti …
setup:
don't know how to build these paths:
  /nix/store/y0k57dwx98i4valrs472p32a4262yvn7-zerotier-tools-pytest.drv
warning: ignoring the client-specified setting 'store', because it is a restricted setting and you are not a trusted user
error: gRPC QueryValidPaths on 'nix-store.geninf.io:50051' failed: error: unable to download 'https://cache.clan.lol/n10nkhj7y11ib1qpkaajc9v18cfn3jvm.narinfo': HTTP error 503

              response body:

              <?xml version="1.0" encoding="UTF-8" standalone="yes"?>
              <Error>
                  <Code>SlowDown</Code>
                  <Message>Your account has made too many requests; try again later.</Message>
              </Error>
failed checks.aarch64-linux.admin 2m 11s
setup: this path will be fetched (0.0 KiB download, 0.1 KiB unpacked): /nix/store/q47377wy7s2sx5xj15sfz0r196zfzf6g-container-test-run-admin warning: ignoring …
setup:
this path will be fetched (0.0 KiB download, 0.1 KiB unpacked):
  /nix/store/q47377wy7s2sx5xj15sfz0r196zfzf6g-container-test-run-admin
warning: ignoring the client-specified setting 'store', because it is a restricted setting and you are not a trusted user
error: gRPC QueryValidPaths on 'nix-store.geninf.io:50051' failed: error: substituter 'https://cache.clan.lol' is disabled
failed checks.aarch64-linux.all-packages 12m 17s
setup: don't know how to build these paths: /nix/store/4k1c4ryybcy5phxxn3v6p34m07a45wrp-all-packages.drv warning: ignoring the client-specified setting 'store …
setup:
don't know how to build these paths:
  /nix/store/4k1c4ryybcy5phxxn3v6p34m07a45wrp-all-packages.drv
warning: ignoring the client-specified setting 'store', because it is a restricted setting and you are not a trusted user
error: gRPC QueryValidPaths on 'nix-store.geninf.io:50051' failed: error: substituter 'https://cache.clan.lol' is disabled
failed checks.aarch64-linux.borgbackup 2m 1s
setup: don't know how to build these paths: /nix/store/3v4a8axdh12rn8my7qas4697ys2awsdk-container-test-run-borgbackup.drv warning: ignoring the client-specifi …
setup:
don't know how to build these paths:
  /nix/store/3v4a8axdh12rn8my7qas4697ys2awsdk-container-test-run-borgbackup.drv
warning: ignoring the client-specified setting 'store', because it is a restricted setting and you are not a trusted user
error: gRPC QueryValidPaths on 'nix-store.geninf.io:50051' failed: error: unable to download 'https://cache.clan.lol/axzfv955xs8gq7qymgvc9narcl9k0pmh.narinfo': HTTP error 503

              response body:

              <?xml version="1.0" encoding="UTF-8" standalone="yes"?>
              <Error>
                  <Code>SlowDown</Code>
                  <Message>Your account has made too many requests; try again later.</Message>
              </Error>
failed checks.aarch64-linux.certificates 7m 45s
setup: warning: ignoring the client-specified setting 'store', because it is a restricted setting and you are not a trusted user jnly6ginbr5bgpqhbq5h95rr4l17ikl …
setup:
warning: ignoring the client-specified setting 'store', because it is a restricted setting and you are not a trusted user
jnly6ginbr5bgpqhbq5h95rr4l17iklv-unit-dbus-broker.service.drv: error: gRPC QueryValidPaths on 'nix-store.geninf.io:50051' failed: error: substituter 'https://cache.clan.lol' is disabled
2s5radrk9v8wyvfwyfswc12b1winvcqp-unit-dbus-broker.service.drv: error: gRPC QueryValidPaths on 'nix-store.geninf.io:50051' failed: error: substituter 'https://cache.clan.lol' is disabled
jglgb0kcyd8j1lh8yakkn1prxra0gfx1-unit-dbus-broker.service.drv: error: gRPC QueryValidPaths on 'nix-store.geninf.io:50051' failed: error: substituter 'https://cache.clan.lol' is disabled
r0vaf5qhsj7hqk7qn2igm1w1ysmdcp5d-unit-dbus-broker.service.drv: error: gRPC QueryValidPaths on 'nix-store.geninf.io:50051' failed: error: substituter 'https://cache.clan.lol' is disabled
404grspwp8psc4w5lgiqr7iw16bdjbhf-unit-dbus-broker.service.drv: error: gRPC QueryValidPaths on 'nix-store.geninf.io:50051' failed: error: substituter 'https://cache.clan.lol' is disabled
q5a1jga88fg5z3sf7w6xciqqc09pyvjj-unit-dbus-broker.service.drv: error: gRPC QueryValidPaths on 'nix-store.geninf.io:50051' failed: error: substituter 'https://cache.clan.lol' is disabled
error: dependency '6z63ab7lj4smhv4c5fl64myjlgnyvblm-nixos-test-driver-certificates.drv' failed
failed checks.aarch64-linux.clan-deps 5m 40s
setup: this path will be fetched (0.0 KiB download, 0.1 KiB unpacked): /nix/store/vka8xmiyysbrasrhqx222slzn8j4nrpc-clan-deps warning: ignoring the client-spec …
setup:
this path will be fetched (0.0 KiB download, 0.1 KiB unpacked):
  /nix/store/vka8xmiyysbrasrhqx222slzn8j4nrpc-clan-deps
warning: ignoring the client-specified setting 'store', because it is a restricted setting and you are not a trusted user
error: gRPC QueryValidPaths on 'nix-store.geninf.io:50051' failed: error: substituter 'https://cache.clan.lol' is disabled
failed checks.aarch64-linux.clan-pytest-without-core 5m 42s
setup: don't know how to build these paths: /nix/store/500i4z8sjhra5rihsyxnz5x8icwkbgn0-clan-pytest-without-core.drv warning: ignoring the client-specified se …
setup:
don't know how to build these paths:
  /nix/store/500i4z8sjhra5rihsyxnz5x8icwkbgn0-clan-pytest-without-core.drv
warning: ignoring the client-specified setting 'store', because it is a restricted setting and you are not a trusted user
error: gRPC QueryValidPaths on 'nix-store.geninf.io:50051' failed: error: substituter 'https://cache.clan.lol' is disabled
failed checks.aarch64-linux.clan-site-lint 5m 40s
setup: don't know how to build these paths: /nix/store/acbsn34s5zx5cvb6kc5qmalcz0yij8h0-clan-site-lint.drv warning: ignoring the client-specified setting 'sto …
setup:
don't know how to build these paths:
  /nix/store/acbsn34s5zx5cvb6kc5qmalcz0yij8h0-clan-site-lint.drv
warning: ignoring the client-specified setting 'store', because it is a restricted setting and you are not a trusted user
error: gRPC QueryValidPaths on 'nix-store.geninf.io:50051' failed: error: substituter 'https://cache.clan.lol' is disabled
failed checks.aarch64-linux.clan-test-iso 5m 50s
setup: don't know how to build these paths: /nix/store/7sqz7mzpn0wbxwk6q7m597aaqp9ibiiz-container-test-run-clan-test-iso.drv warning: ignoring the client-spec …
setup:
don't know how to build these paths:
  /nix/store/7sqz7mzpn0wbxwk6q7m597aaqp9ibiiz-container-test-run-clan-test-iso.drv
warning: ignoring the client-specified setting 'store', because it is a restricted setting and you are not a trusted user
error: gRPC QueryValidPaths on 'nix-store.geninf.io:50051' failed: error: unable to download 'https://cache.geninf.io/1ajnxjqrdx63d7k9b7wfzj6qja8kvc92.narinfo': HTTP error 503

              response body:

              <?xml version="1.0" encoding="UTF-8" standalone="yes"?>
              <Error>
                  <Code>SlowDown</Code>
                  <Message>Your account has made too many requests; try again later.</Message>
              </Error>
failed checks.aarch64-linux.darwin-test-darwin-machine 1m 32s
setup: don't know how to build these paths: /nix/store/30s2h5rahc5lpqixa852igy5xfwrr5n5-darwin-system-26.05.c3e90c8.drv warning: ignoring the client-specified …
setup:
don't know how to build these paths:
  /nix/store/30s2h5rahc5lpqixa852igy5xfwrr5n5-darwin-system-26.05.c3e90c8.drv
warning: ignoring the client-specified setting 'store', because it is a restricted setting and you are not a trusted user
error: gRPC QueryValidPaths on 'nix-store.geninf.io:50051' failed: error: unable to download 'https://cache.clan.lol/15mlczbwdi026a01pc8z6vw4lc7asaca.narinfo': HTTP error 503

              response body:

              <?xml version="1.0" encoding="UTF-8" standalone="yes"?>
              <Error>
                  <Code>SlowDown</Code>
                  <Message>Your account has made too many requests; try again later.</Message>
              </Error>
failed checks.aarch64-linux.data-mesher 1m 13s
setup: don't know how to build these paths: /nix/store/lwrd9qbz9d09j01165dsdmyqyrff0i90-container-test-run-data-mesher.drv warning: ignoring the client-specif …
setup:
don't know how to build these paths:
  /nix/store/lwrd9qbz9d09j01165dsdmyqyrff0i90-container-test-run-data-mesher.drv
warning: ignoring the client-specified setting 'store', because it is a restricted setting and you are not a trusted user
error: gRPC QueryValidPaths on 'nix-store.geninf.io:50051' failed: error: unable to download 'https://cache.geninf.io/45lhhdf7hylz71ibp3ssbjbambjdzjfg.narinfo': HTTP error 503

              response body:

              <?xml version="1.0" encoding="UTF-8" standalone="yes"?>
              <Error>
                  <Code>SlowDown</Code>
                  <Message>Your account has made too many requests; try again later.</Message>
              </Error>
failed checks.aarch64-linux.devshell 5m 52s
setup: don't know how to build these paths: /nix/store/1qqbn6rz6m4zwkl7irqm20hjnj658qpj-check-devshell-not-depends-on-clan-cli.drv warning: ignoring the clien …
setup:
don't know how to build these paths:
  /nix/store/1qqbn6rz6m4zwkl7irqm20hjnj658qpj-check-devshell-not-depends-on-clan-cli.drv
warning: ignoring the client-specified setting 'store', because it is a restricted setting and you are not a trusted user
error: gRPC QueryValidPaths on 'nix-store.geninf.io:50051' failed: error: unable to download 'https://cache.clan.lol/cdgb4pv8jmv4ixgzw3pjqg3x7gj2v9i9.narinfo': HTTP error 503

              response body:

              <?xml version="1.0" encoding="UTF-8" standalone="yes"?>
              <Error>
                  <Code>SlowDown</Code>
                  <Message>Your account has made too many requests; try again later.</Message>
              </Error>
failed checks.aarch64-linux.devShell-clan-app 4m 42s
setup: /nix/store/6fhxdm9f25c7h86nadfy8qim4h9hq04d-zlib-ng-2.3.3 /nix/store/i8f26lwk8i93hmiyrmsy752m6nwi4pmk-zstd-1.5.7 /nix/store/01623a8kcyp04gbqsal6fys …
setup:
  /nix/store/6fhxdm9f25c7h86nadfy8qim4h9hq04d-zlib-ng-2.3.3
  /nix/store/i8f26lwk8i93hmiyrmsy752m6nwi4pmk-zstd-1.5.7
  /nix/store/01623a8kcyp04gbqsal6fys34yfigd02-zstd-1.5.7-bin
  /nix/store/3y8mdshg1hkwpcnzhhd1q71p2wps47d4-zstd-1.5.7-dev
  /nix/store/j3zlp8gw0674jlwjy1v6g6d08mri7agz-zvbi-0.2.45
  /nix/store/pfns7xmwpx19sr5nyfpigxf22v2xf9h7-zxing-cpp-2.3.0
warning: ignoring the client-specified setting 'store', because it is a restricted setting and you are not a trusted user
error: gRPC QueryValidPaths on 'nix-store.geninf.io:50051' failed: error: unable to download 'https://cache.clan.lol/acgmr5wxx26dkgwn2mxxlhkj3sy1l1bs.narinfo': HTTP error 503

              response body:

              <?xml version="1.0" encoding="UTF-8" standalone="yes"?>
              <Error>
                  <Code>SlowDown</Code>
                  <Message>Your account has made too many requests; try again later.</Message>
              </Error>
failed checks.aarch64-linux.devShell-clan-cli 24s
setup: don't know how to build these paths: /nix/store/6spf7gn3b5lk5hihfhj6sc3b79lgk63z-clan-cli.drv warning: ignoring the client-specified setting 'store', b …
setup:
don't know how to build these paths:
  /nix/store/6spf7gn3b5lk5hihfhj6sc3b79lgk63z-clan-cli.drv
warning: ignoring the client-specified setting 'store', because it is a restricted setting and you are not a trusted user
error: gRPC QueryValidPaths on 'nix-store.geninf.io:50051' failed: error: unable to download 'https://cache.clan.lol/k1wsm9lac6nzlrqkdjn521zl12idzgzi.narinfo': HTTP error 503

              response body:

              <?xml version="1.0" encoding="UTF-8" standalone="yes"?>
              <Error>
                  <Code>SlowDown</Code>
                  <Message>Your account has made too many requests; try again later.</Message>
              </Error>
failed checks.aarch64-linux.devShell-clan-site 1m 21s
setup: don't know how to build these paths: /nix/store/prjqjg2vjcj6yx7nq189wrfyww4wvl32-nix-shell.drv warning: ignoring the client-specified setting 'store', …
setup:
don't know how to build these paths:
  /nix/store/prjqjg2vjcj6yx7nq189wrfyww4wvl32-nix-shell.drv
warning: ignoring the client-specified setting 'store', because it is a restricted setting and you are not a trusted user
error: gRPC QueryValidPaths on 'nix-store.geninf.io:50051' failed: error: unable to download 'https://cache.clan.lol/l3c8nqwb3dkndd36a9xfq3mb4p0ll4pk.narinfo': HTTP error 503

              response body:

              <?xml version="1.0" encoding="UTF-8" standalone="yes"?>
              <Error>
                  <Code>SlowDown</Code>
                  <Message>Your account has made too many requests; try again later.</Message>
              </Error>
failed checks.aarch64-linux.devShell-default 5m 42s
setup: /nix/store/1fi2g4hr5rmllzml6f68bq3yrjjijj0j-zlib-1.3.2-dev /nix/store/pwwpmwjdmk34smyfkf61ksyp7h5kdv45-zlib-1.3.2-static /nix/store/6fhxdm9f25c7h86 …
setup:
  /nix/store/1fi2g4hr5rmllzml6f68bq3yrjjijj0j-zlib-1.3.2-dev
  /nix/store/pwwpmwjdmk34smyfkf61ksyp7h5kdv45-zlib-1.3.2-static
  /nix/store/6fhxdm9f25c7h86nadfy8qim4h9hq04d-zlib-ng-2.3.3
  /nix/store/i8f26lwk8i93hmiyrmsy752m6nwi4pmk-zstd-1.5.7
  /nix/store/01623a8kcyp04gbqsal6fys34yfigd02-zstd-1.5.7-bin
  /nix/store/3y8mdshg1hkwpcnzhhd1q71p2wps47d4-zstd-1.5.7-dev
warning: ignoring the client-specified setting 'store', because it is a restricted setting and you are not a trusted user
error: gRPC QueryValidPaths on 'nix-store.geninf.io:50051' failed: error: substituter 'https://cache.clan.lol' is disabled
failed checks.aarch64-linux.devShell-docs 49s
setup: don't know how to build these paths: /nix/store/dwfsxrls04h7ayxqc34ppyg5jll7yjfj-nix-shell.drv warning: ignoring the client-specified setting 'store', …
setup:
don't know how to build these paths:
  /nix/store/dwfsxrls04h7ayxqc34ppyg5jll7yjfj-nix-shell.drv
warning: ignoring the client-specified setting 'store', because it is a restricted setting and you are not a trusted user
error: gRPC QueryValidPaths on 'nix-store.geninf.io:50051' failed: error: unable to download 'https://cache.clan.lol/ql1hlslik205c39c14741dwjwmcjxfh8.narinfo': HTTP error 503

              response body:

              <?xml version="1.0" encoding="UTF-8" standalone="yes"?>
              <Error>
                  <Code>SlowDown</Code>
                  <Message>Your account has made too many requests; try again later.</Message>
              </Error>
failed checks.aarch64-linux.devShell-inventory-schema 5m 39s
setup: /nix/store/1fi2g4hr5rmllzml6f68bq3yrjjijj0j-zlib-1.3.2-dev /nix/store/pwwpmwjdmk34smyfkf61ksyp7h5kdv45-zlib-1.3.2-static /nix/store/6fhxdm9f25c7h86 …
setup:
  /nix/store/1fi2g4hr5rmllzml6f68bq3yrjjijj0j-zlib-1.3.2-dev
  /nix/store/pwwpmwjdmk34smyfkf61ksyp7h5kdv45-zlib-1.3.2-static
  /nix/store/6fhxdm9f25c7h86nadfy8qim4h9hq04d-zlib-ng-2.3.3
  /nix/store/i8f26lwk8i93hmiyrmsy752m6nwi4pmk-zstd-1.5.7
  /nix/store/01623a8kcyp04gbqsal6fys34yfigd02-zstd-1.5.7-bin
  /nix/store/3y8mdshg1hkwpcnzhhd1q71p2wps47d4-zstd-1.5.7-dev
warning: ignoring the client-specified setting 'store', because it is a restricted setting and you are not a trusted user
error: gRPC QueryValidPaths on 'nix-store.geninf.io:50051' failed: error: substituter 'https://cache.clan.lol' is disabled
failed checks.aarch64-linux.devShell-network-status 1m 11s
setup: don't know how to build these paths: /nix/store/1iyilni0kc2ykw5cigiihy6iclwrcl2d-network-status.drv warning: ignoring the client-specified setting 'sto …
setup:
don't know how to build these paths:
  /nix/store/1iyilni0kc2ykw5cigiihy6iclwrcl2d-network-status.drv
warning: ignoring the client-specified setting 'store', because it is a restricted setting and you are not a trusted user
h2byc0kxgx1lraf9miag9wgd86pbl9ir-python3-3.13.15-env.drv: error: gRPC QueryValidPaths on 'nix-store.geninf.io:50051' failed: error: unable to download 'https://cache.clan.lol/h2byc0kxgx1lraf9miag9wgd86pbl9ir.narinfo': HTTP error 503

              response body:

              <?xml version="1.0" encoding="UTF-8" standalone="yes"?>
              <Error>
                  <Code>SlowDown</Code>
                  <Message>Your account has made too many requests; try again later.</Message>
              </Error>
error: dependency 'h2byc0kxgx1lraf9miag9wgd86pbl9ir-python3-3.13.15-env.drv' failed
failed checks.aarch64-linux.dyndns 3m 21s
setup: don't know how to build these paths: /nix/store/jjynij268rqd0660gpn3igl8cswxvfnq-container-test-run-dyndns.drv warning: ignoring the client-specified s …
setup:
don't know how to build these paths:
  /nix/store/jjynij268rqd0660gpn3igl8cswxvfnq-container-test-run-dyndns.drv
warning: ignoring the client-specified setting 'store', because it is a restricted setting and you are not a trusted user
error: gRPC QueryValidPaths on 'nix-store.geninf.io:50051' failed: error: unable to download 'https://cache.clan.lol/y35riic8h3abhbfzdjs0g6xmvv04p1d2.narinfo': HTTP error 503

              response body:

              <?xml version="1.0" encoding="UTF-8" standalone="yes"?>
              <Error>
                  <Code>SlowDown</Code>
                  <Message>Your account has made too many requests; try again later.</Message>
              </Error>
failed checks.aarch64-linux.eval-tests 11m 26s
setup: w3p15npgzssza5j8nvpg2i9nq2cbnabq-evalCheck-eval-lib-relativeDir.drv: error: gRPC QueryValidPaths on 'nix-store.geninf.io:50051' failed: error: substitute …
setup:
w3p15npgzssza5j8nvpg2i9nq2cbnabq-evalCheck-eval-lib-relativeDir.drv: error: gRPC QueryValidPaths on 'nix-store.geninf.io:50051' failed: error: substituter 'https://cache.clan.lol' is disabled
c0sjlawz46si0v2p8cjs5gs8kb9m9skv-evalCheck-eval-lib-resolve-module.drv: error: gRPC QueryValidPaths on 'nix-store.geninf.io:50051' failed: error: substituter 'https://cache.clan.lol' is disabled
j6fvkszd200a8gd7cc3k09chv94wa3s2-evalCheck-eval-tests-syncthing.drv: error: gRPC QueryValidPaths on 'nix-store.geninf.io:50051' failed: error: substituter 'https://cache.clan.lol' is disabled
d7xfjhbp09zyan6pzfy58lq3m1nr4347-evalCheck-eval-lib-build-clan.drv: error: gRPC QueryValidPaths on 'nix-store.geninf.io:50051' failed: error: substituter 'https://cache.clan.lol' is disabled
31806b1ckmbch7byhc6vkjil18smwshb-evalCheck-eval-tests-types.drv: error: gRPC QueryValidPaths on 'nix-store.geninf.io:50051' failed: error: substituter 'https://cache.clan.lol' is disabled
413084kvg2dazcnsbjd6cxh4baxdf4dp-evalCheck-eval-vars-backends.drv: error: gRPC QueryValidPaths on 'nix-store.geninf.io:50051' failed: error: substituter 'https://cache.clan.lol' is disabled
ayvcwf2skxmb1d316v3h44js07zy7ch0-evalCheck-eval-lib-distributedServices.drv: error: gRPC QueryValidPaths on 'nix-store.geninf.io:50051' failed: error: substituter 'https://cache.clan.lol' is disabled
error: dependency '8gy60is5jky5b6k43hp51n0ki4lc8fnb-evalCheck-eval-lib-values.drv' failed
failed checks.aarch64-linux.garage 5m 4s
setup: don't know how to build these paths: /nix/store/nsnl8wsxqf3f6v4245kbb1wwixibsy3g-container-test-run-garage.drv warning: ignoring the client-specified s …
setup:
don't know how to build these paths:
  /nix/store/nsnl8wsxqf3f6v4245kbb1wwixibsy3g-container-test-run-garage.drv
warning: ignoring the client-specified setting 'store', because it is a restricted setting and you are not a trusted user
error: gRPC QueryValidPaths on 'nix-store.geninf.io:50051' failed: error: substituter 'https://cache.clan.lol' is disabled
failed checks.aarch64-linux.hello-service 10m 15s
setup: this path will be fetched (0.0 KiB download, 0.1 KiB unpacked): /nix/store/l1vigvl63dhw1na0sq2h17ry173sl0zi-container-test-run-hello-service warning: i …
setup:
this path will be fetched (0.0 KiB download, 0.1 KiB unpacked):
  /nix/store/l1vigvl63dhw1na0sq2h17ry173sl0zi-container-test-run-hello-service
warning: ignoring the client-specified setting 'store', because it is a restricted setting and you are not a trusted user
ai2v1v18x0m0ppnailrc6063bk0wa1i9-system-path.drv: build01: not scheduled here: ai2v1v18x0m0ppnailrc6063bk0wa1i9-system-path.drv, asking the scheduler again
bji6xfqsc9sp4jdagdlrw6ldjmx08fhz-X-Restart-Triggers-dbus-broker.drv: error: gRPC QueryValidPaths on 'nix-store.geninf.io:50051' failed: error: substituter 'https://cache.clan.lol' is disabled
error: dependency 'mskazydjwj5nrfavc8h412r0d5mxfl0r-nixos-test-driver-hello-service.drv' failed
failed checks.aarch64-linux.inventory-classes-up-to-date 1m 22s
setup: don't know how to build these paths: /nix/store/wrpx6ddrkglqwh2jbl342y59agpnidz1-inventory-classes-up-to-date.drv warning: ignoring the client-specifie …
setup:
don't know how to build these paths:
  /nix/store/wrpx6ddrkglqwh2jbl342y59agpnidz1-inventory-classes-up-to-date.drv
warning: ignoring the client-specified setting 'store', because it is a restricted setting and you are not a trusted user
error: gRPC QueryValidPaths on 'nix-store.geninf.io:50051' failed: error: unable to download 'https://cache.clan.lol/q48srf78il21k656ysg80xskbls8g9cg.narinfo': HTTP error 503

              response body:

              <?xml version="1.0" encoding="UTF-8" standalone="yes"?>
              <Error>
                  <Code>SlowDown</Code>
                  <Message>Your account has made too many requests; try again later.</Message>
              </Error>
failed checks.aarch64-linux.kde 1m 45s
setup: don't know how to build these paths: /nix/store/hqkj562ilknhsh7ixp7bb79b15908cq5-container-test-run-kde.drv warning: ignoring the client-specified sett …
setup:
don't know how to build these paths:
  /nix/store/hqkj562ilknhsh7ixp7bb79b15908cq5-container-test-run-kde.drv
warning: ignoring the client-specified setting 'store', because it is a restricted setting and you are not a trusted user
error: gRPC QueryValidPaths on 'nix-store.geninf.io:50051' failed: error: unable to download 'https://cache.geninf.io/69rswcbg9cnlypmdvflmr95iv32gs9xh.narinfo': HTTP error 503

              response body:

              <?xml version="1.0" encoding="UTF-8" standalone="yes"?>
              <Error>
                  <Code>SlowDown</Code>
                  <Message>Your account has made too many requests; try again later.</Message>
              </Error>
failed checks.aarch64-linux.lib-jsonschema-example-valid 2m 11s
setup: don't know how to build these paths: /nix/store/w54xwmxi8mrbbfhcsrav08p87zkbssh8-lib-jsonschema-example-valid.drv warning: ignoring the client-specifie …
setup:
don't know how to build these paths:
  /nix/store/w54xwmxi8mrbbfhcsrav08p87zkbssh8-lib-jsonschema-example-valid.drv
warning: ignoring the client-specified setting 'store', because it is a restricted setting and you are not a trusted user
error: gRPC QueryValidPaths on 'nix-store.geninf.io:50051' failed: error: unable to download 'https://cache.geninf.io/ll11dsifmrwky5pryabpahkjphh8k0p4.narinfo': HTTP error 503

              response body:

              <?xml version="1.0" encoding="UTF-8" standalone="yes"?>
              <Error>
                  <Code>SlowDown</Code>
                  <Message>Your account has made too many requests; try again later.</Message>
              </Error>
failed checks.aarch64-linux.localbackup 1m 3s
setup: don't know how to build these paths: /nix/store/v8555pndyp0mii09psg1bwx6h6160i46-container-test-run-localbackup.drv warning: ignoring the client-specif …
setup:
don't know how to build these paths:
  /nix/store/v8555pndyp0mii09psg1bwx6h6160i46-container-test-run-localbackup.drv
warning: ignoring the client-specified setting 'store', because it is a restricted setting and you are not a trusted user
error: gRPC QueryValidPaths on 'nix-store.geninf.io:50051' failed: error: unable to download 'https://cache.clan.lol/1vwq8haw0gfj4z6pkary0qmkr5f9c33r.narinfo': HTTP error 503

              response body:

              <?xml version="1.0" encoding="UTF-8" standalone="yes"?>
              <Error>
                  <Code>SlowDown</Code>
                  <Message>Your account has made too many requests; try again later.</Message>
              </Error>
failed checks.aarch64-linux.machine-id 10m 27s
setup: don't know how to build these paths: /nix/store/4d7k4fhgidn4jimpmqpz8phs6kp32vfy-container-test-run-service-machine-id.drv warning: ignoring the client …
setup:
don't know how to build these paths:
  /nix/store/4d7k4fhgidn4jimpmqpz8phs6kp32vfy-container-test-run-service-machine-id.drv
warning: ignoring the client-specified setting 'store', because it is a restricted setting and you are not a trusted user
sc8vw9bsqg2cbd7pl80rznhanxya9m8m-generator-machine-id.drv: build01: not scheduled here: sc8vw9bsqg2cbd7pl80rznhanxya9m8m-generator-machine-id.drv, asking the scheduler again
30y9jbzyzykwpjhn7yzhz3kz0ff98l77-etc-machine-id.drv: build01: not scheduled here: 30y9jbzyzykwpjhn7yzhz3kz0ff98l77-etc-machine-id.drv, asking the scheduler again
fnp4052l0dbwa6k81yls3rs4395gcdkl-activate.drv: error: gRPC QueryValidPaths on 'nix-store.geninf.io:50051' failed: error: substituter 'https://cache.clan.lol' is disabled
error: dependency '73fzmyfxqw35rmwxkcdiq7jlay0g87hr-nixos-test-driver-service-machine-id.drv' failed
failed checks.aarch64-linux.matrix-synapse 1m 10s
setup: don't know how to build these paths: /nix/store/alh6y5jh7pri2jwybij7qbw6lpb2qqfl-container-test-run-matrix-synapse.drv warning: ignoring the client-spe …
setup:
don't know how to build these paths:
  /nix/store/alh6y5jh7pri2jwybij7qbw6lpb2qqfl-container-test-run-matrix-synapse.drv
warning: ignoring the client-specified setting 'store', because it is a restricted setting and you are not a trusted user
error: gRPC QueryValidPaths on 'nix-store.geninf.io:50051' failed: error: unable to download 'https://cache.clan.lol/0phkjh43kr2siwxwwg0wlhbvgaz479ix.narinfo': HTTP error 503

              response body:

              <?xml version="1.0" encoding="UTF-8" standalone="yes"?>
              <Error>
                  <Code>SlowDown</Code>
                  <Message>Your account has made too many requests; try again later.</Message>
              </Error>
failed checks.aarch64-linux.monitoring 7m 26s
setup: don't know how to build these paths: /nix/store/zy2igmm173zi6z92nc78n9iwsi44l8aw-container-test-run-monitoring.drv warning: ignoring the client-specifi …
setup:
don't know how to build these paths:
  /nix/store/zy2igmm173zi6z92nc78n9iwsi44l8aw-container-test-run-monitoring.drv
warning: ignoring the client-specified setting 'store', because it is a restricted setting and you are not a trusted user
error: gRPC QueryValidPaths on 'nix-store.geninf.io:50051' failed: error: substituter 'https://cache.clan.lol' is disabled
failed checks.aarch64-linux.mycelium 4m 32s
setup: don't know how to build these paths: /nix/store/18sji0ckq8lsda97425mqxm4rq9xw83l-vm-test-run-mycelium.drv warning: ignoring the client-specified settin …
setup:
don't know how to build these paths:
  /nix/store/18sji0ckq8lsda97425mqxm4rq9xw83l-vm-test-run-mycelium.drv
warning: ignoring the client-specified setting 'store', because it is a restricted setting and you are not a trusted user
error: gRPC QueryValidPaths on 'nix-store.geninf.io:50051' failed: error: unable to download 'https://cache.clan.lol/zbb93s3amfxiid8phs4bqwgdrcaf3w7k.narinfo': HTTP error 503

              response body:

              <?xml version="1.0" encoding="UTF-8" standalone="yes"?>
              <Error>
                  <Code>SlowDown</Code>
                  <Message>Your account has made too many requests; try again later.</Message>
              </Error>
failed checks.aarch64-linux.ncps 3m 45s
setup: don't know how to build these paths: /nix/store/xhc5ml4ynxynaxfl6i8p5n8s73ijbgh2-container-test-run-ncps.drv warning: ignoring the client-specified set …
setup:
don't know how to build these paths:
  /nix/store/xhc5ml4ynxynaxfl6i8p5n8s73ijbgh2-container-test-run-ncps.drv
warning: ignoring the client-specified setting 'store', because it is a restricted setting and you are not a trusted user
error: gRPC QueryValidPaths on 'nix-store.geninf.io:50051' failed: error: unable to download 'https://cache.geninf.io/acgmr5wxx26dkgwn2mxxlhkj3sy1l1bs.narinfo': HTTP error 503

              response body:

              <?xml version="1.0" encoding="UTF-8" standalone="yes"?>
              <Error>
                  <Code>SlowDown</Code>
                  <Message>Your account has made too many requests; try again later.</Message>
              </Error>
failed checks.aarch64-linux.nixos-documentation 38s
setup: don't know how to build these paths: /nix/store/aaq8qkdkgldqv920g0xral6pf5l0pm3q-nixos-system-test-documentation-26.05.20260921.1e8bc65.drv warning: ig …
setup:
don't know how to build these paths:
  /nix/store/aaq8qkdkgldqv920g0xral6pf5l0pm3q-nixos-system-test-documentation-26.05.20260921.1e8bc65.drv
warning: ignoring the client-specified setting 'store', because it is a restricted setting and you are not a trusted user
error: gRPC QueryValidPaths on 'nix-store.geninf.io:50051' failed: error: unable to download 'https://cache.geninf.io/5ykxdz7ngy7w3myjz6m8dq17n935fpgh.narinfo': HTTP error 503

              response body:

              <?xml version="1.0" encoding="UTF-8" standalone="yes"?>
              <Error>
                  <Code>SlowDown</Code>
                  <Message>Your account has made too many requests; try again later.</Message>
              </Error>
failed checks.aarch64-linux.nixos-flash-installer 11m 40s
setup: c6vsiscbn6h4hrswab2rj13j9i7ndr67-unit-script-nix-channel-init-start.drv: build-x86-01: build-x86-01: input not substitutable: error: path '/nix/store/hq6 …
setup:
c6vsiscbn6h4hrswab2rj13j9i7ndr67-unit-script-nix-channel-init-start.drv: build-x86-01: build-x86-01: input not substitutable: error: path '/nix/store/hq6cx345rcflxnadj955s1pgrmq7mr9m-nixos-26.05.20260921.1e8bc65' is required, but there is no substituter that can build it, asking the scheduler again
c6vsiscbn6h4hrswab2rj13j9i7ndr67-unit-script-nix-channel-init-start.drv: build-x86-01: build-x86-01: input not substitutable: error: path '/nix/store/hq6cx345rcflxnadj955s1pgrmq7mr9m-nixos-26.05.20260921.1e8bc65' is required, but there is no substituter that can build it, asking the scheduler again
c6vsiscbn6h4hrswab2rj13j9i7ndr67-unit-script-nix-channel-init-start.drv: build-x86-01: build-x86-01: input not substitutable: error: path '/nix/store/hq6cx345rcflxnadj955s1pgrmq7mr9m-nixos-26.05.20260921.1e8bc65' is required, but there is no substituter that can build it, asking the scheduler again
c6vsiscbn6h4hrswab2rj13j9i7ndr67-unit-script-nix-channel-init-start.drv: build-x86-01: build-x86-01: input not substitutable: error: path '/nix/store/hq6cx345rcflxnadj955s1pgrmq7mr9m-nixos-26.05.20260921.1e8bc65' is required, but there is no substituter that can build it, asking the scheduler again
c6vsiscbn6h4hrswab2rj13j9i7ndr67-unit-script-nix-channel-init-start.drv: build-x86-01: build-x86-01: input not substitutable: error: path '/nix/store/hq6cx345rcflxnadj955s1pgrmq7mr9m-nixos-26.05.20260921.1e8bc65' is required, but there is no substituter that can build it, asking the scheduler again
c6vsiscbn6h4hrswab2rj13j9i7ndr67-unit-script-nix-channel-init-start.drv: build-x86-01: build-x86-01: input not substitutable: error: path '/nix/store/hq6cx345rcflxnadj955s1pgrmq7mr9m-nixos-26.05.20260921.1e8bc65' is required, but there is no substituter that can build it, asking the scheduler again
c6vsiscbn6h4hrswab2rj13j9i7ndr67-unit-script-nix-channel-init-start.drv: build-x86-01: build-x86-01: input not substitutable: error: path '/nix/store/hq6cx345rcflxnadj955s1pgrmq7mr9m-nixos-26.05.20260921.1e8bc65' is required, but there is no substituter that can build it, asking the scheduler again
error: dependency '8yr1gpa7r6qmj6nr1jx5fs51lx9b75f1-system-path.drv' failed
failed checks.aarch64-linux.nixos-systemd-abstraction 9m 39s
setup: isk98p0g7xkf27p3k34hd9m4l70a1xnb-dry-activate.drv: build01: not scheduled here: isk98p0g7xkf27p3k34hd9m4l70a1xnb-dry-activate.drv, asking the scheduler a …
setup:
isk98p0g7xkf27p3k34hd9m4l70a1xnb-dry-activate.drv: build01: not scheduled here: isk98p0g7xkf27p3k34hd9m4l70a1xnb-dry-activate.drv, asking the scheduler again
ih6apfazi87ggya0hm4yk2vc6i9y70wm-clan-cli-source.drv: build01: not scheduled here: ih6apfazi87ggya0hm4yk2vc6i9y70wm-clan-cli-source.drv, asking the scheduler again
qhir5pj4gi86pr08x50jj4pypzzx4kp8-hosts.drv: build01: not scheduled here: qhir5pj4gi86pr08x50jj4pypzzx4kp8-hosts.drv, asking the scheduler again
qxd96v410wvvbd7csmgf1hyianjcfgmf-unit-linger-users.service.drv: build01: not scheduled here: qxd96v410wvvbd7csmgf1hyianjcfgmf-unit-linger-users.service.drv, asking the scheduler again
akcdkijwg8nbd89l02xknbhddm0jswrn-system-path.drv: build01: not scheduled here: akcdkijwg8nbd89l02xknbhddm0jswrn-system-path.drv, asking the scheduler again
1ical056q99z98qkr3hah6xdzixppr3v-unit-dbus-broker.service.drv: error: gRPC QueryValidPaths on 'nix-store.geninf.io:50051' failed: error: substituter 'https://cache.clan.lol' is disabled
3aqhgp0bfbwzbjnv8xi99x30h5kcvnfy-unit-dbus-broker.service.drv: error: gRPC QueryValidPaths on 'nix-store.geninf.io:50051' failed: error: substituter 'https://cache.clan.lol' is disabled
error: dependency '5xfrpgayf2rrgnrd20fsi1n0sq1fxwl4-nixos-test-driver-systemd-abstraction.drv' failed
failed checks.aarch64-linux.nixos-test-age-backend 5m 44s
setup: don't know how to build these paths: /nix/store/s14razrsh1n8wzzhzqv1fnng7w5sgifj-vm-test-run-nixos-test-age-backend.drv warning: ignoring the client-sp …
setup:
don't know how to build these paths:
  /nix/store/s14razrsh1n8wzzhzqv1fnng7w5sgifj-vm-test-run-nixos-test-age-backend.drv
warning: ignoring the client-specified setting 'store', because it is a restricted setting and you are not a trusted user
error: gRPC QueryValidPaths on 'nix-store.geninf.io:50051' failed: error: unable to download 'https://cache.clan.lol/z0y8lc9skv4g0pvxkzk09f65s4s9mi6k.narinfo': HTTP error 503

              response body:

              <?xml version="1.0" encoding="UTF-8" standalone="yes"?>
              <Error>
                  <Code>SlowDown</Code>
                  <Message>Your account has made too many requests; try again later.</Message>
              </Error>
failed checks.aarch64-linux.nixos-test-container 10m 21s
setup: don't know how to build these paths: /nix/store/wirjv5qxd3pwb694a3wd3qxzfsx2hia4-container-test-run-container.drv warning: ignoring the client-specifie …
setup:
don't know how to build these paths:
  /nix/store/wirjv5qxd3pwb694a3wd3qxzfsx2hia4-container-test-run-container.drv
warning: ignoring the client-specified setting 'store', because it is a restricted setting and you are not a trusted user
gx977l8gbqg5xw2gpaf7xm9qnklxkpxd-X-Restart-Triggers-dbus-broker.drv: error: gRPC QueryValidPaths on 'nix-store.geninf.io:50051' failed: error: substituter 'https://cache.clan.lol' is disabled
error: dependency 'xnx843vbaxwvwwhww3pqpzmig5frzfdh-nixos-test-driver-container.drv' failed
failed checks.aarch64-linux.nixos-test-extra-python-packages 10m 16s
setup: don't know how to build these paths: /nix/store/zqfhv68vjnk6jnrjpncfd2bkbgjfbrcg-container-test-run-test-extra-python-packages.drv warning: ignoring th …
setup:
don't know how to build these paths:
  /nix/store/zqfhv68vjnk6jnrjpncfd2bkbgjfbrcg-container-test-run-test-extra-python-packages.drv
warning: ignoring the client-specified setting 'store', because it is a restricted setting and you are not a trusted user
zqwslfcza60dqjs6dxml72zhr8k8a17g-X-Restart-Triggers-dbus-broker.drv: error: gRPC QueryValidPaths on 'nix-store.geninf.io:50051' failed: error: substituter 'https://cache.clan.lol' is disabled
error: dependency 'cj4h73ih08a9smlijnv521w1i802lskj-nixos-test-driver-test-extra-python-packages.drv' failed
failed checks.aarch64-linux.nixos-test-password-store-mounts 48s
setup: don't know how to build these paths: /nix/store/682a9ghknmc2786a4z26wxnvjp1lnz7s-vm-test-run-nixos-test-password-store-mounts.drv warning: ignoring the …
setup:
don't know how to build these paths:
  /nix/store/682a9ghknmc2786a4z26wxnvjp1lnz7s-vm-test-run-nixos-test-password-store-mounts.drv
warning: ignoring the client-specified setting 'store', because it is a restricted setting and you are not a trusted user
error: gRPC QueryValidPaths on 'nix-store.geninf.io:50051' failed: error: unable to download 'https://cache.clan.lol/yghajbffzs3pmi194nirnhmb911g8skd.narinfo': HTTP error 503

              response body:

              <?xml version="1.0" encoding="UTF-8" standalone="yes"?>
              <Error>
                  <Code>SlowDown</Code>
                  <Message>Your account has made too many requests; try again later.</Message>
              </Error>
failed checks.aarch64-linux.nixos-test-secrets 3m 29s
setup: this path will be fetched (0.0 KiB download, 0.1 KiB unpacked): /nix/store/14s8ymkjbq06ni1yzcx2ljvaqk81pzm8-vm-test-run-secrets warning: ignoring the c …
setup:
this path will be fetched (0.0 KiB download, 0.1 KiB unpacked):
  /nix/store/14s8ymkjbq06ni1yzcx2ljvaqk81pzm8-vm-test-run-secrets
warning: ignoring the client-specified setting 'store', because it is a restricted setting and you are not a trusted user
error: gRPC QueryValidPaths on 'nix-store.geninf.io:50051' failed: error: unable to download 'https://cache.clan.lol/1mym41pipppzpfl859wrjwzwcg99kax0.narinfo': HTTP error 503

              response body:

              <?xml version="1.0" encoding="UTF-8" standalone="yes"?>
              <Error>
                  <Code>SlowDown</Code>
                  <Message>Your account has made too many requests; try again later.</Message>
              </Error>
failed checks.aarch64-linux.nixos-test-user-firewall-iptables 30s
setup: this path will be fetched (0.0 KiB download, 0.1 KiB unpacked): /nix/store/wb21ikxnhday8kjwxxw2rwk100vr0vp3-container-test-run-user-firewall-iptables w …
setup:
this path will be fetched (0.0 KiB download, 0.1 KiB unpacked):
  /nix/store/wb21ikxnhday8kjwxxw2rwk100vr0vp3-container-test-run-user-firewall-iptables
warning: ignoring the client-specified setting 'store', because it is a restricted setting and you are not a trusted user
error: gRPC QueryValidPaths on 'nix-store.geninf.io:50051' failed: error: substituter 'https://cache.clan.lol' is disabled
failed checks.aarch64-linux.nixos-test-user-firewall-nftables 10m 16s
setup: warning: ignoring the client-specified setting 'store', because it is a restricted setting and you are not a trusted user g586ki4cnl0h0jl07wwrj7nzywbr1fv …
setup:
warning: ignoring the client-specified setting 'store', because it is a restricted setting and you are not a trusted user
g586ki4cnl0h0jl07wwrj7nzywbr1fvl-testScript.drv: build01: not scheduled here: g586ki4cnl0h0jl07wwrj7nzywbr1fvl-testScript.drv, asking the scheduler again
2iaj77db6a8wb0nr9h1hc0cqyp0xrrxc-nftables-deletions.drv: build01: not scheduled here: 2iaj77db6a8wb0nr9h1hc0cqyp0xrrxc-nftables-deletions.drv, asking the scheduler again
7zb8mqka6c74dqbf27mabx4nlnnqwngs-system-path.drv: build01: not scheduled here: 7zb8mqka6c74dqbf27mabx4nlnnqwngs-system-path.drv, asking the scheduler again
qhy90d8krfas0csi6yy77i5rdd2qnfwd-passwd.drv: build01: not scheduled here: qhy90d8krfas0csi6yy77i5rdd2qnfwd-passwd.drv, asking the scheduler again
24l3vb9rr9ydzcj4r6anb3nz7180zgr2-unit-dbus-broker.service.drv: error: gRPC QueryValidPaths on 'nix-store.geninf.io:50051' failed: error: substituter 'https://cache.clan.lol' is disabled
1568idknbw9xw76i3r9xdh9v4l1w2f5c-unit-dbus-broker.service.drv: error: gRPC QueryValidPaths on 'nix-store.geninf.io:50051' failed: error: substituter 'https://cache.clan.lol' is disabled
error: dependency 'iwb5ckfjhm1inidnxzpc7q34qhk8slkw-nixos-test-driver-user-firewall-nftables.drv' failed
failed checks.aarch64-linux.nixos-test-wayland-proxy-virtwl 36s
setup: don't know how to build these paths: /nix/store/q39ghmz4rv2gb92d7aynin57q5lx215y-vm-test-run-wayland-proxy-virtwl.drv warning: ignoring the client-spec …
setup:
don't know how to build these paths:
  /nix/store/q39ghmz4rv2gb92d7aynin57q5lx215y-vm-test-run-wayland-proxy-virtwl.drv
warning: ignoring the client-specified setting 'store', because it is a restricted setting and you are not a trusted user
error: gRPC QueryValidPaths on 'nix-store.geninf.io:50051' failed: error: unable to download 'https://cache.geninf.io/84k4a0rsv6wx76544jrgxn6blr0smzm0.narinfo': HTTP error 503

              response body:

              <?xml version="1.0" encoding="UTF-8" standalone="yes"?>
              <Error>
                  <Code>SlowDown</Code>
                  <Message>Your account has made too many requests; try again later.</Message>
              </Error>
failed checks.aarch64-linux.packages 3m 7s
setup: don't know how to build these paths: /nix/store/xv5h4iqypcmw17d64lalvb0rfdb23fpn-container-test-run-packages.drv warning: ignoring the client-specified …
setup:
don't know how to build these paths:
  /nix/store/xv5h4iqypcmw17d64lalvb0rfdb23fpn-container-test-run-packages.drv
warning: ignoring the client-specified setting 'store', because it is a restricted setting and you are not a trusted user
error: gRPC QueryValidPaths on 'nix-store.geninf.io:50051' failed: error: substituter 'https://cache.clan.lol' is disabled
failed checks.aarch64-linux.postgresql 14s
setup: don't know how to build these paths: /nix/store/dlg8qsdjdlabrpiz0k352zdbaj5nqn26-container-test-run-service-postgresql.drv warning: ignoring the client …
setup:
don't know how to build these paths:
  /nix/store/dlg8qsdjdlabrpiz0k352zdbaj5nqn26-container-test-run-service-postgresql.drv
warning: ignoring the client-specified setting 'store', because it is a restricted setting and you are not a trusted user
error: gRPC QueryValidPaths on 'nix-store.geninf.io:50051' failed: error: unable to download 'https://cache.clan.lol/6zwcb545bbkyvc3n8x68h8cwqg4kb3ga.narinfo': HTTP error 503

              response body:

              <?xml version="1.0" encoding="UTF-8" standalone="yes"?>
              <Error>
                  <Code>SlowDown</Code>
                  <Message>Your account has made too many requests; try again later.</Message>
              </Error>
failed checks.aarch64-linux.pytest 3m 53s
setup: don't know how to build these paths: /nix/store/dhix2dr3i6k60xwwkgbxim9cva9hl9p2-network-status-pytest.drv warning: ignoring the client-specified setti …
setup:
don't know how to build these paths:
  /nix/store/dhix2dr3i6k60xwwkgbxim9cva9hl9p2-network-status-pytest.drv
warning: ignoring the client-specified setting 'store', because it is a restricted setting and you are not a trusted user
error: gRPC QueryValidPaths on 'nix-store.geninf.io:50051' failed: error: substituter 'https://cache.clan.lol' is disabled
failed checks.aarch64-linux.service-dummy-test-from-flake 7m 24s
setup: don't know how to build these paths: /nix/store/a5gnkvy7hjahp5axvpqj5gkrsqk9sq9w-container-test-run-service-dummy-test-from-flake.drv warning: ignoring …
setup:
don't know how to build these paths:
  /nix/store/a5gnkvy7hjahp5axvpqj5gkrsqk9sq9w-container-test-run-service-dummy-test-from-flake.drv
warning: ignoring the client-specified setting 'store', because it is a restricted setting and you are not a trusted user
error: gRPC QueryValidPaths on 'nix-store.geninf.io:50051' failed: error: unable to download 'https://cache.clan.lol/alq68hv9hi0xb6znps51x7b2cnadxl0f.narinfo': HTTP error 503

              response body:

              <?xml version="1.0" encoding="UTF-8" standalone="yes"?>
              <Error>
                  <Code>SlowDown</Code>
                  <Message>Your account has made too many requests; try again later.</Message>
              </Error>
failed checks.aarch64-linux.sshd-no-ca 1m 31s
setup: don't know how to build these paths: /nix/store/08cix733z48l7zrvbcn263pkh3rhjr32-container-test-run-sshd.drv warning: ignoring the client-specified set …
setup:
don't know how to build these paths:
  /nix/store/08cix733z48l7zrvbcn263pkh3rhjr32-container-test-run-sshd.drv
warning: ignoring the client-specified setting 'store', because it is a restricted setting and you are not a trusted user
error: gRPC QueryValidPaths on 'nix-store.geninf.io:50051' failed: error: unable to download 'https://cache.geninf.io/6fma7yq8wvq8gpmqzsx4ipkln77p3w2l.narinfo': HTTP error 503

              response body:

              <?xml version="1.0" encoding="UTF-8" standalone="yes"?>
              <Error>
                  <Code>SlowDown</Code>
                  <Message>Your account has made too many requests; try again later.</Message>
              </Error>
failed checks.aarch64-linux.syncthing-service 3m 32s
setup: don't know how to build these paths: /nix/store/7d73dyx53g4vcgmzpd82z57yiny5rpax-container-test-run-syncthing-service.drv warning: ignoring the client- …
setup:
don't know how to build these paths:
  /nix/store/7d73dyx53g4vcgmzpd82z57yiny5rpax-container-test-run-syncthing-service.drv
warning: ignoring the client-specified setting 'store', because it is a restricted setting and you are not a trusted user
error: gRPC QueryValidPaths on 'nix-store.geninf.io:50051' failed: error: unable to download 'https://cache.geninf.io/bapic4w21bg0vm37l48cxzy9sw1hva1i.narinfo': HTTP error 503

              response body:

              <?xml version="1.0" encoding="UTF-8" standalone="yes"?>
              <Error>
                  <Code>SlowDown</Code>
                  <Message>Your account has made too many requests; try again later.</Message>
              </Error>
failed checks.aarch64-linux.treefmt 8m 17s
setup: z9da26jrkink5pb7zlwh1v8zydw2sdd3-treefmt-check.drv: build01: build01: input not substitutable: error: some references of path '/nix/store/w93wdi936raxk1b …
setup:
z9da26jrkink5pb7zlwh1v8zydw2sdd3-treefmt-check.drv: build01: build01: input not substitutable: error: some references of path '/nix/store/w93wdi936raxk1bh3gfgrhwahviy5150-treefmt' could not be realised, asking the scheduler again
z9da26jrkink5pb7zlwh1v8zydw2sdd3-treefmt-check.drv: build01: build01: input not substitutable: error: some references of path '/nix/store/w93wdi936raxk1bh3gfgrhwahviy5150-treefmt' could not be realised, asking the scheduler again
z9da26jrkink5pb7zlwh1v8zydw2sdd3-treefmt-check.drv: build01: build01: input not substitutable: error: some references of path '/nix/store/w93wdi936raxk1bh3gfgrhwahviy5150-treefmt' could not be realised, asking the scheduler again
z9da26jrkink5pb7zlwh1v8zydw2sdd3-treefmt-check.drv: build01: build01: input not substitutable: error: some references of path '/nix/store/w93wdi936raxk1bh3gfgrhwahviy5150-treefmt' could not be realised, asking the scheduler again
z9da26jrkink5pb7zlwh1v8zydw2sdd3-treefmt-check.drv: build01: build01: input not substitutable: error: some references of path '/nix/store/w93wdi936raxk1bh3gfgrhwahviy5150-treefmt' could not be realised, asking the scheduler again
z9da26jrkink5pb7zlwh1v8zydw2sdd3-treefmt-check.drv: build01: build01: input not substitutable: error: some references of path '/nix/store/w93wdi936raxk1bh3gfgrhwahviy5150-treefmt' could not be realised, asking the scheduler again
z9da26jrkink5pb7zlwh1v8zydw2sdd3-treefmt-check.drv: build01: build01: input not substitutable: error: some references of path '/nix/store/w93wdi936raxk1bh3gfgrhwahviy5150-treefmt' could not be realised, asking the scheduler again
error: gave up after 9 reschedules
failed checks.aarch64-linux.users 10m 15s
setup: sz3s9zzllab3cj061jgr9ygg7jyxfcn2-users-groups.json.drv: build01: not scheduled here: sz3s9zzllab3cj061jgr9ygg7jyxfcn2-users-groups.json.drv, asking the s …
setup:
sz3s9zzllab3cj061jgr9ygg7jyxfcn2-users-groups.json.drv: build01: not scheduled here: sz3s9zzllab3cj061jgr9ygg7jyxfcn2-users-groups.json.drv, asking the scheduler again
1kwz6768chwb2yh786rfk6grkc02jxqd-testuser-authorized_keys.drv: build01: not scheduled here: 1kwz6768chwb2yh786rfk6grkc02jxqd-testuser-authorized_keys.drv, asking the scheduler again
8d621z5frx5664xyzlhyqzml15753m05-generator-user-password-testuser.drv: build01: not scheduled here: 8d621z5frx5664xyzlhyqzml15753m05-generator-user-password-testuser.drv, asking the scheduler again
qf0fr435w1hasrcanws7qa3y7b901alw-generator-user-password-root.drv: build01: not scheduled here: qf0fr435w1hasrcanws7qa3y7b901alw-generator-user-password-root.drv, asking the scheduler again
sva8l1970qygxn6s9yz7ci1mgc5h527b-system-path.drv: build01: not scheduled here: sva8l1970qygxn6s9yz7ci1mgc5h527b-system-path.drv, asking the scheduler again
mgdysshiqk90n33zi0ln2mb5nxhz783k-unit-dbus-broker.service.drv: error: gRPC QueryValidPaths on 'nix-store.geninf.io:50051' failed: error: substituter 'https://cache.clan.lol' is disabled
mqivbdc11n0qna70rjki6k1qsljxa7nj-unit-dbus-broker.service.drv: error: gRPC QueryValidPaths on 'nix-store.geninf.io:50051' failed: error: substituter 'https://cache.clan.lol' is disabled
error: dependency 'fk6pzqccdmlf64axhclk3pvwd27pp2zi-nixos-test-driver-users.drv' failed
failed checks.aarch64-linux.wifi 48s
setup: don't know how to build these paths: /nix/store/0w1c1kyx2vx7231d2nl5j2l33p9z87mi-vm-test-run-wifi.drv warning: ignoring the client-specified setting 's …
setup:
don't know how to build these paths:
  /nix/store/0w1c1kyx2vx7231d2nl5j2l33p9z87mi-vm-test-run-wifi.drv
warning: ignoring the client-specified setting 'store', because it is a restricted setting and you are not a trusted user
error: gRPC QueryValidPaths on 'nix-store.geninf.io:50051' failed: error: unable to download 'https://cache.clan.lol/rviccprs1vdvpjclsfkypjj0q6ib9v9q.narinfo': HTTP error 503

              response body:

              <?xml version="1.0" encoding="UTF-8" standalone="yes"?>
              <Error>
                  <Code>SlowDown</Code>
                  <Message>Your account has made too many requests; try again later.</Message>
              </Error>
failed checks.aarch64-linux.yggdrasil 8m 39s
vm-test-run-yggdrasil: File "/nix/store/bx2f2mvw7byg1lw3sjx9ya00n556icn7-nixos-test-driver-1.1/lib/python3.13/site-packages/test_driver/driver.py", line 434, …
vm-test-run-yggdrasil:
  File "/nix/store/bx2f2mvw7byg1lw3sjx9ya00n556icn7-nixos-test-driver-1.1/lib/python3.13/site-packages/test_driver/driver.py", line 434, in run_tests
    self.test_script()
    ~~~~~~~~~~~~~~~~^^
  File "/nix/store/bx2f2mvw7byg1lw3sjx9ya00n556icn7-nixos-test-driver-1.1/lib/python3.13/site-packages/test_driver/driver.py", line 392, in test_script
    exec(self.tests, symbols, None)
    ~~~~^^^^^^^^^^^^^^^^^^^^^^^^^^^
  File "<string>", line 45, in <module>
AssertionError: peer1 runtime IP 200:831b:fc02:fab1:af5f:20a9:2ddb:446 != expected IP 200:afed:dc25:49ee:51c5:a18d:d964:3025
failed checks.aarch64-linux.zerotier 7m 25s
setup: don't know how to build these paths: /nix/store/4w85bqqzm24yc3v38szhrxngd5wfpn00-vm-test-run-zerotier.drv warning: ignoring the client-specified settin …
setup:
don't know how to build these paths:
  /nix/store/4w85bqqzm24yc3v38szhrxngd5wfpn00-vm-test-run-zerotier.drv
warning: ignoring the client-specified setting 'store', because it is a restricted setting and you are not a trusted user
error: gRPC QueryValidPaths on 'nix-store.geninf.io:50051' failed: error: substituter 'https://cache.clan.lol' is disabled
failed checks.aarch64-linux.zerotier-tools-pytest 3m 53s
setup: don't know how to build these paths: /nix/store/pzsz9g9nayra7rb6fys47s59ylir68ll-zerotier-tools-pytest.drv warning: ignoring the client-specified setti …
setup:
don't know how to build these paths:
  /nix/store/pzsz9g9nayra7rb6fys47s59ylir68ll-zerotier-tools-pytest.drv
warning: ignoring the client-specified setting 'store', because it is a restricted setting and you are not a trusted user
error: gRPC QueryValidPaths on 'nix-store.geninf.io:50051' failed: error: substituter 'https://cache.clan.lol' is disabled
failed checks.x86_64-linux.admin 7m 46s
setup: /nix/store/5hjigfmsyv5g2b66v0gb8jn4vdck2wmz-dry-activate /nix/store/x6szci1wmjg043fdpk902b786n2cry62-sshd.conf-final /nix/store/wvbny3yyz64s2ac4z9l …
setup:
  /nix/store/5hjigfmsyv5g2b66v0gb8jn4vdck2wmz-dry-activate
  /nix/store/x6szci1wmjg043fdpk902b786n2cry62-sshd.conf-final
  /nix/store/wvbny3yyz64s2ac4z9ljqyw2n9x2hczp-users-groups.json
  /nix/store/73zwsv6cmahvj3wrys5vj7yjw1gk8s3v-vars-check-admin
warning: ignoring the client-specified setting 'store', because it is a restricted setting and you are not a trusted user
gh3zrcmazx8cd1gck1i1g2siva56gcjy-closure-info.drv: error: gRPC QueryValidPaths on 'nix-store.geninf.io:50051' failed: error: substituter 'https://cache.clan.lol' is disabled
bwd487dz0dg3d1xx7a8vamfz92w04j9p-etc.drv: error: gRPC QueryValidPaths on 'nix-store.geninf.io:50051' failed: error: substituter 'https://cache.clan.lol' is disabled
error: dependency 'ahvcp2gyqywnhqblzvpqyay7mdcps8im-nixos-test-driver-admin.drv' failed
failed checks.x86_64-linux.all-packages 4m 57s
setup: /nix/store/4h5gq2bj1j1009ykglrnqjriklxjdhkp-vscodium-1.116.02821 /nix/store/2bkgiliv5qzdsx4dm1jcva4lslighqmc-vscodium-with-extensions-1.116.02821 / …
setup:
  /nix/store/4h5gq2bj1j1009ykglrnqjriklxjdhkp-vscodium-1.116.02821
  /nix/store/2bkgiliv5qzdsx4dm1jcva4lslighqmc-vscodium-with-extensions-1.116.02821
  /nix/store/48wlh4d2h8zmry7aq6lxwfh09pyd1b3i-webkitgtk-2.52.6+abi=4.1
  /nix/store/y4pjlyzbzg2zm70bwqi0kz23zz7z9833-webview-nightly
  /nix/store/0mbwmim1b0p5kf5cdgiaw576dsl715gq-wrap-gapps-hook
  /nix/store/s6nvawrfy6n3zmizgbv5yjns1s7y4bm0-writable-tmpdir-as-home-hook
warning: ignoring the client-specified setting 'store', because it is a restricted setting and you are not a trusted user
error: gRPC QueryValidPaths on 'nix-store.geninf.io:50051' failed: error: substituter 'https://cache.clan.lol' is disabled
failed checks.x86_64-linux.borgbackup 8m 37s
container-test-run-borgbackup: exec(self.testscript, self.test_symbols(), None) # noqa: S102 ~~~~^^^^^^^^^^^^^^^^^^^^^^^^^^^^^^^^^^^^^^^^^^^^ File "< …
container-test-run-borgbackup:
    exec(self.testscript, self.test_symbols(), None)  # noqa: S102
    ~~~~^^^^^^^^^^^^^^^^^^^^^^^^^^^^^^^^^^^^^^^^^^^^
  File "<string>", line 26, in <module>
  File "/nix/store/7pcwg3l52sff9p90k03qhavpaqk1zhfi-test-driver-0.0.1/lib/python3.13/site-packages/test_driver/__init__.py", line 475, in succeed
    raise RuntimeError(msg)
RuntimeError: Failed to run command borg-job-serverone list --json
Exit code: 2
Stdout: 
failed checks.x86_64-linux.clan-app-pytest 7m 26s
setup: this path will be fetched (0.0 KiB download, 0.1 KiB unpacked): /nix/store/7k819dv9fr2ayamff9w2qailb5wwrdfa-clan-app-pytest warning: ignoring the clien …
setup:
this path will be fetched (0.0 KiB download, 0.1 KiB unpacked):
  /nix/store/7k819dv9fr2ayamff9w2qailb5wwrdfa-clan-app-pytest
warning: ignoring the client-specified setting 'store', because it is a restricted setting and you are not a trusted user
error: gRPC QueryValidPaths on 'nix-store.geninf.io:50051' failed: error: substituter 'https://cache.clan.lol' is disabled
failed checks.x86_64-linux.clan-app-ui-lint 3m 45s
setup: don't know how to build these paths: /nix/store/34m06j46s1f3pvsg7rgmgh6xfpjwhfy6-clan-app-ui-lint.drv warning: ignoring the client-specified setting 's …
setup:
don't know how to build these paths:
  /nix/store/34m06j46s1f3pvsg7rgmgh6xfpjwhfy6-clan-app-ui-lint.drv
warning: ignoring the client-specified setting 'store', because it is a restricted setting and you are not a trusted user
34m06j46s1f3pvsg7rgmgh6xfpjwhfy6-clan-app-ui-lint.drv: error: gRPC QueryValidPaths on 'nix-store.geninf.io:50051' failed: error: unable to download 'https://cache.clan.lol/fxa88rcbj831qf0dnwvhhhs4sqa2qp58.narinfo': HTTP error 503

              response body:

              <?xml version="1.0" encoding="UTF-8" standalone="yes"?>
              <Error>
                  <Code>SlowDown</Code>
                  <Message>Your account has made too many requests; try again later.</Message>
              </Error>
error: error: gRPC QueryValidPaths on 'nix-store.geninf.io:50051' failed: error: unable to download 'https://cache.clan.lol/fxa88rcbj831qf0dnwvhhhs4sqa2qp58.narinfo': HTTP error 503

                     response body:

                     <?xml version="1.0" encoding="UTF-8" standalone="yes"?>
                     <Error>
                         <Code>SlowDown</Code>
                         <Message>Your account has made too many requests; try again later.</Message>
                     </Error>
failed checks.x86_64-linux.clan-app-ui-unit-tests 14s
setup: don't know how to build these paths: /nix/store/sbbskmsy1q9ybq4ix55d71xm4jqv7k5k-clan-app-ui-unit-tests.drv warning: ignoring the client-specified sett …
setup:
don't know how to build these paths:
  /nix/store/sbbskmsy1q9ybq4ix55d71xm4jqv7k5k-clan-app-ui-unit-tests.drv
warning: ignoring the client-specified setting 'store', because it is a restricted setting and you are not a trusted user
error: gRPC QueryValidPaths on 'nix-store.geninf.io:50051' failed: error: unable to download 'https://cache.clan.lol/n8sm5sal8nxbbbmq42bmq7mfi2z97dfs.narinfo': HTTP error 503

              response body:

              <?xml version="1.0" encoding="UTF-8" standalone="yes"?>
              <Error>
                  <Code>SlowDown</Code>
                  <Message>Your account has made too many requests; try again later.</Message>
              </Error>
failed checks.x86_64-linux.clan-pytest-with-core 10m 51s
setup: don't know how to build these paths: /nix/store/2ia1g8wjdzbmckyr9fk9s5kkd9xncm8l-clan-pytest-with-core.drv warning: ignoring the client-specified setti …
setup:
don't know how to build these paths:
  /nix/store/2ia1g8wjdzbmckyr9fk9s5kkd9xncm8l-clan-pytest-with-core.drv
warning: ignoring the client-specified setting 'store', because it is a restricted setting and you are not a trusted user
fns0fbvn4lcnqvvw4ig0p86m5glrdb4h-clan-core-flake.drv: error: gRPC QueryValidPaths on 'nix-store.geninf.io:50051' failed: error: substituter 'https://cache.clan.lol' is disabled
x4iq038gcyriqyzzz4y3qq0psj5mjy4c-closure-info.drv: error: gRPC QueryValidPaths on 'nix-store.geninf.io:50051' failed: error: substituter 'https://cache.clan.lol' is disabled
error: dependency 'fns0fbvn4lcnqvvw4ig0p86m5glrdb4h-clan-core-flake.drv' failed
failed checks.x86_64-linux.clan-pytest-without-core 1m 56s
setup: don't know how to build these paths: /nix/store/j2w68qdyw2nx3r6m5c922532a6c2zkfw-clan-pytest-without-core.drv warning: ignoring the client-specified se …
setup:
don't know how to build these paths:
  /nix/store/j2w68qdyw2nx3r6m5c922532a6c2zkfw-clan-pytest-without-core.drv
warning: ignoring the client-specified setting 'store', because it is a restricted setting and you are not a trusted user
error: gRPC QueryValidPaths on 'nix-store.geninf.io:50051' failed: error: unable to download 'https://cache.clan.lol/f11kr0w1mvhq092fxlf92lsz5m2jcr17.narinfo': HTTP error 503

              response body:

              <?xml version="1.0" encoding="UTF-8" standalone="yes"?>
              <Error>
                  <Code>SlowDown</Code>
                  <Message>Your account has made too many requests; try again later.</Message>
              </Error>
failed checks.x86_64-linux.clan-release-diff-pytest 4m 20s
setup: don't know how to build these paths: /nix/store/pwbkrl17x6f8a9c4pvi6hbgarah380bv-clan-release-diff-pytest.drv warning: ignoring the client-specified se …
setup:
don't know how to build these paths:
  /nix/store/pwbkrl17x6f8a9c4pvi6hbgarah380bv-clan-release-diff-pytest.drv
warning: ignoring the client-specified setting 'store', because it is a restricted setting and you are not a trusted user
pwbkrl17x6f8a9c4pvi6hbgarah380bv-clan-release-diff-pytest.drv: error: gRPC QueryValidPaths on 'nix-store.geninf.io:50051' failed: error: unable to download 'https://cache.clan.lol/pwbkrl17x6f8a9c4pvi6hbgarah380bv.narinfo': HTTP error 503

              response body:

              <?xml version="1.0" encoding="UTF-8" standalone="yes"?>
              <Error>
                  <Code>SlowDown</Code>
                  <Message>Your account has made too many requests; try again later.</Message>
              </Error>
error: error: gRPC QueryValidPaths on 'nix-store.geninf.io:50051' failed: error: unable to download 'https://cache.clan.lol/pwbkrl17x6f8a9c4pvi6hbgarah380bv.narinfo': HTTP error 503

                     response body:

                     <?xml version="1.0" encoding="UTF-8" standalone="yes"?>
                     <Error>
                         <Code>SlowDown</Code>
                         <Message>Your account has made too many requests; try again later.</Message>
                     </Error>
failed checks.x86_64-linux.clan-test-iso 1m 8s
setup: don't know how to build these paths: /nix/store/k4bzgp7iz351hx3rgy0yvv9gm45ayh4a-container-test-run-clan-test-iso.drv warning: ignoring the client-spec …
setup:
don't know how to build these paths:
  /nix/store/k4bzgp7iz351hx3rgy0yvv9gm45ayh4a-container-test-run-clan-test-iso.drv
warning: ignoring the client-specified setting 'store', because it is a restricted setting and you are not a trusted user
error: gRPC QueryValidPaths on 'nix-store.geninf.io:50051' failed: error: unable to download 'https://cache.geninf.io/1gxs12k2fvhdm9iraqb9slvww30ykdq4.narinfo': HTTP error 503

              response body:

              <?xml version="1.0" encoding="UTF-8" standalone="yes"?>
              <Error>
                  <Code>SlowDown</Code>
                  <Message>Your account has made too many requests; try again later.</Message>
              </Error>
failed checks.x86_64-linux.clan-test-update 2m 27s
setup: don't know how to build these paths: /nix/store/p3kahkmiml70xk10zymva97yqpgb26lr-container-test-run-clan-test-update.drv warning: ignoring the client-s …
setup:
don't know how to build these paths:
  /nix/store/p3kahkmiml70xk10zymva97yqpgb26lr-container-test-run-clan-test-update.drv
warning: ignoring the client-specified setting 'store', because it is a restricted setting and you are not a trusted user
error: gRPC QueryValidPaths on 'nix-store.geninf.io:50051' failed: error: unable to download 'https://cache.clan.lol/agvykhllgvibnb4kx36dkpaa9w55yvbl.narinfo': HTTP error 503

              response body:

              <?xml version="1.0" encoding="UTF-8" standalone="yes"?>
              <Error>
                  <Code>SlowDown</Code>
                  <Message>Your account has made too many requests; try again later.</Message>
              </Error>
failed checks.x86_64-linux.darwin-test-darwin-machine 1m 14s
setup: don't know how to build these paths: /nix/store/30s2h5rahc5lpqixa852igy5xfwrr5n5-darwin-system-26.05.c3e90c8.drv warning: ignoring the client-specified …
setup:
don't know how to build these paths:
  /nix/store/30s2h5rahc5lpqixa852igy5xfwrr5n5-darwin-system-26.05.c3e90c8.drv
warning: ignoring the client-specified setting 'store', because it is a restricted setting and you are not a trusted user
30s2h5rahc5lpqixa852igy5xfwrr5n5-darwin-system-26.05.c3e90c8.drv: error: gRPC QueryValidPaths on 'nix-store.geninf.io:50051' failed: error: unable to download 'https://cache.clan.lol/5grc3iamc6b1lrkny0wrp9casq9m77kh.narinfo': HTTP error 503

              response body:

              <?xml version="1.0" encoding="UTF-8" standalone="yes"?>
              <Error>
                  <Code>SlowDown</Code>
                  <Message>Your account has made too many requests; try again later.</Message>
              </Error>
error: error: gRPC QueryValidPaths on 'nix-store.geninf.io:50051' failed: error: unable to download 'https://cache.clan.lol/5grc3iamc6b1lrkny0wrp9casq9m77kh.narinfo': HTTP error 503

                     response body:

                     <?xml version="1.0" encoding="UTF-8" standalone="yes"?>
                     <Error>
                         <Code>SlowDown</Code>
                         <Message>Your account has made too many requests; try again later.</Message>
                     </Error>
failed checks.x86_64-linux.data-mesher 3m 13s
setup: this path will be fetched (0.0 KiB download, 0.1 KiB unpacked): /nix/store/30j44wi0nn64dhl8pp8s7acbnzajsjnm-container-test-run-data-mesher warning: ign …
setup:
this path will be fetched (0.0 KiB download, 0.1 KiB unpacked):
  /nix/store/30j44wi0nn64dhl8pp8s7acbnzajsjnm-container-test-run-data-mesher
warning: ignoring the client-specified setting 'store', because it is a restricted setting and you are not a trusted user
error: gRPC QueryValidPaths on 'nix-store.geninf.io:50051' failed: error: unable to download 'https://cache.geninf.io/9zmla8z6w146x908zzhjk9mcbjln9mk1.narinfo': HTTP error 503

              response body:

              <?xml version="1.0" encoding="UTF-8" standalone="yes"?>
              <Error>
                  <Code>SlowDown</Code>
                  <Message>Your account has made too many requests; try again later.</Message>
              </Error>
failed checks.x86_64-linux.devshell 11m 33s
setup: lns84jglc84zh81bpsbshn9yd3w22lx8-check-devshell-not-depends-on-clan-cli.drv: gi-build-x86-02: gi-build-x86-02: input not substitutable: error: path '/nix …
setup:
lns84jglc84zh81bpsbshn9yd3w22lx8-check-devshell-not-depends-on-clan-cli.drv: gi-build-x86-02: gi-build-x86-02: input not substitutable: error: path '/nix/store/ndxzmd7bfkhbf5njqv5q9j2w202z19gn-clan' is required, but there is no substituter that can build it, asking the scheduler again
lns84jglc84zh81bpsbshn9yd3w22lx8-check-devshell-not-depends-on-clan-cli.drv: gi-build-x86-02: gi-build-x86-02: input not substitutable: error: path '/nix/store/ndxzmd7bfkhbf5njqv5q9j2w202z19gn-clan' is required, but there is no substituter that can build it, asking the scheduler again
lns84jglc84zh81bpsbshn9yd3w22lx8-check-devshell-not-depends-on-clan-cli.drv: gi-build-x86-02: gi-build-x86-02: input not substitutable: error: path '/nix/store/ndxzmd7bfkhbf5njqv5q9j2w202z19gn-clan' is required, but there is no substituter that can build it, asking the scheduler again
lns84jglc84zh81bpsbshn9yd3w22lx8-check-devshell-not-depends-on-clan-cli.drv: gi-build-x86-02: gi-build-x86-02: input not substitutable: error: path '/nix/store/ndxzmd7bfkhbf5njqv5q9j2w202z19gn-clan' is required, but there is no substituter that can build it, asking the scheduler again
lns84jglc84zh81bpsbshn9yd3w22lx8-check-devshell-not-depends-on-clan-cli.drv: gi-build-x86-02: gi-build-x86-02: input not substitutable: error: path '/nix/store/ndxzmd7bfkhbf5njqv5q9j2w202z19gn-clan' is required, but there is no substituter that can build it, asking the scheduler again
lns84jglc84zh81bpsbshn9yd3w22lx8-check-devshell-not-depends-on-clan-cli.drv: gi-build-x86-02: gi-build-x86-02: input not substitutable: error: path '/nix/store/ndxzmd7bfkhbf5njqv5q9j2w202z19gn-clan' is required, but there is no substituter that can build it, asking the scheduler again
lns84jglc84zh81bpsbshn9yd3w22lx8-check-devshell-not-depends-on-clan-cli.drv: gi-build-x86-02: gi-build-x86-02: input not substitutable: error: path '/nix/store/ndxzmd7bfkhbf5njqv5q9j2w202z19gn-clan' is required, but there is no substituter that can build it, asking the scheduler again
error: gave up after 9 reschedules
failed checks.x86_64-linux.devShell-clan-app 11m 29s
setup: qh2mlh6dcxh613vxxn1nmjwvqdg9wls4-ui.drv: gi-build-x86-02: gi-build-x86-02: input not substitutable: error: path '/nix/store/6v4s8awvp8bk37qlk1y1ypms3apw3 …
setup:
qh2mlh6dcxh613vxxn1nmjwvqdg9wls4-ui.drv: gi-build-x86-02: gi-build-x86-02: input not substitutable: error: path '/nix/store/6v4s8awvp8bk37qlk1y1ypms3apw3z7p-playwright-browsers' is required, but there is no substituter that can build it, asking the scheduler again
qh2mlh6dcxh613vxxn1nmjwvqdg9wls4-ui.drv: build-x86-01: build-x86-01: input not substitutable: error: path '/nix/store/6v4s8awvp8bk37qlk1y1ypms3apw3z7p-playwright-browsers' is required, but there is no substituter that can build it, asking the scheduler again
qh2mlh6dcxh613vxxn1nmjwvqdg9wls4-ui.drv: build-x86-01: build-x86-01: input not substitutable: error: path '/nix/store/6v4s8awvp8bk37qlk1y1ypms3apw3z7p-playwright-browsers' is required, but there is no substituter that can build it, asking the scheduler again
qh2mlh6dcxh613vxxn1nmjwvqdg9wls4-ui.drv: build-x86-01: build-x86-01: input not substitutable: error: path '/nix/store/6v4s8awvp8bk37qlk1y1ypms3apw3z7p-playwright-browsers' is required, but there is no substituter that can build it, asking the scheduler again
qh2mlh6dcxh613vxxn1nmjwvqdg9wls4-ui.drv: build-x86-01: build-x86-01: input not substitutable: error: path '/nix/store/6v4s8awvp8bk37qlk1y1ypms3apw3z7p-playwright-browsers' is required, but there is no substituter that can build it, asking the scheduler again
qh2mlh6dcxh613vxxn1nmjwvqdg9wls4-ui.drv: build-x86-01: build-x86-01: input not substitutable: error: path '/nix/store/6v4s8awvp8bk37qlk1y1ypms3apw3z7p-playwright-browsers' is required, but there is no substituter that can build it, asking the scheduler again
qh2mlh6dcxh613vxxn1nmjwvqdg9wls4-ui.drv: build-x86-01: build-x86-01: input not substitutable: error: path '/nix/store/6v4s8awvp8bk37qlk1y1ypms3apw3z7p-playwright-browsers' is required, but there is no substituter that can build it, asking the scheduler again
error: gave up after 9 reschedules
failed checks.x86_64-linux.devShell-clan-site 7m 56s
setup: don't know how to build these paths: /nix/store/nwp59pk6yan587dc8bghvr3a1rxw8x5i-nix-shell.drv warning: ignoring the client-specified setting 'store', …
setup:
don't know how to build these paths:
  /nix/store/nwp59pk6yan587dc8bghvr3a1rxw8x5i-nix-shell.drv
warning: ignoring the client-specified setting 'store', because it is a restricted setting and you are not a trusted user
error: gRPC QueryValidPaths on 'nix-store.geninf.io:50051' failed: error: unable to download 'https://cache.clan.lol/n0z1pa3sqx556bfdw22gi4pqfx1pqlb3.narinfo': HTTP error 503

              response body:

              <?xml version="1.0" encoding="UTF-8" standalone="yes"?>
              <Error>
                  <Code>SlowDown</Code>
                  <Message>Your account has made too many requests; try again later.</Message>
              </Error>
failed checks.x86_64-linux.devShell-default 7m 25s
setup: this path will be fetched (0.0 KiB download, 13.7 KiB unpacked): /nix/store/ndxzmd7bfkhbf5njqv5q9j2w202z19gn-clan warning: ignoring the client-specifie …
setup:
this path will be fetched (0.0 KiB download, 13.7 KiB unpacked):
  /nix/store/ndxzmd7bfkhbf5njqv5q9j2w202z19gn-clan
warning: ignoring the client-specified setting 'store', because it is a restricted setting and you are not a trusted user
error: gRPC QueryValidPaths on 'nix-store.geninf.io:50051' failed: error: substituter 'https://cache.clan.lol' is disabled
failed checks.x86_64-linux.devShell-docs 2m 34s
setup: don't know how to build these paths: /nix/store/p5q1xmfayqriydbf7nds5iyhab1y17ab-nix-shell.drv warning: ignoring the client-specified setting 'store', …
setup:
don't know how to build these paths:
  /nix/store/p5q1xmfayqriydbf7nds5iyhab1y17ab-nix-shell.drv
warning: ignoring the client-specified setting 'store', because it is a restricted setting and you are not a trusted user
error: gRPC QueryValidPaths on 'nix-store.geninf.io:50051' failed: error: unable to download 'https://cache.clan.lol/7cf1y1mnch2km4jdixc7dl55aqz27g87.narinfo': HTTP error 503

              response body:

              <?xml version="1.0" encoding="UTF-8" standalone="yes"?>
              <Error>
                  <Code>SlowDown</Code>
                  <Message>Your account has made too many requests; try again later.</Message>
              </Error>
failed checks.x86_64-linux.devShell-inventory-schema 2m 9s
setup: don't know how to build these paths: /nix/store/2qqi9blw8jhr76lwhnx6q7dvx9ni89zy-clan-inventory-schema.drv warning: ignoring the client-specified setti …
setup:
don't know how to build these paths:
  /nix/store/2qqi9blw8jhr76lwhnx6q7dvx9ni89zy-clan-inventory-schema.drv
warning: ignoring the client-specified setting 'store', because it is a restricted setting and you are not a trusted user
error: gRPC QueryValidPaths on 'nix-store.geninf.io:50051' failed: error: unable to download 'https://cache.clan.lol/ppkgx8584afa7174lvd46dm8mypsyywp.narinfo': HTTP error 503

              response body:

              <?xml version="1.0" encoding="UTF-8" standalone="yes"?>
              <Error>
                  <Code>SlowDown</Code>
                  <Message>Your account has made too many requests; try again later.</Message>
              </Error>
failed checks.x86_64-linux.garage 3m 50s
setup: don't know how to build these paths: /nix/store/qimzswljbajmpm0m8ggh598w1p2whdkm-container-test-run-garage.drv warning: ignoring the client-specified s …
setup:
don't know how to build these paths:
  /nix/store/qimzswljbajmpm0m8ggh598w1p2whdkm-container-test-run-garage.drv
warning: ignoring the client-specified setting 'store', because it is a restricted setting and you are not a trusted user
error: gRPC QueryValidPaths on 'nix-store.geninf.io:50051' failed: error: substituter 'https://cache.clan.lol' is disabled
failed checks.x86_64-linux.hello-service 1m 53s
setup: don't know how to build these paths: /nix/store/pblrmizilxki5sc7aas8aa3sfavxaiyc-container-test-run-hello-service.drv warning: ignoring the client-spec …
setup:
don't know how to build these paths:
  /nix/store/pblrmizilxki5sc7aas8aa3sfavxaiyc-container-test-run-hello-service.drv
warning: ignoring the client-specified setting 'store', because it is a restricted setting and you are not a trusted user
error: gRPC QueryValidPaths on 'nix-store.geninf.io:50051' failed: error: unable to download 'https://cache.clan.lol/88w3am4rj4x91a9gykb2bn2ix1hv538b.narinfo': HTTP error 503

              response body:

              <?xml version="1.0" encoding="UTF-8" standalone="yes"?>
              <Error>
                  <Code>SlowDown</Code>
                  <Message>Your account has made too many requests; try again later.</Message>
              </Error>
failed checks.x86_64-linux.inventory-classes-up-to-date 2m 32s
setup: don't know how to build these paths: /nix/store/21pwjglm6cdld16axmbnd979wnvf5d0y-inventory-classes-up-to-date.drv warning: ignoring the client-specifie …
setup:
don't know how to build these paths:
  /nix/store/21pwjglm6cdld16axmbnd979wnvf5d0y-inventory-classes-up-to-date.drv
warning: ignoring the client-specified setting 'store', because it is a restricted setting and you are not a trusted user
error: gRPC QueryValidPaths on 'nix-store.geninf.io:50051' failed: error: unable to download 'https://cache.geninf.io/h1rjf3j9mc7jy5i3lamyz99qs85d8zlb.narinfo': HTTP error 503

              response body:

              <?xml version="1.0" encoding="UTF-8" standalone="yes"?>
              <Error>
                  <Code>SlowDown</Code>
                  <Message>Your account has made too many requests; try again later.</Message>
              </Error>
failed checks.x86_64-linux.kde 2m 4s
setup: don't know how to build these paths: /nix/store/mv925118gg0a51fr90q927aiyia8sppq-container-test-run-kde.drv warning: ignoring the client-specified sett …
setup:
don't know how to build these paths:
  /nix/store/mv925118gg0a51fr90q927aiyia8sppq-container-test-run-kde.drv
warning: ignoring the client-specified setting 'store', because it is a restricted setting and you are not a trusted user
error: gRPC QueryValidPaths on 'nix-store.geninf.io:50051' failed: error: unable to download 'https://cache.clan.lol/42b31cnlbavv6yw976l24xfnbfd81ydd.narinfo': HTTP error 503

              response body:

              <?xml version="1.0" encoding="UTF-8" standalone="yes"?>
              <Error>
                  <Code>SlowDown</Code>
                  <Message>Your account has made too many requests; try again later.</Message>
              </Error>
failed checks.x86_64-linux.matrix-synapse 2m 41s
setup: don't know how to build these paths: /nix/store/xx3lgrk756nap8ighiv3dny2jj7l42aj-container-test-run-matrix-synapse.drv warning: ignoring the client-spe …
setup:
don't know how to build these paths:
  /nix/store/xx3lgrk756nap8ighiv3dny2jj7l42aj-container-test-run-matrix-synapse.drv
warning: ignoring the client-specified setting 'store', because it is a restricted setting and you are not a trusted user
error: gRPC QueryValidPaths on 'nix-store.geninf.io:50051' failed: error: unable to download 'https://cache.geninf.io/7x6s2dlwrcfjjramy05hgapfvb5w0i02.narinfo': HTTP error 503

              response body:

              <?xml version="1.0" encoding="UTF-8" standalone="yes"?>
              <Error>
                  <Code>SlowDown</Code>
                  <Message>Your account has made too many requests; try again later.</Message>
              </Error>
failed checks.x86_64-linux.monitoring 3m 2s
setup: warning: ignoring the client-specified setting 'store', because it is a restricted setting and you are not a trusted user error: gRPC QueryValidPaths on …
setup:
warning: ignoring the client-specified setting 'store', because it is a restricted setting and you are not a trusted user
error: gRPC QueryValidPaths on 'nix-store.geninf.io:50051' failed: error: unable to download 'https://cache.clan.lol/an4xplpjgb09gx57m460gdzibjlxn8yw.narinfo': HTTP error 503

              response body:

              <?xml version="1.0" encoding="UTF-8" standalone="yes"?>
              <Error>
                  <Code>SlowDown</Code>
                  <Message>Your account has made too many requests; try again later.</Message>
              </Error>
failed checks.x86_64-linux.nixos-documentation 30s
setup: don't know how to build these paths: /nix/store/aaq8qkdkgldqv920g0xral6pf5l0pm3q-nixos-system-test-documentation-26.05.20260921.1e8bc65.drv warning: ig …
setup:
don't know how to build these paths:
  /nix/store/aaq8qkdkgldqv920g0xral6pf5l0pm3q-nixos-system-test-documentation-26.05.20260921.1e8bc65.drv
warning: ignoring the client-specified setting 'store', because it is a restricted setting and you are not a trusted user
error: gRPC QueryValidPaths on 'nix-store.geninf.io:50051' failed: error: unable to download 'https://cache.clan.lol/2kgmb4ym1nq6zl4bx125nphn5gnn9hqg.narinfo': HTTP error 503

              response body:

              <?xml version="1.0" encoding="UTF-8" standalone="yes"?>
              <Error>
                  <Code>SlowDown</Code>
                  <Message>Your account has made too many requests; try again later.</Message>
              </Error>
failed checks.x86_64-linux.nixos-flash-installer 1m 44s
setup: don't know how to build these paths: /nix/store/3aca6nssr5wfdpbpi7q8m7s56rr3hp7k-nixos-system-flash-installer-26.05.20260921.1e8bc65.drv warning: ignor …
setup:
don't know how to build these paths:
  /nix/store/3aca6nssr5wfdpbpi7q8m7s56rr3hp7k-nixos-system-flash-installer-26.05.20260921.1e8bc65.drv
warning: ignoring the client-specified setting 'store', because it is a restricted setting and you are not a trusted user
error: gRPC QueryValidPaths on 'nix-store.geninf.io:50051' failed: error: unable to download 'https://cache.clan.lol/ladc5a2dpp464jvkksfynmymf5f1bgzi.narinfo': HTTP error 503

              response body:

              <?xml version="1.0" encoding="UTF-8" standalone="yes"?>
              <Error>
                  <Code>SlowDown</Code>
                  <Message>Your account has made too many requests; try again later.</Message>
              </Error>
failed checks.x86_64-linux.nixos-test-container 1m 1s
setup: don't know how to build these paths: /nix/store/1vp7iygydv1g5vmmh5hp7km23zqgaxza-container-test-run-container.drv warning: ignoring the client-specifie …
setup:
don't know how to build these paths:
  /nix/store/1vp7iygydv1g5vmmh5hp7km23zqgaxza-container-test-run-container.drv
warning: ignoring the client-specified setting 'store', because it is a restricted setting and you are not a trusted user
error: gRPC QueryValidPaths on 'nix-store.geninf.io:50051' failed: error: unable to download 'https://cache.geninf.io/iv1xb6ipp9rlms2s004b41xnjm6xpk4g.narinfo': HTTP error 503

              response body:

              <?xml version="1.0" encoding="UTF-8" standalone="yes"?>
              <Error>
                  <Code>SlowDown</Code>
                  <Message>Your account has made too many requests; try again later.</Message>
              </Error>
failed checks.x86_64-linux.nixos-test-extra-python-packages 10m 36s
setup: this path will be fetched (0.0 KiB download, 0.1 KiB unpacked): /nix/store/843vpi5mr91c53w7h2rx9gg0q0gkadhf-container-test-run-test-extra-python-packag …
setup:
this path will be fetched (0.0 KiB download, 0.1 KiB unpacked):
  /nix/store/843vpi5mr91c53w7h2rx9gg0q0gkadhf-container-test-run-test-extra-python-packages
warning: ignoring the client-specified setting 'store', because it is a restricted setting and you are not a trusted user
afh01b5pmykv1g1d7qbq0f0b9i1j6hd5-dry-activate.drv: error: gRPC QueryValidPaths on 'nix-store.geninf.io:50051' failed: error: substituter 'https://cache.clan.lol' is disabled
mm7v004jbivgqwgw5j4z4r7qrg6m2m87-system-path.drv: error: gRPC QueryValidPaths on 'nix-store.geninf.io:50051' failed: error: substituter 'https://cache.clan.lol' is disabled
error: dependency '3d6dsfhs7p1czdxm7qznk3pqvl9r935b-nixos-test-driver-test-extra-python-packages.drv' failed
failed checks.x86_64-linux.nixos-test-flash 1m 31s
setup: warning: ignoring the client-specified setting 'store', because it is a restricted setting and you are not a trusted user error: gRPC QueryValidPaths on …
setup:
warning: ignoring the client-specified setting 'store', because it is a restricted setting and you are not a trusted user
error: gRPC QueryValidPaths on 'nix-store.geninf.io:50051' failed: error: unable to download 'https://cache.geninf.io/5iz1mlhijqs0g7idbw3iwl8hahn8g5sa.narinfo': HTTP error 503

              response body:

              <?xml version="1.0" encoding="UTF-8" standalone="yes"?>
              <Error>
                  <Code>SlowDown</Code>
                  <Message>Your account has made too many requests; try again later.</Message>
              </Error>
failed checks.x86_64-linux.nixos-test-flash-installer-boot 3m 34s
setup: don't know how to build these paths: /nix/store/5axc40m16qsgc7n723qrnsq9d3w3fvmw-vm-test-run-flash-installer-boot.drv warning: ignoring the client-spec …
setup:
don't know how to build these paths:
  /nix/store/5axc40m16qsgc7n723qrnsq9d3w3fvmw-vm-test-run-flash-installer-boot.drv
warning: ignoring the client-specified setting 'store', because it is a restricted setting and you are not a trusted user
error: gRPC QueryValidPaths on 'nix-store.geninf.io:50051' failed: error: unable to download 'https://cache.geninf.io/adbap8j4bcm9vcbabr2lya19098hmzvj.narinfo': HTTP error 503

              response body:

              <?xml version="1.0" encoding="UTF-8" standalone="yes"?>
              <Error>
                  <Code>SlowDown</Code>
                  <Message>Your account has made too many requests; try again later.</Message>
              </Error>
failed checks.x86_64-linux.nixos-test-installation 2m 37s
setup: don't know how to build these paths: /nix/store/7z0qqydaxpb59m4il2ilwgilrqb6yz8q-vm-test-run-installation.drv warning: ignoring the client-specified se …
setup:
don't know how to build these paths:
  /nix/store/7z0qqydaxpb59m4il2ilwgilrqb6yz8q-vm-test-run-installation.drv
warning: ignoring the client-specified setting 'store', because it is a restricted setting and you are not a trusted user
error: gRPC QueryValidPaths on 'nix-store.geninf.io:50051' failed: error: unable to download 'https://cache.clan.lol/6wb884wyxrzxp3ys6903cjlpz870hhk1.narinfo': HTTP error 503

              response body:

              <?xml version="1.0" encoding="UTF-8" standalone="yes"?>
              <Error>
                  <Code>SlowDown</Code>
                  <Message>Your account has made too many requests; try again later.</Message>
              </Error>
failed checks.x86_64-linux.nixos-test-installation-age 10m 6s
setup: don't know how to build these paths: /nix/store/363wxlgsd15pxjydip3bj12aqpqm1mzk-vm-test-run-installation.drv warning: ignoring the client-specified se …
setup:
don't know how to build these paths:
  /nix/store/363wxlgsd15pxjydip3bj12aqpqm1mzk-vm-test-run-installation.drv
warning: ignoring the client-specified setting 'store', because it is a restricted setting and you are not a trusted user
hanynij6nimh431x0cfh9sggk02jgn78-unit-dbus-broker.service.drv: error: gRPC QueryValidPaths on 'nix-store.geninf.io:50051' failed: error: substituter 'https://cache.clan.lol' is disabled
6r6ahyx7x0ldgdh2ilikkxlrd2fgj880-test-script.drv: error: gRPC QueryValidPaths on 'nix-store.geninf.io:50051' failed: error: substituter 'https://cache.clan.lol' is disabled
error: dependency '0c1lh1f09whvc8wx59bm5n58p7ynd7h5-nixos-test-driver-installation.drv' failed
failed checks.x86_64-linux.nixos-test-installation-password-store 3m 25s
setup: don't know how to build these paths: /nix/store/hmb0r8xhal8s452hjkdl70mff5ikg3gx-vm-test-run-installation.drv warning: ignoring the client-specified se …
setup:
don't know how to build these paths:
  /nix/store/hmb0r8xhal8s452hjkdl70mff5ikg3gx-vm-test-run-installation.drv
warning: ignoring the client-specified setting 'store', because it is a restricted setting and you are not a trusted user
error: gRPC QueryValidPaths on 'nix-store.geninf.io:50051' failed: error: unable to download 'https://cache.geninf.io/36zaw09xlbncv3ffb1n5bsqssjbl04v0.narinfo': HTTP error 503

              response body:

              <?xml version="1.0" encoding="UTF-8" standalone="yes"?>
              <Error>
                  <Code>SlowDown</Code>
                  <Message>Your account has made too many requests; try again later.</Message>
              </Error>
failed checks.x86_64-linux.nixos-test-password-store-mounts 10m 36s
setup: this path will be fetched (0.0 KiB download, 0.1 KiB unpacked): /nix/store/w5k8fczkhdrm9fm6r8mz8ickrjq83yiq-vm-test-run-nixos-test-password-store-mount …
setup:
this path will be fetched (0.0 KiB download, 0.1 KiB unpacked):
  /nix/store/w5k8fczkhdrm9fm6r8mz8ickrjq83yiq-vm-test-run-nixos-test-password-store-mounts
warning: ignoring the client-specified setting 'store', because it is a restricted setting and you are not a trusted user
qx6blkxwvvxx0c03z3hx9phi5ncqfjbx-system-units.drv: error: gRPC QueryValidPaths on 'nix-store.geninf.io:50051' failed: error: substituter 'https://cache.clan.lol' is disabled
error: dependency 'lfbkv9qcmqzsk9qw04bq63vfr1vn4dgx-nixos-test-driver-nixos-test-password-store-mounts.drv' failed
failed checks.x86_64-linux.nixos-test-secrets 10m 54s
setup: 8s1sqhxw2cgbgy9cqihhdrjjncx4q078-sops-install-secrets-0.0.1.drv: gi-build-x86-02: gi-build-x86-02: input not substitutable: error: path '/nix/store/hn9wc …
setup:
8s1sqhxw2cgbgy9cqihhdrjjncx4q078-sops-install-secrets-0.0.1.drv: gi-build-x86-02: gi-build-x86-02: input not substitutable: error: path '/nix/store/hn9wcixixbixw05zyvc9iaqr0lnq9bpv-sops-install-secrets-0.0.1-go-modules' is required, but there is no substituter that can build it, asking the scheduler again
8s1sqhxw2cgbgy9cqihhdrjjncx4q078-sops-install-secrets-0.0.1.drv: build-x86-01: build-x86-01: input not substitutable: error: path '/nix/store/hn9wcixixbixw05zyvc9iaqr0lnq9bpv-sops-install-secrets-0.0.1-go-modules' is required, but there is no substituter that can build it, asking the scheduler again
8s1sqhxw2cgbgy9cqihhdrjjncx4q078-sops-install-secrets-0.0.1.drv: build-x86-01: build-x86-01: input not substitutable: error: path '/nix/store/hn9wcixixbixw05zyvc9iaqr0lnq9bpv-sops-install-secrets-0.0.1-go-modules' is required, but there is no substituter that can build it, asking the scheduler again
8s1sqhxw2cgbgy9cqihhdrjjncx4q078-sops-install-secrets-0.0.1.drv: gi-build-x86-02: gi-build-x86-02: input not substitutable: error: path '/nix/store/hn9wcixixbixw05zyvc9iaqr0lnq9bpv-sops-install-secrets-0.0.1-go-modules' is required, but there is no substituter that can build it, asking the scheduler again
8s1sqhxw2cgbgy9cqihhdrjjncx4q078-sops-install-secrets-0.0.1.drv: gi-build-x86-02: gi-build-x86-02: input not substitutable: error: path '/nix/store/hn9wcixixbixw05zyvc9iaqr0lnq9bpv-sops-install-secrets-0.0.1-go-modules' is required, but there is no substituter that can build it, asking the scheduler again
8s1sqhxw2cgbgy9cqihhdrjjncx4q078-sops-install-secrets-0.0.1.drv: gi-build-x86-02: gi-build-x86-02: input not substitutable: error: path '/nix/store/hn9wcixixbixw05zyvc9iaqr0lnq9bpv-sops-install-secrets-0.0.1-go-modules' is required, but there is no substituter that can build it, asking the scheduler again
8s1sqhxw2cgbgy9cqihhdrjjncx4q078-sops-install-secrets-0.0.1.drv: gi-build-x86-02: gi-build-x86-02: input not substitutable: error: path '/nix/store/hn9wcixixbixw05zyvc9iaqr0lnq9bpv-sops-install-secrets-0.0.1-go-modules' is required, but there is no substituter that can build it, asking the scheduler again
error: dependency '3qj9a7pnz2zcwsy3f6zfni3pbzw1ha45-nixos-test-driver-secrets.drv' failed
failed checks.x86_64-linux.nixos-test-update-hardware-configuration 4m 35s
setup: don't know how to build these paths: /nix/store/kkdh37m4kj6kh4cs7bvznjkw9s3n49an-vm-test-run-update-hardware-configuration.drv warning: ignoring the cl …
setup:
don't know how to build these paths:
  /nix/store/kkdh37m4kj6kh4cs7bvznjkw9s3n49an-vm-test-run-update-hardware-configuration.drv
warning: ignoring the client-specified setting 'store', because it is a restricted setting and you are not a trusted user
error: gRPC QueryValidPaths on 'nix-store.geninf.io:50051' failed: error: unable to download 'https://cache.clan.lol/2cqzpma07n0gx3a1xhaz4nr5dwx047gq.narinfo': HTTP error 503

              response body:

              <?xml version="1.0" encoding="UTF-8" standalone="yes"?>
              <Error>
                  <Code>SlowDown</Code>
                  <Message>Your account has made too many requests; try again later.</Message>
              </Error>
failed checks.x86_64-linux.nixos-test-wayland-proxy-virtwl 5m 14s
setup: this path will be fetched (0.0 KiB download, 0.1 KiB unpacked): /nix/store/b2ijaf0jhj4aqajy03j525ba7ipbzgf7-vm-test-run-wayland-proxy-virtwl warning: i …
setup:
this path will be fetched (0.0 KiB download, 0.1 KiB unpacked):
  /nix/store/b2ijaf0jhj4aqajy03j525ba7ipbzgf7-vm-test-run-wayland-proxy-virtwl
warning: ignoring the client-specified setting 'store', because it is a restricted setting and you are not a trusted user
error: gRPC QueryValidPaths on 'nix-store.geninf.io:50051' failed: error: unable to download 'https://cache.geninf.io/6r54hmqy74l462720w64alh2y66smdq2.narinfo': HTTP error 503

              response body:

              <?xml version="1.0" encoding="UTF-8" standalone="yes"?>
              <Error>
                  <Code>SlowDown</Code>
                  <Message>Your account has made too many requests; try again later.</Message>
              </Error>
failed checks.x86_64-linux.service-dummy-test 3m 43s
setup: this path will be fetched (0.0 KiB download, 0.1 KiB unpacked): /nix/store/ynl054zl67yc36rah23j00mnh26s3n8i-container-test-run-service-dummy-test warni …
setup:
this path will be fetched (0.0 KiB download, 0.1 KiB unpacked):
  /nix/store/ynl054zl67yc36rah23j00mnh26s3n8i-container-test-run-service-dummy-test
warning: ignoring the client-specified setting 'store', because it is a restricted setting and you are not a trusted user
error: gRPC QueryValidPaths on 'nix-store.geninf.io:50051' failed: error: unable to download 'https://cache.geninf.io/f4gcj9jrcry656pn6jr1b1dw3q65z7wz.narinfo': HTTP error 503

              response body:

              <?xml version="1.0" encoding="UTF-8" standalone="yes"?>
              <Error>
                  <Code>SlowDown</Code>
                  <Message>Your account has made too many requests; try again later.</Message>
              </Error>
failed checks.x86_64-linux.service-dummy-test-from-flake 5m 51s
setup: don't know how to build these paths: /nix/store/qszm99y1zi4facx0pm8h0i73kvr1nwrl-container-test-run-service-dummy-test-from-flake.drv warning: ignoring …
setup:
don't know how to build these paths:
  /nix/store/qszm99y1zi4facx0pm8h0i73kvr1nwrl-container-test-run-service-dummy-test-from-flake.drv
warning: ignoring the client-specified setting 'store', because it is a restricted setting and you are not a trusted user
error: gRPC QueryValidPaths on 'nix-store.geninf.io:50051' failed: error: unable to download 'https://cache.clan.lol/01ydicsdv1aa8pw04iagfifakbb0anac.narinfo': HTTP error 503

              response body:

              <?xml version="1.0" encoding="UTF-8" standalone="yes"?>
              <Error>
                  <Code>SlowDown</Code>
                  <Message>Your account has made too many requests; try again later.</Message>
              </Error>
failed checks.x86_64-linux.sshd-no-ca 6m 56s
setup: this path will be fetched (0.0 KiB download, 0.1 KiB unpacked): /nix/store/whmpf2wvz7bs13jkw2pgsblhsrx62ax6-container-test-run-sshd warning: ignoring t …
setup:
this path will be fetched (0.0 KiB download, 0.1 KiB unpacked):
  /nix/store/whmpf2wvz7bs13jkw2pgsblhsrx62ax6-container-test-run-sshd
warning: ignoring the client-specified setting 'store', because it is a restricted setting and you are not a trusted user
error: gRPC QueryValidPaths on 'nix-store.geninf.io:50051' failed: error: unable to download 'https://cache.clan.lol/raf5jj5f64sd2k6062q9lqckvb9gi4vz.narinfo': HTTP error 503

              response body:

              <?xml version="1.0" encoding="UTF-8" standalone="yes"?>
              <Error>
                  <Code>SlowDown</Code>
                  <Message>Your account has made too many requests; try again later.</Message>
              </Error>
failed checks.x86_64-linux.state-version 4m 0s
setup: don't know how to build these paths: /nix/store/3sn2qxh37zpdml3ga6njz7k0sd2kqcjv-container-test-run-service-state-version.drv warning: ignoring the cli …
setup:
don't know how to build these paths:
  /nix/store/3sn2qxh37zpdml3ga6njz7k0sd2kqcjv-container-test-run-service-state-version.drv
warning: ignoring the client-specified setting 'store', because it is a restricted setting and you are not a trusted user
error: gRPC QueryValidPaths on 'nix-store.geninf.io:50051' failed: error: unable to download 'https://cache.clan.lol/3g6wfjcvf5rhxmf0n8sb1xpk3yxprsgs.narinfo': HTTP error 503

              response body:

              <?xml version="1.0" encoding="UTF-8" standalone="yes"?>
              <Error>
                  <Code>SlowDown</Code>
                  <Message>Your account has made too many requests; try again later.</Message>
              </Error>
failed checks.x86_64-linux.template-minimal 8m 2s
setup: don't know how to build these paths: /nix/store/ka70823ig95lma3d4dq276lrzkwwd3vw-nixos-system-testmachine-26.05.20260921.1e8bc65.drv warning: ignoring …
setup:
don't know how to build these paths:
  /nix/store/ka70823ig95lma3d4dq276lrzkwwd3vw-nixos-system-testmachine-26.05.20260921.1e8bc65.drv
warning: ignoring the client-specified setting 'store', because it is a restricted setting and you are not a trusted user
error: gRPC QueryValidPaths on 'nix-store.geninf.io:50051' failed: error: unable to download 'https://cache.clan.lol/dygy9w5kqqijfq3zp7p8j0dmdk1bpd3l.narinfo': HTTP error 503

              response body:

              <?xml version="1.0" encoding="UTF-8" standalone="yes"?>
              <Error>
                  <Code>SlowDown</Code>
                  <Message>Your account has made too many requests; try again later.</Message>
              </Error>
failed checks.x86_64-linux.trusted-nix-caches 1m 13s
setup: this path will be fetched (0.0 KiB download, 0.1 KiB unpacked): /nix/store/ady93mq2ivdnrmiv4ajybgywi1lvsr4q-container-test-run-trusted-nix-caches warni …
setup:
this path will be fetched (0.0 KiB download, 0.1 KiB unpacked):
  /nix/store/ady93mq2ivdnrmiv4ajybgywi1lvsr4q-container-test-run-trusted-nix-caches
warning: ignoring the client-specified setting 'store', because it is a restricted setting and you are not a trusted user
error: gRPC QueryValidPaths on 'nix-store.geninf.io:50051' failed: error: unable to download 'https://cache.clan.lol/zl7bqyqvr38jhqhmypsgs7lzm5s8489d.narinfo': HTTP error 503

              response body:

              <?xml version="1.0" encoding="UTF-8" standalone="yes"?>
              <Error>
                  <Code>SlowDown</Code>
                  <Message>Your account has made too many requests; try again later.</Message>
              </Error>
failed checks.x86_64-linux.wifi 4m 50s
setup: don't know how to build these paths: /nix/store/p3m0fzjwmkmzhbglzxilyrqfr82vvydr-vm-test-run-wifi.drv warning: ignoring the client-specified setting 's …
setup:
don't know how to build these paths:
  /nix/store/p3m0fzjwmkmzhbglzxilyrqfr82vvydr-vm-test-run-wifi.drv
warning: ignoring the client-specified setting 'store', because it is a restricted setting and you are not a trusted user
error: gRPC QueryValidPaths on 'nix-store.geninf.io:50051' failed: error: unable to download 'https://cache.clan.lol/pa5qgx7yl9rdk2r9by16ag98bbddcp3v.narinfo': HTTP error 503

              response body:

              <?xml version="1.0" encoding="UTF-8" standalone="yes"?>
              <Error>
                  <Code>SlowDown</Code>
                  <Message>Your account has made too many requests; try again later.</Message>
              </Error>
failed checks.x86_64-linux.yggdrasil 8m 25s
vm-test-run-yggdrasil: File "/nix/store/5gla70yh1jf2h11bxm4w6ggkz5sxnn95-nixos-test-driver-1.1/lib/python3.13/site-packages/test_driver/driver.py", line 434, …
vm-test-run-yggdrasil:
  File "/nix/store/5gla70yh1jf2h11bxm4w6ggkz5sxnn95-nixos-test-driver-1.1/lib/python3.13/site-packages/test_driver/driver.py", line 434, in run_tests
    self.test_script()
    ~~~~~~~~~~~~~~~~^^
  File "/nix/store/5gla70yh1jf2h11bxm4w6ggkz5sxnn95-nixos-test-driver-1.1/lib/python3.13/site-packages/test_driver/driver.py", line 392, in test_script
    exec(self.tests, symbols, None)
    ~~~~^^^^^^^^^^^^^^^^^^^^^^^^^^^
  File "<string>", line 45, in <module>
AssertionError: peer1 runtime IP 200:831b:fc02:fab1:af5f:20a9:2ddb:446 != expected IP 200:afed:dc25:49ee:51c5:a18d:d964:3025
failed checks.x86_64-linux.zerotier 4m 11s
setup: don't know how to build these paths: /nix/store/k2fpn7xza2wvg3vb7ywm31hhg796rq8m-vm-test-run-zerotier.drv warning: ignoring the client-specified settin …
setup:
don't know how to build these paths:
  /nix/store/k2fpn7xza2wvg3vb7ywm31hhg796rq8m-vm-test-run-zerotier.drv
warning: ignoring the client-specified setting 'store', because it is a restricted setting and you are not a trusted user
error: gRPC QueryValidPaths on 'nix-store.geninf.io:50051' failed: error: unable to download 'https://cache.geninf.io/97h5ykg265vgl1y9mdkbarjr0281d5hh.narinfo': HTTP error 503

              response body:

              <?xml version="1.0" encoding="UTF-8" standalone="yes"?>
              <Error>
                  <Code>SlowDown</Code>
                  <Message>Your account has made too many requests; try again later.</Message>
              </Error>
38 succeeded
succeeded attributes
status attribute duration
loading…
9 already built
skipped attributes
status attribute duration
loading…